mesos-builds mailing list archives

Site index · List index
Message view « Date » · « Thread »
Top « Date » · « Thread »
From Anand Mazumdar <an...@mesosphere.io>
Subject Re: Build failed in Jenkins: mesos-reviewbot #14397
Date Thu, 21 Jul 2016 16:12:17 GMT
Shuai,

Can you help triage this test failure?

-anand

> On Jul 20, 2016, at 10:33 AM, Apache Jenkins Server <jenkins@builds.apache.org>
wrote:
> 
> See <https://builds.apache.org/job/mesos-reviewbot/14397/>
> 
> ------------------------------------------
> [...truncated 201264 lines...]
> I0720 17:32:50.965369 28486 slave.cpp:205] Agent started on 561)@172.17.0.2:50384
> I0720 17:32:50.965402 28486 slave.cpp:206] Flags at startup: --acls="" --appc_simple_discovery_uri_prefix="http://"
--appc_store_dir="/tmp/mesos/store/appc" --authenticate_http="true" --authenticatee="crammd5"
--authentication_backoff_factor="1secs" --authorizer="local" --cgroups_cpu_enable_pids_and_tids_count="false"
--cgroups_enable_cfs="false" --cgroups_hierarchy="/sys/fs/cgroup" --cgroups_limit_swap="false"
--cgroups_root="mesos" --container_disk_watch_interval="15secs" --containerizers="mesos" --credential="/tmp/Endpoint_SlaveEndpointTest_AuthorizedRequest_0_fZ1s1a/credential"
--default_role="*" --disk_watch_interval="1mins" --docker="docker" --docker_kill_orphans="true"
--docker_registry="https://registry-1.docker.io" --docker_remove_delay="6hrs" --docker_socket="/var/run/docker.sock"
--docker_stop_timeout="0ns" --docker_store_dir="/tmp/mesos/store/docker" --docker_volume_checkpoint_dir="/var/run/mesos/isolators/docker/volume"
--enforce_container_disk_quota="false" --executor_registration_timeout="1mins" --executor_shutdown_grace_period="5secs"
--fetcher_cache_dir="/tmp/Endpoint_SlaveEndpointTest_AuthorizedRequest_0_fZ1s1a/fetch" --fetcher_cache_size="2GB"
--frameworks_home="" --gc_delay="1weeks" --gc_disk_headroom="0.1" --hadoop_home="" --help="true"
--hostname_lookup="true" --http_authenticators="basic" --http_command_executor="false" --http_credentials="/tmp/Endpoint_SlaveEndpointTest_AuthorizedRequest_0_fZ1s1a/http_credentials"
--image_provisioner_backend="copy" --initialize_driver_logging="true" --isolation="posix/cpu,posix/mem"
--launcher_dir="/mesos/mesos-1.1.0/_build/src" --logbufsecs="0" --logging_level="INFO" --oversubscribed_resources_interval="15secs"
--perf_duration="10secs" --perf_interval="1mins" --qos_correction_interval_min="0ns" --quiet="false"
--recover="reconnect" --recovery_timeout="15mins" --registration_backoff_factor="10ms" --resources="cpus:2;gpus:0;mem:1024;disk:1024;ports:[31000-32000]"
--revocable_cpu_low_priority="true" --sandbox_directory="/mnt/mesos/sandbox" --strict="true"
--switch_user="true" --systemd_enable_support="true" --systemd_runtime_directory="/run/systemd/system"
--version="false" --work_dir="/tmp/Endpoint_SlaveEndpointTest_AuthorizedRequest_0_fZ1s1a"
> I0720 17:32:50.966245 28486 credentials.hpp:86] Loading credential for authentication
from '/tmp/Endpoint_SlaveEndpointTest_AuthorizedRequest_0_fZ1s1a/credential'
> I0720 17:32:50.966531 28486 slave.cpp:343] Agent using credential for: test-principal
> I0720 17:32:50.966578 28486 credentials.hpp:37] Loading credentials for authentication
from '/tmp/Endpoint_SlaveEndpointTest_AuthorizedRequest_0_fZ1s1a/http_credentials'
> I0720 17:32:50.966979 28486 slave.cpp:395] Using default 'basic' HTTP authenticator
> I0720 17:32:50.968325 28486 slave.cpp:594] Agent resources: cpus(*):2; mem(*):1024; disk(*):1024;
ports(*):[31000-32000]
> I0720 17:32:50.968403 28486 slave.cpp:602] Agent attributes: [  ]
> I0720 17:32:50.968435 28486 slave.cpp:607] Agent hostname: 08d690714eb2
> I0720 17:32:50.970275 28472 state.cpp:57] Recovering state from '/tmp/Endpoint_SlaveEndpointTest_AuthorizedRequest_0_fZ1s1a/meta'
> I0720 17:32:50.970299 28486 process.cpp:3340] Handling HTTP event for process 'slave(561)'
with path: '/slave(561)/monitor/statistics'
> I0720 17:32:50.971073 28477 status_update_manager.cpp:200] Recovering status update manager
> I0720 17:32:50.971302 28483 containerizer.cpp:522] Recovering containerizer
> I0720 17:32:50.971482 28474 http.cpp:829] Authorizing principal 'test-principal' to GET
the '/monitor/statistics' endpoint
> I0720 17:32:50.972957 28487 provisioner.cpp:253] Provisioner recovery complete
> I0720 17:32:50.973289 28477 slave.cpp:4946] Finished recovery
> I0720 17:32:50.973881 28477 slave.cpp:5118] Querying resource estimator for oversubscribable
resources
> I0720 17:32:50.974150 28475 slave.cpp:5132] Received oversubscribable resources  from
the resource estimator
> I0720 17:32:50.975458 28480 slave.cpp:841] Agent terminating
> [       OK ] Endpoint/SlaveEndpointTest.AuthorizedRequest/0 (24 ms)
> [ RUN      ] Endpoint/SlaveEndpointTest.AuthorizedRequest/1
> I0720 17:32:50.988344 28453 containerizer.cpp:196] Using isolation: posix/cpu,posix/mem,filesystem/posix,network/cni
> W0720 17:32:50.989181 28453 backend.cpp:75] Failed to create 'aufs' backend: AufsBackend
requires root privileges, but is running as user mesos
> W0720 17:32:50.989351 28453 backend.cpp:75] Failed to create 'bind' backend: BindBackend
requires root privileges
> I0720 17:32:50.992964 28477 slave.cpp:205] Agent started on 562)@172.17.0.2:50384
> I0720 17:32:50.993057 28477 slave.cpp:206] Flags at startup: --acls="" --appc_simple_discovery_uri_prefix="http://"
--appc_store_dir="/tmp/mesos/store/appc" --authenticate_http="true" --authenticatee="crammd5"
--authentication_backoff_factor="1secs" --authorizer="local" --cgroups_cpu_enable_pids_and_tids_count="false"
--cgroups_enable_cfs="false" --cgroups_hierarchy="/sys/fs/cgroup" --cgroups_limit_swap="false"
--cgroups_root="mesos" --container_disk_watch_interval="15secs" --containerizers="mesos" --credential="/tmp/Endpoint_SlaveEndpointTest_AuthorizedRequest_1_j5VhWu/credential"
--default_role="*" --disk_watch_interval="1mins" --docker="docker" --docker_kill_orphans="true"
--docker_registry="https://registry-1.docker.io" --docker_remove_delay="6hrs" --docker_socket="/var/run/docker.sock"
--docker_stop_timeout="0ns" --docker_store_dir="/tmp/mesos/store/docker" --docker_volume_checkpoint_dir="/var/run/mesos/isolators/docker/volume"
--enforce_container_disk_quota="false" --executor_registration_timeout="1mins" --executor_shutdown_grace_period="5secs"
--fetcher_cache_dir="/tmp/Endpoint_SlaveEndpointTest_AuthorizedRequest_1_j5VhWu/fetch" --fetcher_cache_size="2GB"
--frameworks_home="" --gc_delay="1weeks" --gc_disk_headroom="0.1" --hadoop_home="" --help="true"
--hostname_lookup="true" --http_authenticators="basic" --http_command_executor="false" --http_credentials="/tmp/Endpoint_SlaveEndpointTest_AuthorizedRequest_1_j5VhWu/http_credentials"
--image_provisioner_backend="copy" --initialize_driver_logging="true" --isolation="posix/cpu,posix/mem"
--launcher_dir="/mesos/mesos-1.1.0/_build/src" --logbufsecs="0" --logging_level="INFO" --oversubscribed_resources_interval="15secs"
--perf_duration="10secs" --perf_interval="1mins" --qos_correction_interval_min="0ns" --quiet="false"
--recover="reconnect" --recovery_timeout="15mins" --registration_backoff_factor="10ms" --resources="cpus:2;gpus:0;mem:1024;disk:1024;ports:[31000-32000]"
--revocable_cpu_low_priority="true" --sandbox_directory="/mnt/mesos/sandbox" --strict="true"
--switch_user="true" --systemd_enable_support="true" --systemd_runtime_directory="/run/systemd/system"
--version="false" --work_dir="/tmp/Endpoint_SlaveEndpointTest_AuthorizedRequest_1_j5VhWu"
> I0720 17:32:50.993744 28477 credentials.hpp:86] Loading credential for authentication
from '/tmp/Endpoint_SlaveEndpointTest_AuthorizedRequest_1_j5VhWu/credential'
> I0720 17:32:50.993928 28477 slave.cpp:343] Agent using credential for: test-principal
> I0720 17:32:50.993965 28477 credentials.hpp:37] Loading credentials for authentication
from '/tmp/Endpoint_SlaveEndpointTest_AuthorizedRequest_1_j5VhWu/http_credentials'
> I0720 17:32:50.994233 28477 slave.cpp:395] Using default 'basic' HTTP authenticator
> I0720 17:32:50.995268 28477 slave.cpp:594] Agent resources: cpus(*):2; mem(*):1024; disk(*):1024;
ports(*):[31000-32000]
> I0720 17:32:50.995344 28477 slave.cpp:602] Agent attributes: [  ]
> I0720 17:32:50.995358 28477 slave.cpp:607] Agent hostname: 08d690714eb2
> I0720 17:32:50.996966 28472 state.cpp:57] Recovering state from '/tmp/Endpoint_SlaveEndpointTest_AuthorizedRequest_1_j5VhWu/meta'
> I0720 17:32:50.997052 28477 process.cpp:3340] Handling HTTP event for process 'slave(562)'
with path: '/slave(562)/monitor/statistics.json'
> I0720 17:32:50.997695 28487 status_update_manager.cpp:200] Recovering status update manager
> I0720 17:32:50.998023 28472 containerizer.cpp:522] Recovering containerizer
> I0720 17:32:50.998286 28482 http.cpp:829] Authorizing principal 'test-principal' to GET
the '/monitor/statistics.json' endpoint
> I0720 17:32:50.999872 28485 provisioner.cpp:253] Provisioner recovery complete
> I0720 17:32:51.000337 28480 slave.cpp:4946] Finished recovery
> I0720 17:32:51.000970 28480 slave.cpp:5118] Querying resource estimator for oversubscribable
resources
> I0720 17:32:51.001194 28473 slave.cpp:5132] Received oversubscribable resources  from
the resource estimator
> I0720 17:32:51.003031 28486 slave.cpp:841] Agent terminating
> [       OK ] Endpoint/SlaveEndpointTest.AuthorizedRequest/1 (23 ms)
> [ RUN      ] Endpoint/SlaveEndpointTest.AuthorizedRequest/2
> I0720 17:32:51.019266 28453 containerizer.cpp:196] Using isolation: posix/cpu,posix/mem,filesystem/posix,network/cni
> W0720 17:32:51.019891 28453 backend.cpp:75] Failed to create 'aufs' backend: AufsBackend
requires root privileges, but is running as user mesos
> W0720 17:32:51.020020 28453 backend.cpp:75] Failed to create 'bind' backend: BindBackend
requires root privileges
> I0720 17:32:51.022981 28472 slave.cpp:205] Agent started on 563)@172.17.0.2:50384
> I0720 17:32:51.023017 28472 slave.cpp:206] Flags at startup: --acls="" --appc_simple_discovery_uri_prefix="http://"
--appc_store_dir="/tmp/mesos/store/appc" --authenticate_http="true" --authenticatee="crammd5"
--authentication_backoff_factor="1secs" --authorizer="local" --cgroups_cpu_enable_pids_and_tids_count="false"
--cgroups_enable_cfs="false" --cgroups_hierarchy="/sys/fs/cgroup" --cgroups_limit_swap="false"
--cgroups_root="mesos" --container_disk_watch_interval="15secs" --containerizers="mesos" --credential="/tmp/Endpoint_SlaveEndpointTest_AuthorizedRequest_2_QtZP5O/credential"
--default_role="*" --disk_watch_interval="1mins" --docker="docker" --docker_kill_orphans="true"
--docker_registry="https://registry-1.docker.io" --docker_remove_delay="6hrs" --docker_socket="/var/run/docker.sock"
--docker_stop_timeout="0ns" --docker_store_dir="/tmp/mesos/store/docker" --docker_volume_checkpoint_dir="/var/run/mesos/isolators/docker/volume"
--enforce_container_disk_quota="false" --executor_registration_timeout="1mins" --executor_shutdown_grace_period="5secs"
--fetcher_cache_dir="/tmp/Endpoint_SlaveEndpointTest_AuthorizedRequest_2_QtZP5O/fetch" --fetcher_cache_size="2GB"
--frameworks_home="" --gc_delay="1weeks" --gc_disk_headroom="0.1" --hadoop_home="" --help="true"
--hostname_lookup="true" --http_authenticators="basic" --http_command_executor="false" --http_credentials="/tmp/Endpoint_SlaveEndpointTest_AuthorizedRequest_2_QtZP5O/http_credentials"
--image_provisioner_backend="copy" --initialize_driver_logging="true" --isolation="posix/cpu,posix/mem"
--launcher_dir="/mesos/mesos-1.1.0/_build/src" --logbufsecs="0" --logging_level="INFO" --oversubscribed_resources_interval="15secs"
--perf_duration="10secs" --perf_interval="1mins" --qos_correction_interval_min="0ns" --quiet="false"
--recover="reconnect" --recovery_timeout="15mins" --registration_backoff_factor="10ms" --resources="cpus:2;gpus:0;mem:1024;disk:1024;ports:[31000-32000]"
--revocable_cpu_low_priority="true" --sandbox_directory="/mnt/mesos/sandbox" --strict="true"
--switch_user="true" --systemd_enable_support="true" --systemd_runtime_directory="/run/systemd/system"
--version="false" --work_dir="/tmp/Endpoint_SlaveEndpointTest_AuthorizedRequest_2_QtZP5O"
> I0720 17:32:51.023674 28472 credentials.hpp:86] Loading credential for authentication
from '/tmp/Endpoint_SlaveEndpointTest_AuthorizedRequest_2_QtZP5O/credential'
> I0720 17:32:51.023874 28472 slave.cpp:343] Agent using credential for: test-principal
> I0720 17:32:51.023910 28472 credentials.hpp:37] Loading credentials for authentication
from '/tmp/Endpoint_SlaveEndpointTest_AuthorizedRequest_2_QtZP5O/http_credentials'
> I0720 17:32:51.024164 28472 slave.cpp:395] Using default 'basic' HTTP authenticator
> I0720 17:32:51.025306 28472 slave.cpp:594] Agent resources: cpus(*):2; mem(*):1024; disk(*):1024;
ports(*):[31000-32000]
> I0720 17:32:51.025382 28472 slave.cpp:602] Agent attributes: [  ]
> I0720 17:32:51.025394 28472 slave.cpp:607] Agent hostname: 08d690714eb2
> I0720 17:32:51.026867 28486 state.cpp:57] Recovering state from '/tmp/Endpoint_SlaveEndpointTest_AuthorizedRequest_2_QtZP5O/meta'
> I0720 17:32:51.026968 28472 process.cpp:3340] Handling HTTP event for process 'slave(563)'
with path: '/slave(563)/containers'
> I0720 17:32:51.027501 28481 status_update_manager.cpp:200] Recovering status update manager
> I0720 17:32:51.027860 28485 containerizer.cpp:522] Recovering containerizer
> I0720 17:32:51.027988 28487 http.cpp:829] Authorizing principal 'test-principal' to GET
the '/containers' endpoint
> I0720 17:32:51.029963 28479 provisioner.cpp:253] Provisioner recovery complete
> I0720 17:32:51.030397 28477 slave.cpp:4946] Finished recovery
> I0720 17:32:51.030879 28477 slave.cpp:5118] Querying resource estimator for oversubscribable
resources
> I0720 17:32:51.031172 28486 slave.cpp:5132] Received oversubscribable resources  from
the resource estimator
> I0720 17:32:51.031582 28479 slave.cpp:841] Agent terminating
> [       OK ] Endpoint/SlaveEndpointTest.AuthorizedRequest/2 (47 ms)
> [ RUN      ] Endpoint/SlaveEndpointTest.UnauthorizedRequest/0
> I0720 17:32:51.066104 28453 containerizer.cpp:196] Using isolation: posix/cpu,posix/mem,filesystem/posix,network/cni
> W0720 17:32:51.066715 28453 backend.cpp:75] Failed to create 'aufs' backend: AufsBackend
requires root privileges, but is running as user mesos
> W0720 17:32:51.066848 28453 backend.cpp:75] Failed to create 'bind' backend: BindBackend
requires root privileges
> I0720 17:32:51.069578 28483 slave.cpp:205] Agent started on 564)@172.17.0.2:50384
> I0720 17:32:51.069598 28483 slave.cpp:206] Flags at startup: --acls="" --appc_simple_discovery_uri_prefix="http://"
--appc_store_dir="/tmp/mesos/store/appc" --authenticate_http="true" --authenticatee="crammd5"
--authentication_backoff_factor="1secs" --authorizer="local" --cgroups_cpu_enable_pids_and_tids_count="false"
--cgroups_enable_cfs="false" --cgroups_hierarchy="/sys/fs/cgroup" --cgroups_limit_swap="false"
--cgroups_root="mesos" --container_disk_watch_interval="15secs" --containerizers="mesos" --credential="/tmp/Endpoint_SlaveEndpointTest_UnauthorizedRequest_0_Jobyz9/credential"
--default_role="*" --disk_watch_interval="1mins" --docker="docker" --docker_kill_orphans="true"
--docker_registry="https://registry-1.docker.io" --docker_remove_delay="6hrs" --docker_socket="/var/run/docker.sock"
--docker_stop_timeout="0ns" --docker_store_dir="/tmp/mesos/store/docker" --docker_volume_checkpoint_dir="/var/run/mesos/isolators/docker/volume"
--enforce_container_disk_quota="false" --executor_registration_timeout="1mins" --executor_shutdown_grace_period="5secs"
--fetcher_cache_dir="/tmp/Endpoint_SlaveEndpointTest_UnauthorizedRequest_0_Jobyz9/fetch" --fetcher_cache_size="2GB"
--frameworks_home="" --gc_delay="1weeks" --gc_disk_headroom="0.1" --hadoop_home="" --help="true"
--hostname_lookup="true" --http_authenticators="basic" --http_command_executor="false" --http_credentials="/tmp/Endpoint_SlaveEndpointTest_UnauthorizedRequest_0_Jobyz9/http_credentials"
--image_provisioner_backend="copy" --initialize_driver_logging="true" --isolation="posix/cpu,posix/mem"
--launcher_dir="/mesos/mesos-1.1.0/_build/src" --logbufsecs="0" --logging_level="INFO" --oversubscribed_resources_interval="15secs"
--perf_duration="10secs" --perf_interval="1mins" --qos_correction_interval_min="0ns" --quiet="false"
--recover="reconnect" --recovery_timeout="15mins" --registration_backoff_factor="10ms" --resources="cpus:2;gpus:0;mem:1024;disk:1024;ports:[31000-32000]"
--revocable_cpu_low_priority="true" --sandbox_directory="/mnt/mesos/sandbox" --strict="true"
--switch_user="true" --systemd_enable_support="true" --systemd_runtime_directory="/run/systemd/system"
--version="false" --work_dir="/tmp/Endpoint_SlaveEndpointTest_UnauthorizedRequest_0_Jobyz9"
> I0720 17:32:51.070020 28483 credentials.hpp:86] Loading credential for authentication
from '/tmp/Endpoint_SlaveEndpointTest_UnauthorizedRequest_0_Jobyz9/credential'
> I0720 17:32:51.070178 28483 slave.cpp:343] Agent using credential for: test-principal
> I0720 17:32:51.070211 28483 credentials.hpp:37] Loading credentials for authentication
from '/tmp/Endpoint_SlaveEndpointTest_UnauthorizedRequest_0_Jobyz9/http_credentials'
> I0720 17:32:51.070479 28483 slave.cpp:395] Using default 'basic' HTTP authenticator
> I0720 17:32:51.071857 28483 slave.cpp:594] Agent resources: cpus(*):2; mem(*):1024; disk(*):1024;
ports(*):[31000-32000]
> I0720 17:32:51.071970 28483 slave.cpp:602] Agent attributes: [  ]
> I0720 17:32:51.071993 28483 slave.cpp:607] Agent hostname: 08d690714eb2
> I0720 17:32:51.073690 28475 state.cpp:57] Recovering state from '/tmp/Endpoint_SlaveEndpointTest_UnauthorizedRequest_0_Jobyz9/meta'
> I0720 17:32:51.073701 28483 process.cpp:3340] Handling HTTP event for process 'slave(564)'
with path: '/slave(564)/monitor/statistics'
> I0720 17:32:51.074154 28474 status_update_manager.cpp:200] Recovering status update manager
> I0720 17:32:51.074321 28480 containerizer.cpp:522] Recovering containerizer
> I0720 17:32:51.074646 28486 http.cpp:829] Authorizing principal 'test-principal' to GET
the '/monitor/statistics' endpoint
> I0720 17:32:51.075691 28479 provisioner.cpp:253] Provisioner recovery complete
> I0720 17:32:51.076030 28485 slave.cpp:4946] Finished recovery
> I0720 17:32:51.076470 28485 slave.cpp:5118] Querying resource estimator for oversubscribable
resources
> I0720 17:32:51.076699 28483 slave.cpp:5132] Received oversubscribable resources  from
the resource estimator
> I0720 17:32:51.076864 28483 slave.cpp:841] Agent terminating
> [       OK ] Endpoint/SlaveEndpointTest.UnauthorizedRequest/0 (18 ms)
> [ RUN      ] Endpoint/SlaveEndpointTest.UnauthorizedRequest/1
> I0720 17:32:51.093505 28453 containerizer.cpp:196] Using isolation: posix/cpu,posix/mem,filesystem/posix,network/cni
> W0720 17:32:51.094089 28453 backend.cpp:75] Failed to create 'aufs' backend: AufsBackend
requires root privileges, but is running as user mesos
> W0720 17:32:51.094236 28453 backend.cpp:75] Failed to create 'bind' backend: BindBackend
requires root privileges
> I0720 17:32:51.096912 28480 slave.cpp:205] Agent started on 565)@172.17.0.2:50384
> I0720 17:32:51.096981 28480 slave.cpp:206] Flags at startup: --acls="" --appc_simple_discovery_uri_prefix="http://"
--appc_store_dir="/tmp/mesos/store/appc" --authenticate_http="true" --authenticatee="crammd5"
--authentication_backoff_factor="1secs" --authorizer="local" --cgroups_cpu_enable_pids_and_tids_count="false"
--cgroups_enable_cfs="false" --cgroups_hierarchy="/sys/fs/cgroup" --cgroups_limit_swap="false"
--cgroups_root="mesos" --container_disk_watch_interval="15secs" --containerizers="mesos" --credential="/tmp/Endpoint_SlaveEndpointTest_UnauthorizedRequest_1_ikQAju/credential"
--default_role="*" --disk_watch_interval="1mins" --docker="docker" --docker_kill_orphans="true"
--docker_registry="https://registry-1.docker.io" --docker_remove_delay="6hrs" --docker_socket="/var/run/docker.sock"
--docker_stop_timeout="0ns" --docker_store_dir="/tmp/mesos/store/docker" --docker_volume_checkpoint_dir="/var/run/mesos/isolators/docker/volume"
--enforce_container_disk_quota="false" --executor_registration_timeout="1mins" --executor_shutdown_grace_period="5secs"
--fetcher_cache_dir="/tmp/Endpoint_SlaveEndpointTest_UnauthorizedRequest_1_ikQAju/fetch" --fetcher_cache_size="2GB"
--frameworks_home="" --gc_delay="1weeks" --gc_disk_headroom="0.1" --hadoop_home="" --help="true"
--hostname_lookup="true" --http_authenticators="basic" --http_command_executor="false" --http_credentials="/tmp/Endpoint_SlaveEndpointTest_UnauthorizedRequest_1_ikQAju/http_credentials"
--image_provisioner_backend="copy" --initialize_driver_logging="true" --isolation="posix/cpu,posix/mem"
--launcher_dir="/mesos/mesos-1.1.0/_build/src" --logbufsecs="0" --logging_level="INFO" --oversubscribed_resources_interval="15secs"
--perf_duration="10secs" --perf_interval="1mins" --qos_correction_interval_min="0ns" --quiet="false"
--recover="reconnect" --recovery_timeout="15mins" --registration_backoff_factor="10ms" --resources="cpus:2;gpus:0;mem:1024;disk:1024;ports:[31000-32000]"
--revocable_cpu_low_priority="true" --sandbox_directory="/mnt/mesos/sandbox" --strict="true"
--switch_user="true" --systemd_enable_support="true" --systemd_runtime_directory="/run/systemd/system"
--version="false" --work_dir="/tmp/Endpoint_SlaveEndpointTest_UnauthorizedRequest_1_ikQAju"
> I0720 17:32:51.097352 28480 credentials.hpp:86] Loading credential for authentication
from '/tmp/Endpoint_SlaveEndpointTest_UnauthorizedRequest_1_ikQAju/credential'
> I0720 17:32:51.097507 28480 slave.cpp:343] Agent using credential for: test-principal
> I0720 17:32:51.097533 28480 credentials.hpp:37] Loading credentials for authentication
from '/tmp/Endpoint_SlaveEndpointTest_UnauthorizedRequest_1_ikQAju/http_credentials'
> I0720 17:32:51.097772 28480 slave.cpp:395] Using default 'basic' HTTP authenticator
> I0720 17:32:51.099105 28480 slave.cpp:594] Agent resources: cpus(*):2; mem(*):1024; disk(*):1024;
ports(*):[31000-32000]
> I0720 17:32:51.099181 28480 slave.cpp:602] Agent attributes: [  ]
> I0720 17:32:51.099195 28480 slave.cpp:607] Agent hostname: 08d690714eb2
> I0720 17:32:51.101061 28475 state.cpp:57] Recovering state from '/tmp/Endpoint_SlaveEndpointTest_UnauthorizedRequest_1_ikQAju/meta'
> I0720 17:32:51.101097 28480 process.cpp:3340] Handling HTTP event for process 'slave(565)'
with path: '/slave(565)/monitor/statistics.json'
> I0720 17:32:51.101923 28477 status_update_manager.cpp:200] Recovering status update manager
> I0720 17:32:51.102223 28481 containerizer.cpp:522] Recovering containerizer
> I0720 17:32:51.102367 28479 http.cpp:829] Authorizing principal 'test-principal' to GET
the '/monitor/statistics.json' endpoint
> I0720 17:32:51.103720 28483 provisioner.cpp:253] Provisioner recovery complete
> I0720 17:32:51.104050 28479 slave.cpp:4946] Finished recovery
> I0720 17:32:51.104508 28479 slave.cpp:5118] Querying resource estimator for oversubscribable
resources
> I0720 17:32:51.104801 28482 slave.cpp:5132] Received oversubscribable resources  from
the resource estimator
> I0720 17:32:51.105525 28475 slave.cpp:841] Agent terminating
> [       OK ] Endpoint/SlaveEndpointTest.UnauthorizedRequest/1 (21 ms)
> [ RUN      ] Endpoint/SlaveEndpointTest.UnauthorizedRequest/2
> I0720 17:32:51.127396 28453 containerizer.cpp:196] Using isolation: posix/cpu,posix/mem,filesystem/posix,network/cni
> W0720 17:32:51.128013 28453 backend.cpp:75] Failed to create 'aufs' backend: AufsBackend
requires root privileges, but is running as user mesos
> W0720 17:32:51.128154 28453 backend.cpp:75] Failed to create 'bind' backend: BindBackend
requires root privileges
> I0720 17:32:51.130893 28481 slave.cpp:205] Agent started on 566)@172.17.0.2:50384
> I0720 17:32:51.130915 28481 slave.cpp:206] Flags at startup: --acls="" --appc_simple_discovery_uri_prefix="http://"
--appc_store_dir="/tmp/mesos/store/appc" --authenticate_http="true" --authenticatee="crammd5"
--authentication_backoff_factor="1secs" --authorizer="local" --cgroups_cpu_enable_pids_and_tids_count="false"
--cgroups_enable_cfs="false" --cgroups_hierarchy="/sys/fs/cgroup" --cgroups_limit_swap="false"
--cgroups_root="mesos" --container_disk_watch_interval="15secs" --containerizers="mesos" --credential="/tmp/Endpoint_SlaveEndpointTest_UnauthorizedRequest_2_hEobjP/credential"
--default_role="*" --disk_watch_interval="1mins" --docker="docker" --docker_kill_orphans="true"
--docker_registry="https://registry-1.docker.io" --docker_remove_delay="6hrs" --docker_socket="/var/run/docker.sock"
--docker_stop_timeout="0ns" --docker_store_dir="/tmp/mesos/store/docker" --docker_volume_checkpoint_dir="/var/run/mesos/isolators/docker/volume"
--enforce_container_disk_quota="false" --executor_registration_timeout="1mins" --executor_shutdown_grace_period="5secs"
--fetcher_cache_dir="/tmp/Endpoint_SlaveEndpointTest_UnauthorizedRequest_2_hEobjP/fetch" --fetcher_cache_size="2GB"
--frameworks_home="" --gc_delay="1weeks" --gc_disk_headroom="0.1" --hadoop_home="" --help="true"
--hostname_lookup="true" --http_authenticators="basic" --http_command_executor="false" --http_credentials="/tmp/Endpoint_SlaveEndpointTest_UnauthorizedRequest_2_hEobjP/http_credentials"
--image_provisioner_backend="copy" --initialize_driver_logging="true" --isolation="posix/cpu,posix/mem"
--launcher_dir="/mesos/mesos-1.1.0/_build/src" --logbufsecs="0" --logging_level="INFO" --oversubscribed_resources_interval="15secs"
--perf_duration="10secs" --perf_interval="1mins" --qos_correction_interval_min="0ns" --quiet="false"
--recover="reconnect" --recovery_timeout="15mins" --registration_backoff_factor="10ms" --resources="cpus:2;gpus:0;mem:1024;disk:1024;ports:[31000-32000]"
--revocable_cpu_low_priority="true" --sandbox_directory="/mnt/mesos/sandbox" --strict="true"
--switch_user="true" --systemd_enable_support="true" --systemd_runtime_directory="/run/systemd/system"
--version="false" --work_dir="/tmp/Endpoint_SlaveEndpointTest_UnauthorizedRequest_2_hEobjP"
> I0720 17:32:51.131278 28481 credentials.hpp:86] Loading credential for authentication
from '/tmp/Endpoint_SlaveEndpointTest_UnauthorizedRequest_2_hEobjP/credential'
> I0720 17:32:51.131410 28481 slave.cpp:343] Agent using credential for: test-principal
> I0720 17:32:51.131646 28481 credentials.hpp:37] Loading credentials for authentication
from '/tmp/Endpoint_SlaveEndpointTest_UnauthorizedRequest_2_hEobjP/http_credentials'
> I0720 17:32:51.131966 28481 slave.cpp:395] Using default 'basic' HTTP authenticator
> I0720 17:32:51.132820 28481 slave.cpp:594] Agent resources: cpus(*):2; mem(*):1024; disk(*):1024;
ports(*):[31000-32000]
> I0720 17:32:51.132879 28481 slave.cpp:602] Agent attributes: [  ]
> I0720 17:32:51.132895 28481 slave.cpp:607] Agent hostname: 08d690714eb2
> I0720 17:32:51.133993 28482 state.cpp:57] Recovering state from '/tmp/Endpoint_SlaveEndpointTest_UnauthorizedRequest_2_hEobjP/meta'
> I0720 17:32:51.134084 28481 process.cpp:3340] Handling HTTP event for process 'slave(566)'
with path: '/slave(566)/containers'
> I0720 17:32:51.134532 28485 status_update_manager.cpp:200] Recovering status update manager
> I0720 17:32:51.134896 28483 containerizer.cpp:522] Recovering containerizer
> I0720 17:32:51.134935 28474 http.cpp:829] Authorizing principal 'test-principal' to GET
the '/containers' endpoint
> I0720 17:32:51.136386 28476 provisioner.cpp:253] Provisioner recovery complete
> I0720 17:32:51.136848 28472 slave.cpp:841] Agent terminating
> [       OK ] Endpoint/SlaveEndpointTest.UnauthorizedRequest/2 (16 ms)
> [ RUN      ] Endpoint/SlaveEndpointTest.NoAuthorizer/0
> I0720 17:32:51.144351 28453 containerizer.cpp:196] Using isolation: posix/cpu,posix/mem,filesystem/posix,network/cni
> W0720 17:32:51.145020 28453 backend.cpp:75] Failed to create 'aufs' backend: AufsBackend
requires root privileges, but is running as user mesos
> W0720 17:32:51.145159 28453 backend.cpp:75] Failed to create 'bind' backend: BindBackend
requires root privileges
> I0720 17:32:51.146915 28453 cluster.cpp:432] Creating default 'local' authorizer
> I0720 17:32:51.149185 28481 slave.cpp:205] Agent started on 567)@172.17.0.2:50384
> I0720 17:32:51.149216 28481 slave.cpp:206] Flags at startup: --acls="" --appc_simple_discovery_uri_prefix="http://"
--appc_store_dir="/tmp/mesos/store/appc" --authenticate_http="true" --authenticatee="crammd5"
--authentication_backoff_factor="1secs" --authorizer="local" --cgroups_cpu_enable_pids_and_tids_count="false"
--cgroups_enable_cfs="false" --cgroups_hierarchy="/sys/fs/cgroup" --cgroups_limit_swap="false"
--cgroups_root="mesos" --container_disk_watch_interval="15secs" --containerizers="mesos" --credential="/tmp/Endpoint_SlaveEndpointTest_NoAuthorizer_0_XFjT5n/credential"
--default_role="*" --disk_watch_interval="1mins" --docker="docker" --docker_kill_orphans="true"
--docker_registry="https://registry-1.docker.io" --docker_remove_delay="6hrs" --docker_socket="/var/run/docker.sock"
--docker_stop_timeout="0ns" --docker_store_dir="/tmp/mesos/store/docker" --docker_volume_checkpoint_dir="/var/run/mesos/isolators/docker/volume"
--enforce_container_disk_quota="false" --executor_registration_timeout="1mins" --executor_shutdown_grace_period="5secs"
--fetcher_cache_dir="/tmp/Endpoint_SlaveEndpointTest_NoAuthorizer_0_XFjT5n/fetch" --fetcher_cache_size="2GB"
--frameworks_home="" --gc_delay="1weeks" --gc_disk_headroom="0.1" --hadoop_home="" --help="false"
--hostname_lookup="true" --http_authenticators="basic" --http_command_executor="false" --http_credentials="/tmp/Endpoint_SlaveEndpointTest_NoAuthorizer_0_XFjT5n/http_credentials"
--image_provisioner_backend="copy" --initialize_driver_logging="true" --isolation="posix/cpu,posix/mem"
--launcher_dir="/mesos/mesos-1.1.0/_build/src" --logbufsecs="0" --logging_level="INFO" --oversubscribed_resources_interval="15secs"
--perf_duration="10secs" --perf_interval="1mins" --qos_correction_interval_min="0ns" --quiet="false"
--recover="reconnect" --recovery_timeout="15mins" --registration_backoff_factor="10ms" --resources="cpus:2;gpus:0;mem:1024;disk:1024;ports:[31000-32000]"
--revocable_cpu_low_priority="true" --sandbox_directory="/mnt/mesos/sandbox" --strict="true"
--switch_user="true" --systemd_enable_support="true" --systemd_runtime_directory="/run/systemd/system"
--version="false" --work_dir="/tmp/Endpoint_SlaveEndpointTest_NoAuthorizer_0_XFjT5n"
> I0720 17:32:51.149814 28481 credentials.hpp:86] Loading credential for authentication
from '/tmp/Endpoint_SlaveEndpointTest_NoAuthorizer_0_XFjT5n/credential'
> I0720 17:32:51.149989 28481 slave.cpp:343] Agent using credential for: test-principal
> I0720 17:32:51.150029 28481 credentials.hpp:37] Loading credentials for authentication
from '/tmp/Endpoint_SlaveEndpointTest_NoAuthorizer_0_XFjT5n/http_credentials'
> I0720 17:32:51.150393 28481 slave.cpp:395] Using default 'basic' HTTP authenticator
> I0720 17:32:51.151547 28481 slave.cpp:594] Agent resources: cpus(*):2; mem(*):1024; disk(*):1024;
ports(*):[31000-32000]
> I0720 17:32:51.151607 28481 slave.cpp:602] Agent attributes: [  ]
> I0720 17:32:51.151618 28481 slave.cpp:607] Agent hostname: 08d690714eb2
> I0720 17:32:51.153031 28472 state.cpp:57] Recovering state from '/tmp/Endpoint_SlaveEndpointTest_NoAuthorizer_0_XFjT5n/meta'
> I0720 17:32:51.153077 28481 process.cpp:3340] Handling HTTP event for process 'slave(567)'
with path: '/slave(567)/monitor/statistics'
> I0720 17:32:51.153911 28482 status_update_manager.cpp:200] Recovering status update manager
> I0720 17:32:51.154156 28485 containerizer.cpp:522] Recovering containerizer
> I0720 17:32:51.154320 28483 http.cpp:829] Authorizing principal 'test-principal' to GET
the '/monitor/statistics' endpoint
> I0720 17:32:51.155530 28472 provisioner.cpp:253] Provisioner recovery complete
> I0720 17:32:51.156023 28478 slave.cpp:4946] Finished recovery
> I0720 17:32:51.156481 28478 slave.cpp:5118] Querying resource estimator for oversubscribable
resources
> I0720 17:32:51.156647 28477 slave.cpp:5132] Received oversubscribable resources  from
the resource estimator
> I0720 17:32:51.157841 28482 slave.cpp:841] Agent terminating
> [       OK ] Endpoint/SlaveEndpointTest.NoAuthorizer/0 (22 ms)
> [ RUN      ] Endpoint/SlaveEndpointTest.NoAuthorizer/1
> I0720 17:32:51.176606 28453 containerizer.cpp:196] Using isolation: posix/cpu,posix/mem,filesystem/posix,network/cni
> W0720 17:32:51.177182 28453 backend.cpp:75] Failed to create 'aufs' backend: AufsBackend
requires root privileges, but is running as user mesos
> W0720 17:32:51.177314 28453 backend.cpp:75] Failed to create 'bind' backend: BindBackend
requires root privileges
> I0720 17:32:51.178591 28453 cluster.cpp:432] Creating default 'local' authorizer
> I0720 17:32:51.180061 28484 slave.cpp:205] Agent started on 568)@172.17.0.2:50384
> I0720 17:32:51.180080 28484 slave.cpp:206] Flags at startup: --acls="" --appc_simple_discovery_uri_prefix="http://"
--appc_store_dir="/tmp/mesos/store/appc" --authenticate_http="true" --authenticatee="crammd5"
--authentication_backoff_factor="1secs" --authorizer="local" --cgroups_cpu_enable_pids_and_tids_count="false"
--cgroups_enable_cfs="false" --cgroups_hierarchy="/sys/fs/cgroup" --cgroups_limit_swap="false"
--cgroups_root="mesos" --container_disk_watch_interval="15secs" --containerizers="mesos" --credential="/tmp/Endpoint_SlaveEndpointTest_NoAuthorizer_1_MP7RtJ/credential"
--default_role="*" --disk_watch_interval="1mins" --docker="docker" --docker_kill_orphans="true"
--docker_registry="https://registry-1.docker.io" --docker_remove_delay="6hrs" --docker_socket="/var/run/docker.sock"
--docker_stop_timeout="0ns" --docker_store_dir="/tmp/mesos/store/docker" --docker_volume_checkpoint_dir="/var/run/mesos/isolators/docker/volume"
--enforce_container_disk_quota="false" --executor_registration_timeout="1mins" --executor_shutdown_grace_period="5secs"
--fetcher_cache_dir="/tmp/Endpoint_SlaveEndpointTest_NoAuthorizer_1_MP7RtJ/fetch" --fetcher_cache_size="2GB"
--frameworks_home="" --gc_delay="1weeks" --gc_disk_headroom="0.1" --hadoop_home="" --help="false"
--hostname_lookup="true" --http_authenticators="basic" --http_command_executor="false" --http_credentials="/tmp/Endpoint_SlaveEndpointTest_NoAuthorizer_1_MP7RtJ/http_credentials"
--image_provisioner_backend="copy" --initialize_driver_logging="true" --isolation="posix/cpu,posix/mem"
--launcher_dir="/mesos/mesos-1.1.0/_build/src" --logbufsecs="0" --logging_level="INFO" --oversubscribed_resources_interval="15secs"
--perf_duration="10secs" --perf_interval="1mins" --qos_correction_interval_min="0ns" --quiet="false"
--recover="reconnect" --recovery_timeout="15mins" --registration_backoff_factor="10ms" --resources="cpus:2;gpus:0;mem:1024;disk:1024;ports:[31000-32000]"
--revocable_cpu_low_priority="true" --sandbox_directory="/mnt/mesos/sandbox" --strict="true"
--switch_user="true" --systemd_enable_support="true" --systemd_runtime_directory="/run/systemd/system"
--version="false" --work_dir="/tmp/Endpoint_SlaveEndpointTest_NoAuthorizer_1_MP7RtJ"
> I0720 17:32:51.180450 28484 credentials.hpp:86] Loading credential for authentication
from '/tmp/Endpoint_SlaveEndpointTest_NoAuthorizer_1_MP7RtJ/credential'
> I0720 17:32:51.180568 28484 slave.cpp:343] Agent using credential for: test-principal
> I0720 17:32:51.180594 28484 credentials.hpp:37] Loading credentials for authentication
from '/tmp/Endpoint_SlaveEndpointTest_NoAuthorizer_1_MP7RtJ/http_credentials'
> I0720 17:32:51.180778 28484 slave.cpp:395] Using default 'basic' HTTP authenticator
> I0720 17:32:51.181933 28484 slave.cpp:594] Agent resources: cpus(*):2; mem(*):1024; disk(*):1024;
ports(*):[31000-32000]
> I0720 17:32:51.181988 28484 slave.cpp:602] Agent attributes: [  ]
> I0720 17:32:51.181998 28484 slave.cpp:607] Agent hostname: 08d690714eb2
> I0720 17:32:51.183337 28483 state.cpp:57] Recovering state from '/tmp/Endpoint_SlaveEndpointTest_NoAuthorizer_1_MP7RtJ/meta'
> I0720 17:32:51.183393 28484 process.cpp:3340] Handling HTTP event for process 'slave(568)'
with path: '/slave(568)/monitor/statistics.json'
> I0720 17:32:51.183879 28481 status_update_manager.cpp:200] Recovering status update manager
> I0720 17:32:51.184181 28487 containerizer.cpp:522] Recovering containerizer
> I0720 17:32:51.184334 28475 http.cpp:829] Authorizing principal 'test-principal' to GET
the '/monitor/statistics.json' endpoint
> I0720 17:32:51.185714 28472 provisioner.cpp:253] Provisioner recovery complete
> I0720 17:32:51.186234 28481 slave.cpp:4946] Finished recovery
> I0720 17:32:51.201942 28481 slave.cpp:5118] Querying resource estimator for oversubscribable
resources
> I0720 17:32:51.202106 28481 slave.cpp:841] Agent terminating
> [       OK ] Endpoint/SlaveEndpointTest.NoAuthorizer/1 (33 ms)
> [ RUN      ] Endpoint/SlaveEndpointTest.NoAuthorizer/2
> I0720 17:32:51.225371 28453 containerizer.cpp:196] Using isolation: posix/cpu,posix/mem,filesystem/posix,network/cni
> W0720 17:32:51.225971 28453 backend.cpp:75] Failed to create 'aufs' backend: AufsBackend
requires root privileges, but is running as user mesos
> W0720 17:32:51.226092 28453 backend.cpp:75] Failed to create 'bind' backend: BindBackend
requires root privileges
> I0720 17:32:51.227342 28453 cluster.cpp:432] Creating default 'local' authorizer
> I0720 17:32:51.228818 28481 slave.cpp:205] Agent started on 569)@172.17.0.2:50384
> I0720 17:32:51.228837 28481 slave.cpp:206] Flags at startup: --acls="" --appc_simple_discovery_uri_prefix="http://"
--appc_store_dir="/tmp/mesos/store/appc" --authenticate_http="true" --authenticatee="crammd5"
--authentication_backoff_factor="1secs" --authorizer="local" --cgroups_cpu_enable_pids_and_tids_count="false"
--cgroups_enable_cfs="false" --cgroups_hierarchy="/sys/fs/cgroup" --cgroups_limit_swap="false"
--cgroups_root="mesos" --container_disk_watch_interval="15secs" --containerizers="mesos" --credential="/tmp/Endpoint_SlaveEndpointTest_NoAuthorizer_2_zjF3e5/credential"
--default_role="*" --disk_watch_interval="1mins" --docker="docker" --docker_kill_orphans="true"
--docker_registry="https://registry-1.docker.io" --docker_remove_delay="6hrs" --docker_socket="/var/run/docker.sock"
--docker_stop_timeout="0ns" --docker_store_dir="/tmp/mesos/store/docker" --docker_volume_checkpoint_dir="/var/run/mesos/isolators/docker/volume"
--enforce_container_disk_quota="false" --executor_registration_timeout="1mins" --executor_shutdown_grace_period="5secs"
--fetcher_cache_dir="/tmp/Endpoint_SlaveEndpointTest_NoAuthorizer_2_zjF3e5/fetch" --fetcher_cache_size="2GB"
--frameworks_home="" --gc_delay="1weeks" --gc_disk_headroom="0.1" --hadoop_home="" --help="false"
--hostname_lookup="true" --http_authenticators="basic" --http_command_executor="false" --http_credentials="/tmp/Endpoint_SlaveEndpointTest_NoAuthorizer_2_zjF3e5/http_credentials"
--image_provisioner_backend="copy" --initialize_driver_logging="true" --isolation="posix/cpu,posix/mem"
--launcher_dir="/mesos/mesos-1.1.0/_build/src" --logbufsecs="0" --logging_level="INFO" --oversubscribed_resources_interval="15secs"
--perf_duration="10secs" --perf_interval="1mins" --qos_correction_interval_min="0ns" --quiet="false"
--recover="reconnect" --recovery_timeout="15mins" --registration_backoff_factor="10ms" --resources="cpus:2;gpus:0;mem:1024;disk:1024;ports:[31000-32000]"
--revocable_cpu_low_priority="true" --sandbox_directory="/mnt/mesos/sandbox" --strict="true"
--switch_user="true" --systemd_enable_support="true" --systemd_runtime_directory="/run/systemd/system"
--version="false" --work_dir="/tmp/Endpoint_SlaveEndpointTest_NoAuthorizer_2_zjF3e5"
> I0720 17:32:51.229190 28481 credentials.hpp:86] Loading credential for authentication
from '/tmp/Endpoint_SlaveEndpointTest_NoAuthorizer_2_zjF3e5/credential'
> I0720 17:32:51.229317 28481 slave.cpp:343] Agent using credential for: test-principal
> I0720 17:32:51.229362 28481 credentials.hpp:37] Loading credentials for authentication
from '/tmp/Endpoint_SlaveEndpointTest_NoAuthorizer_2_zjF3e5/http_credentials'
> I0720 17:32:51.229681 28481 slave.cpp:395] Using default 'basic' HTTP authenticator
> I0720 17:32:51.230631 28481 slave.cpp:594] Agent resources: cpus(*):2; mem(*):1024; disk(*):1024;
ports(*):[31000-32000]
> I0720 17:32:51.230689 28481 slave.cpp:602] Agent attributes: [  ]
> I0720 17:32:51.230705 28481 slave.cpp:607] Agent hostname: 08d690714eb2
> I0720 17:32:51.231828 28486 state.cpp:57] Recovering state from '/tmp/Endpoint_SlaveEndpointTest_NoAuthorizer_2_zjF3e5/meta'
> I0720 17:32:51.231899 28481 process.cpp:3340] Handling HTTP event for process 'slave(569)'
with path: '/slave(569)/containers'
> I0720 17:32:51.232321 28486 status_update_manager.cpp:200] Recovering status update manager
> I0720 17:32:51.232537 28472 containerizer.cpp:522] Recovering containerizer
> I0720 17:32:51.232846 28483 http.cpp:829] Authorizing principal 'test-principal' to GET
the '/containers' endpoint
> I0720 17:32:51.233695 28482 provisioner.cpp:253] Provisioner recovery complete
> I0720 17:32:51.233930 28478 slave.cpp:4946] Finished recovery
> I0720 17:32:51.234638 28478 slave.cpp:5118] Querying resource estimator for oversubscribable
resources
> I0720 17:32:51.234832 28473 slave.cpp:5132] Received oversubscribable resources  from
the resource estimator
> I0720 17:32:51.235998 28486 slave.cpp:841] Agent terminating
> [       OK ] Endpoint/SlaveEndpointTest.NoAuthorizer/2 (17 ms)
> [----------] 9 tests from Endpoint/SlaveEndpointTest (292 ms total)
> 
> [----------] Global test environment tear-down
> [==========] 1256 tests from 139 test cases ran. (859311 ms total)
> [  PASSED  ] 1255 tests.
> [  FAILED  ] 1 test, listed below:
> [  FAILED  ] ContentType/MasterAPITest.CreateAndDestroyVolumes/1, where GetParam() =
application/json
> 
> 1 FAILED TEST
>  YOU HAVE 6 DISABLED TESTS
> 
> make[4]: *** [check-local] Error 1
> make[4]: Leaving directory `/mesos/mesos-1.1.0/_build/src'
> make[3]: *** [check-am] Error 2
> make[3]: Leaving directory `/mesos/mesos-1.1.0/_build/src'
> make[2]: *** [check] Error 2
> make[2]: Leaving directory `/mesos/mesos-1.1.0/_build/src'
> make[1]: *** [check-recursive] Error 1
> make[1]: Leaving directory `/mesos/mesos-1.1.0/_build'
> make: *** [distcheck] Error 1
> + docker rmi mesos-1469033059-31403
> Untagged: mesos-1469033059-31403:latest
> Deleted: 5761faf99c523420fde4b3d8b1815ec7c553f13a9b343c8961ac1a813f7d04b8
> Deleted: 0be203ffaa98d636458711f97cff172a211aa786ae07274b90ee1ad1aa7ca073
> Deleted: 4ee2b494b90017ef1c9e06da21ef65c483189367d8e0808e1765ea234ae4e684
> Deleted: 3ef3797fe2b8d26116c4202d979d74f0e92b880bdeba44b127430148be19032d
> Deleted: 63f1f74902df90ba749ceb0e718a3b4d549fc2df239e3194e21103e86bab0f5b
> Deleted: 3c33af8e584e44e2f1c37ad260d4372cb49be826393a1726202ec2a5a0dd0e0d
> Deleted: b02b0bc32989cf22d64e5b97fdc2cc7bc305590284b24c081a18a4b8d9d6398e
> Deleted: 078b3dd1e26aaad224ecbe2d9b87ec5abb3e778b013ebf5b17b3f4c60c5ad76e
> Deleted: b43750b86d83da04a3da9007f73d30fa0075455bedddb29f7ee4d792ad954123
> Deleted: 5089a6a8ed39e775af5c3689ea5494b39c7584c17d747e697a35bd1c45ccc652
> Deleted: d14d504a2c658e4021a663f05b3afae7243a1a38043bc8b7189dcb9af47a1bed
> Deleted: 6ba62b4c706d4f5566619755e10e55475444defbf0df315c97c15577d8beeb72
> Deleted: f4d5d360291e19f5b2dbb7376d512d269d17d8d120a5e0a66cb9de467172e3ab
> Deleted: 08a808365e90c6c6dcadaea85b2dfc0ba4c08d7e75300f79994a2b7c189e353a
> Deleted: 22777b78a5c7ee2b3b3f784098bdb9147b75089e091f009049854895f6e7be97
> Build step 'Execute shell' marked build as failure



Mime
View raw message