mesos-builds mailing list archives

Site index · List index
Message view « Date » · « Thread »
Top « Date » · « Thread »
From Apache Jenkins Server <jenk...@builds.apache.org>
Subject Build failed in Jenkins: mesos-reviewbot #14212
Date Fri, 08 Jul 2016 05:45:40 GMT
See <https://builds.apache.org/job/mesos-reviewbot/14212/changes>

Changes:

[vinodkone] MESOS-5808 - Elasticsearch misspelled on homepage.

------------------------------------------
[...truncated 200391 lines...]
I0708 05:45:42.975020 28136 state.cpp:57] Recovering state from '/tmp/Endpoint_SlaveEndpointTest_AuthorizedRequest_1_FibHoL/meta'
I0708 05:45:42.975106 28133 process.cpp:3322] Handling HTTP event for process 'slave(550)'
with path: '/slave(550)/monitor/statistics.json'
I0708 05:45:42.975633 28127 status_update_manager.cpp:200] Recovering status update manager
I0708 05:45:42.975821 28137 containerizer.cpp:522] Recovering containerizer
I0708 05:45:42.976224 28128 http.cpp:829] Authorizing principal 'test-principal' to GET the
'/monitor/statistics.json' endpoint
I0708 05:45:42.977179 28125 provisioner.cpp:253] Provisioner recovery complete
I0708 05:45:42.977761 28128 slave.cpp:4856] Finished recovery
I0708 05:45:42.978446 28128 slave.cpp:5028] Querying resource estimator for oversubscribable
resources
I0708 05:45:42.978904 28126 slave.cpp:5042] Received oversubscribable resources  from the
resource estimator
I0708 05:45:42.980607 28139 slave.cpp:841] Agent terminating
[       OK ] Endpoint/SlaveEndpointTest.AuthorizedRequest/1 (21 ms)
[ RUN      ] Endpoint/SlaveEndpointTest.AuthorizedRequest/2
I0708 05:45:42.991708 28105 containerizer.cpp:196] Using isolation: posix/cpu,posix/mem,filesystem/posix,network/cni
W0708 05:45:42.992444 28105 backend.cpp:75] Failed to create 'aufs' backend: AufsBackend requires
root privileges, but is running as user mesos
W0708 05:45:42.992602 28105 backend.cpp:75] Failed to create 'bind' backend: BindBackend requires
root privileges
I0708 05:45:42.995548 28133 slave.cpp:205] Agent started on 551)@172.17.0.2:36542
I0708 05:45:42.995573 28133 slave.cpp:206] Flags at startup: --acls="" --appc_simple_discovery_uri_prefix="http://"
--appc_store_dir="/tmp/mesos/store/appc" --authenticate_http="true" --authenticatee="crammd5"
--authentication_backoff_factor="1secs" --authorizer="local" --cgroups_cpu_enable_pids_and_tids_count="false"
--cgroups_enable_cfs="false" --cgroups_hierarchy="/sys/fs/cgroup" --cgroups_limit_swap="false"
--cgroups_root="mesos" --container_disk_watch_interval="15secs" --containerizers="mesos" --credential="/tmp/Endpoint_SlaveEndpointTest_AuthorizedRequest_2_Yvn0xD/credential"
--default_role="*" --disk_watch_interval="1mins" --docker="docker" --docker_kill_orphans="true"
--docker_registry="https://registry-1.docker.io" --docker_remove_delay="6hrs" --docker_socket="/var/run/docker.sock"
--docker_stop_timeout="0ns" --docker_store_dir="/tmp/mesos/store/docker" --docker_volume_checkpoint_dir="/var/run/mesos/isolators/docker/volume"
--enforce_container_disk_quota="false" --executor_registration_timeout="1mins" --executor_shutdown_grace_period="5secs"
--fetcher_cache_dir="/tmp/Endpoint_SlaveEndpointTest_AuthorizedRequest_2_Yvn0xD/fetch" --fetcher_cache_size="2GB"
--frameworks_home="" --gc_delay="1weeks" --gc_disk_headroom="0.1" --hadoop_home="" --help="false"
--hostname_lookup="true" --http_authenticators="basic" --http_command_executor="false" --http_credentials="/tmp/Endpoint_SlaveEndpointTest_AuthorizedRequest_2_Yvn0xD/http_credentials"
--image_provisioner_backend="copy" --initialize_driver_logging="true" --isolation="posix/cpu,posix/mem"
--launcher_dir="/mesos/mesos-1.1.0/_build/src" --logbufsecs="0" --logging_level="INFO" --oversubscribed_resources_interval="15secs"
--perf_duration="10secs" --perf_interval="1mins" --qos_correction_interval_min="0ns" --quiet="false"
--recover="reconnect" --recovery_timeout="15mins" --registration_backoff_factor="10ms" --resources="cpus:2;gpus:0;mem:1024;disk:1024;ports:[31000-32000]"
--revocable_cpu_low_priority="true" --sandbox_directory="/mnt/mesos/sandbox" --strict="true"
--switch_user="true" --systemd_enable_support="true" --systemd_runtime_directory="/run/systemd/system"
--version="false" --work_dir="/tmp/Endpoint_SlaveEndpointTest_AuthorizedRequest_2_Yvn0xD"
I0708 05:45:42.996047 28133 credentials.hpp:86] Loading credential for authentication from
'/tmp/Endpoint_SlaveEndpointTest_AuthorizedRequest_2_Yvn0xD/credential'
I0708 05:45:42.996209 28133 slave.cpp:343] Agent using credential for: test-principal
I0708 05:45:42.996239 28133 credentials.hpp:37] Loading credentials for authentication from
'/tmp/Endpoint_SlaveEndpointTest_AuthorizedRequest_2_Yvn0xD/http_credentials'
I0708 05:45:42.996497 28133 slave.cpp:395] Using default 'basic' HTTP authenticator
I0708 05:45:42.996845 28133 resources.cpp:572] Parsing resources as JSON failed: cpus:2;gpus:0;mem:1024;disk:1024;ports:[31000-32000]
Trying semicolon-delimited string format instead
I0708 05:45:42.997280 28133 resources.cpp:572] Parsing resources as JSON failed: cpus:2;gpus:0;mem:1024;disk:1024;ports:[31000-32000]
Trying semicolon-delimited string format instead
I0708 05:45:42.997676 28133 slave.cpp:594] Agent resources: cpus(*):2; mem(*):1024; disk(*):1024;
ports(*):[31000-32000]
I0708 05:45:42.997735 28133 slave.cpp:602] Agent attributes: [  ]
I0708 05:45:42.997745 28133 slave.cpp:607] Agent hostname: 989c65822bae
I0708 05:45:42.999238 28134 state.cpp:57] Recovering state from '/tmp/Endpoint_SlaveEndpointTest_AuthorizedRequest_2_Yvn0xD/meta'
I0708 05:45:42.999325 28133 process.cpp:3322] Handling HTTP event for process 'slave(551)'
with path: '/slave(551)/containers'
I0708 05:45:42.999807 28138 status_update_manager.cpp:200] Recovering status update manager
I0708 05:45:43.000010 28136 containerizer.cpp:522] Recovering containerizer
I0708 05:45:43.000279 28137 http.cpp:829] Authorizing principal 'test-principal' to GET the
'/containers' endpoint
I0708 05:45:43.001348 28139 provisioner.cpp:253] Provisioner recovery complete
I0708 05:45:43.002203 28137 slave.cpp:4856] Finished recovery
I0708 05:45:43.002689 28137 slave.cpp:5028] Querying resource estimator for oversubscribable
resources
I0708 05:45:43.003597 28125 slave.cpp:5042] Received oversubscribable resources  from the
resource estimator
I0708 05:45:43.004303 28127 slave.cpp:841] Agent terminating
[       OK ] Endpoint/SlaveEndpointTest.AuthorizedRequest/2 (22 ms)
[ RUN      ] Endpoint/SlaveEndpointTest.UnauthorizedRequest/0
I0708 05:45:43.018193 28105 containerizer.cpp:196] Using isolation: posix/cpu,posix/mem,filesystem/posix,network/cni
W0708 05:45:43.018909 28105 backend.cpp:75] Failed to create 'aufs' backend: AufsBackend requires
root privileges, but is running as user mesos
W0708 05:45:43.019079 28105 backend.cpp:75] Failed to create 'bind' backend: BindBackend requires
root privileges
I0708 05:45:43.022295 28131 slave.cpp:205] Agent started on 552)@172.17.0.2:36542
I0708 05:45:43.022315 28131 slave.cpp:206] Flags at startup: --acls="" --appc_simple_discovery_uri_prefix="http://"
--appc_store_dir="/tmp/mesos/store/appc" --authenticate_http="true" --authenticatee="crammd5"
--authentication_backoff_factor="1secs" --authorizer="local" --cgroups_cpu_enable_pids_and_tids_count="false"
--cgroups_enable_cfs="false" --cgroups_hierarchy="/sys/fs/cgroup" --cgroups_limit_swap="false"
--cgroups_root="mesos" --container_disk_watch_interval="15secs" --containerizers="mesos" --credential="/tmp/Endpoint_SlaveEndpointTest_UnauthorizedRequest_0_DDuSTv/credential"
--default_role="*" --disk_watch_interval="1mins" --docker="docker" --docker_kill_orphans="true"
--docker_registry="https://registry-1.docker.io" --docker_remove_delay="6hrs" --docker_socket="/var/run/docker.sock"
--docker_stop_timeout="0ns" --docker_store_dir="/tmp/mesos/store/docker" --docker_volume_checkpoint_dir="/var/run/mesos/isolators/docker/volume"
--enforce_container_disk_quota="false" --executor_registration_timeout="1mins" --executor_shutdown_grace_period="5secs"
--fetcher_cache_dir="/tmp/Endpoint_SlaveEndpointTest_UnauthorizedRequest_0_DDuSTv/fetch" --fetcher_cache_size="2GB"
--frameworks_home="" --gc_delay="1weeks" --gc_disk_headroom="0.1" --hadoop_home="" --help="false"
--hostname_lookup="true" --http_authenticators="basic" --http_command_executor="false" --http_credentials="/tmp/Endpoint_SlaveEndpointTest_UnauthorizedRequest_0_DDuSTv/http_credentials"
--image_provisioner_backend="copy" --initialize_driver_logging="true" --isolation="posix/cpu,posix/mem"
--launcher_dir="/mesos/mesos-1.1.0/_build/src" --logbufsecs="0" --logging_level="INFO" --oversubscribed_resources_interval="15secs"
--perf_duration="10secs" --perf_interval="1mins" --qos_correction_interval_min="0ns" --quiet="false"
--recover="reconnect" --recovery_timeout="15mins" --registration_backoff_factor="10ms" --resources="cpus:2;gpus:0;mem:1024;disk:1024;ports:[31000-32000]"
--revocable_cpu_low_priority="true" --sandbox_directory="/mnt/mesos/sandbox" --strict="true"
--switch_user="true" --systemd_enable_support="true" --systemd_runtime_directory="/run/systemd/system"
--version="false" --work_dir="/tmp/Endpoint_SlaveEndpointTest_UnauthorizedRequest_0_DDuSTv"
I0708 05:45:43.022730 28131 credentials.hpp:86] Loading credential for authentication from
'/tmp/Endpoint_SlaveEndpointTest_UnauthorizedRequest_0_DDuSTv/credential'
I0708 05:45:43.022914 28131 slave.cpp:343] Agent using credential for: test-principal
I0708 05:45:43.022975 28131 credentials.hpp:37] Loading credentials for authentication from
'/tmp/Endpoint_SlaveEndpointTest_UnauthorizedRequest_0_DDuSTv/http_credentials'
I0708 05:45:43.023227 28131 slave.cpp:395] Using default 'basic' HTTP authenticator
I0708 05:45:43.023605 28131 resources.cpp:572] Parsing resources as JSON failed: cpus:2;gpus:0;mem:1024;disk:1024;ports:[31000-32000]
Trying semicolon-delimited string format instead
I0708 05:45:43.024096 28131 resources.cpp:572] Parsing resources as JSON failed: cpus:2;gpus:0;mem:1024;disk:1024;ports:[31000-32000]
Trying semicolon-delimited string format instead
I0708 05:45:43.024577 28131 slave.cpp:594] Agent resources: cpus(*):2; mem(*):1024; disk(*):1024;
ports(*):[31000-32000]
I0708 05:45:43.024654 28131 slave.cpp:602] Agent attributes: [  ]
I0708 05:45:43.024669 28131 slave.cpp:607] Agent hostname: 989c65822bae
I0708 05:45:43.026365 28134 state.cpp:57] Recovering state from '/tmp/Endpoint_SlaveEndpointTest_UnauthorizedRequest_0_DDuSTv/meta'
I0708 05:45:43.026448 28131 process.cpp:3322] Handling HTTP event for process 'slave(552)'
with path: '/slave(552)/monitor/statistics'
I0708 05:45:43.027079 28129 status_update_manager.cpp:200] Recovering status update manager
I0708 05:45:43.027431 28132 containerizer.cpp:522] Recovering containerizer
I0708 05:45:43.027639 28138 http.cpp:829] Authorizing principal 'test-principal' to GET the
'/monitor/statistics' endpoint
I0708 05:45:43.028645 28133 provisioner.cpp:253] Provisioner recovery complete
I0708 05:45:43.028975 28138 slave.cpp:4856] Finished recovery
I0708 05:45:43.029608 28138 slave.cpp:5028] Querying resource estimator for oversubscribable
resources
I0708 05:45:43.030043 28124 slave.cpp:5042] Received oversubscribable resources  from the
resource estimator
I0708 05:45:43.030323 28131 slave.cpp:841] Agent terminating
[       OK ] Endpoint/SlaveEndpointTest.UnauthorizedRequest/0 (20 ms)
[ RUN      ] Endpoint/SlaveEndpointTest.UnauthorizedRequest/1
I0708 05:45:43.041721 28105 containerizer.cpp:196] Using isolation: posix/cpu,posix/mem,filesystem/posix,network/cni
W0708 05:45:43.042613 28105 backend.cpp:75] Failed to create 'aufs' backend: AufsBackend requires
root privileges, but is running as user mesos
W0708 05:45:43.042784 28105 backend.cpp:75] Failed to create 'bind' backend: BindBackend requires
root privileges
I0708 05:45:43.046648 28124 slave.cpp:205] Agent started on 553)@172.17.0.2:36542
I0708 05:45:43.046675 28124 slave.cpp:206] Flags at startup: --acls="" --appc_simple_discovery_uri_prefix="http://"
--appc_store_dir="/tmp/mesos/store/appc" --authenticate_http="true" --authenticatee="crammd5"
--authentication_backoff_factor="1secs" --authorizer="local" --cgroups_cpu_enable_pids_and_tids_count="false"
--cgroups_enable_cfs="false" --cgroups_hierarchy="/sys/fs/cgroup" --cgroups_limit_swap="false"
--cgroups_root="mesos" --container_disk_watch_interval="15secs" --containerizers="mesos" --credential="/tmp/Endpoint_SlaveEndpointTest_UnauthorizedRequest_1_aKtFro/credential"
--default_role="*" --disk_watch_interval="1mins" --docker="docker" --docker_kill_orphans="true"
--docker_registry="https://registry-1.docker.io" --docker_remove_delay="6hrs" --docker_socket="/var/run/docker.sock"
--docker_stop_timeout="0ns" --docker_store_dir="/tmp/mesos/store/docker" --docker_volume_checkpoint_dir="/var/run/mesos/isolators/docker/volume"
--enforce_container_disk_quota="false" --executor_registration_timeout="1mins" --executor_shutdown_grace_period="5secs"
--fetcher_cache_dir="/tmp/Endpoint_SlaveEndpointTest_UnauthorizedRequest_1_aKtFro/fetch" --fetcher_cache_size="2GB"
--frameworks_home="" --gc_delay="1weeks" --gc_disk_headroom="0.1" --hadoop_home="" --help="false"
--hostname_lookup="true" --http_authenticators="basic" --http_command_executor="false" --http_credentials="/tmp/Endpoint_SlaveEndpointTest_UnauthorizedRequest_1_aKtFro/http_credentials"
--image_provisioner_backend="copy" --initialize_driver_logging="true" --isolation="posix/cpu,posix/mem"
--launcher_dir="/mesos/mesos-1.1.0/_build/src" --logbufsecs="0" --logging_level="INFO" --oversubscribed_resources_interval="15secs"
--perf_duration="10secs" --perf_interval="1mins" --qos_correction_interval_min="0ns" --quiet="false"
--recover="reconnect" --recovery_timeout="15mins" --registration_backoff_factor="10ms" --resources="cpus:2;gpus:0;mem:1024;disk:1024;ports:[31000-32000]"
--revocable_cpu_low_priority="true" --sandbox_directory="/mnt/mesos/sandbox" --strict="true"
--switch_user="true" --systemd_enable_support="true" --systemd_runtime_directory="/run/systemd/system"
--version="false" --work_dir="/tmp/Endpoint_SlaveEndpointTest_UnauthorizedRequest_1_aKtFro"
I0708 05:45:43.047209 28124 credentials.hpp:86] Loading credential for authentication from
'/tmp/Endpoint_SlaveEndpointTest_UnauthorizedRequest_1_aKtFro/credential'
I0708 05:45:43.047391 28124 slave.cpp:343] Agent using credential for: test-principal
I0708 05:45:43.047435 28124 credentials.hpp:37] Loading credentials for authentication from
'/tmp/Endpoint_SlaveEndpointTest_UnauthorizedRequest_1_aKtFro/http_credentials'
I0708 05:45:43.047708 28124 slave.cpp:395] Using default 'basic' HTTP authenticator
I0708 05:45:43.047999 28124 resources.cpp:572] Parsing resources as JSON failed: cpus:2;gpus:0;mem:1024;disk:1024;ports:[31000-32000]
Trying semicolon-delimited string format instead
I0708 05:45:43.048333 28124 resources.cpp:572] Parsing resources as JSON failed: cpus:2;gpus:0;mem:1024;disk:1024;ports:[31000-32000]
Trying semicolon-delimited string format instead
I0708 05:45:43.048784 28124 slave.cpp:594] Agent resources: cpus(*):2; mem(*):1024; disk(*):1024;
ports(*):[31000-32000]
I0708 05:45:43.048854 28124 slave.cpp:602] Agent attributes: [  ]
I0708 05:45:43.048868 28124 slave.cpp:607] Agent hostname: 989c65822bae
I0708 05:45:43.050441 28127 state.cpp:57] Recovering state from '/tmp/Endpoint_SlaveEndpointTest_UnauthorizedRequest_1_aKtFro/meta'
I0708 05:45:43.050504 28124 process.cpp:3322] Handling HTTP event for process 'slave(553)'
with path: '/slave(553)/monitor/statistics.json'
I0708 05:45:43.051167 28129 status_update_manager.cpp:200] Recovering status update manager
I0708 05:45:43.051384 28126 containerizer.cpp:522] Recovering containerizer
I0708 05:45:43.051576 28132 http.cpp:829] Authorizing principal 'test-principal' to GET the
'/monitor/statistics.json' endpoint
I0708 05:45:43.052630 28139 provisioner.cpp:253] Provisioner recovery complete
I0708 05:45:43.052839 28135 slave.cpp:4856] Finished recovery
I0708 05:45:43.053464 28135 slave.cpp:5028] Querying resource estimator for oversubscribable
resources
I0708 05:45:43.053751 28130 slave.cpp:5042] Received oversubscribable resources  from the
resource estimator
I0708 05:45:43.053812 28130 slave.cpp:841] Agent terminating
[       OK ] Endpoint/SlaveEndpointTest.UnauthorizedRequest/1 (21 ms)
[ RUN      ] Endpoint/SlaveEndpointTest.UnauthorizedRequest/2
I0708 05:45:43.068444 28105 containerizer.cpp:196] Using isolation: posix/cpu,posix/mem,filesystem/posix,network/cni
W0708 05:45:43.069231 28105 backend.cpp:75] Failed to create 'aufs' backend: AufsBackend requires
root privileges, but is running as user mesos
W0708 05:45:43.069365 28105 backend.cpp:75] Failed to create 'bind' backend: BindBackend requires
root privileges
I0708 05:45:43.072232 28130 slave.cpp:205] Agent started on 554)@172.17.0.2:36542
I0708 05:45:43.072269 28130 slave.cpp:206] Flags at startup: --acls="" --appc_simple_discovery_uri_prefix="http://"
--appc_store_dir="/tmp/mesos/store/appc" --authenticate_http="true" --authenticatee="crammd5"
--authentication_backoff_factor="1secs" --authorizer="local" --cgroups_cpu_enable_pids_and_tids_count="false"
--cgroups_enable_cfs="false" --cgroups_hierarchy="/sys/fs/cgroup" --cgroups_limit_swap="false"
--cgroups_root="mesos" --container_disk_watch_interval="15secs" --containerizers="mesos" --credential="/tmp/Endpoint_SlaveEndpointTest_UnauthorizedRequest_2_zraHbh/credential"
--default_role="*" --disk_watch_interval="1mins" --docker="docker" --docker_kill_orphans="true"
--docker_registry="https://registry-1.docker.io" --docker_remove_delay="6hrs" --docker_socket="/var/run/docker.sock"
--docker_stop_timeout="0ns" --docker_store_dir="/tmp/mesos/store/docker" --docker_volume_checkpoint_dir="/var/run/mesos/isolators/docker/volume"
--enforce_container_disk_quota="false" --executor_registration_timeout="1mins" --executor_shutdown_grace_period="5secs"
--fetcher_cache_dir="/tmp/Endpoint_SlaveEndpointTest_UnauthorizedRequest_2_zraHbh/fetch" --fetcher_cache_size="2GB"
--frameworks_home="" --gc_delay="1weeks" --gc_disk_headroom="0.1" --hadoop_home="" --help="false"
--hostname_lookup="true" --http_authenticators="basic" --http_command_executor="false" --http_credentials="/tmp/Endpoint_SlaveEndpointTest_UnauthorizedRequest_2_zraHbh/http_credentials"
--image_provisioner_backend="copy" --initialize_driver_logging="true" --isolation="posix/cpu,posix/mem"
--launcher_dir="/mesos/mesos-1.1.0/_build/src" --logbufsecs="0" --logging_level="INFO" --oversubscribed_resources_interval="15secs"
--perf_duration="10secs" --perf_interval="1mins" --qos_correction_interval_min="0ns" --quiet="false"
--recover="reconnect" --recovery_timeout="15mins" --registration_backoff_factor="10ms" --resources="cpus:2;gpus:0;mem:1024;disk:1024;ports:[31000-32000]"
--revocable_cpu_low_priority="true" --sandbox_directory="/mnt/mesos/sandbox" --strict="true"
--switch_user="true" --systemd_enable_support="true" --systemd_runtime_directory="/run/systemd/system"
--version="false" --work_dir="/tmp/Endpoint_SlaveEndpointTest_UnauthorizedRequest_2_zraHbh"
I0708 05:45:43.072813 28130 credentials.hpp:86] Loading credential for authentication from
'/tmp/Endpoint_SlaveEndpointTest_UnauthorizedRequest_2_zraHbh/credential'
I0708 05:45:43.073034 28130 slave.cpp:343] Agent using credential for: test-principal
I0708 05:45:43.073066 28130 credentials.hpp:37] Loading credentials for authentication from
'/tmp/Endpoint_SlaveEndpointTest_UnauthorizedRequest_2_zraHbh/http_credentials'
I0708 05:45:43.073285 28130 slave.cpp:395] Using default 'basic' HTTP authenticator
I0708 05:45:43.073768 28130 resources.cpp:572] Parsing resources as JSON failed: cpus:2;gpus:0;mem:1024;disk:1024;ports:[31000-32000]
Trying semicolon-delimited string format instead
I0708 05:45:43.074120 28130 resources.cpp:572] Parsing resources as JSON failed: cpus:2;gpus:0;mem:1024;disk:1024;ports:[31000-32000]
Trying semicolon-delimited string format instead
I0708 05:45:43.074455 28130 slave.cpp:594] Agent resources: cpus(*):2; mem(*):1024; disk(*):1024;
ports(*):[31000-32000]
I0708 05:45:43.074512 28130 slave.cpp:602] Agent attributes: [  ]
I0708 05:45:43.074523 28130 slave.cpp:607] Agent hostname: 989c65822bae
I0708 05:45:43.075918 28126 state.cpp:57] Recovering state from '/tmp/Endpoint_SlaveEndpointTest_UnauthorizedRequest_2_zraHbh/meta'
I0708 05:45:43.076023 28130 process.cpp:3322] Handling HTTP event for process 'slave(554)'
with path: '/slave(554)/containers'
I0708 05:45:43.076463 28126 status_update_manager.cpp:200] Recovering status update manager
I0708 05:45:43.076681 28124 containerizer.cpp:522] Recovering containerizer
I0708 05:45:43.077072 28126 http.cpp:829] Authorizing principal 'test-principal' to GET the
'/containers' endpoint
I0708 05:45:43.078073 28139 provisioner.cpp:253] Provisioner recovery complete
I0708 05:45:43.078313 28129 slave.cpp:4856] Finished recovery
I0708 05:45:43.078773 28129 slave.cpp:5028] Querying resource estimator for oversubscribable
resources
I0708 05:45:43.079057 28124 slave.cpp:5042] Received oversubscribable resources  from the
resource estimator
I0708 05:45:43.079133 28124 slave.cpp:841] Agent terminating
[       OK ] Endpoint/SlaveEndpointTest.UnauthorizedRequest/2 (20 ms)
[ RUN      ] Endpoint/SlaveEndpointTest.NoAuthorizer/0
I0708 05:45:43.093961 28105 containerizer.cpp:196] Using isolation: posix/cpu,posix/mem,filesystem/posix,network/cni
W0708 05:45:43.094640 28105 backend.cpp:75] Failed to create 'aufs' backend: AufsBackend requires
root privileges, but is running as user mesos
W0708 05:45:43.094779 28105 backend.cpp:75] Failed to create 'bind' backend: BindBackend requires
root privileges
I0708 05:45:43.096813 28105 cluster.cpp:432] Creating default 'local' authorizer
I0708 05:45:43.098603 28133 slave.cpp:205] Agent started on 555)@172.17.0.2:36542
I0708 05:45:43.098698 28133 slave.cpp:206] Flags at startup: --acls="" --appc_simple_discovery_uri_prefix="http://"
--appc_store_dir="/tmp/mesos/store/appc" --authenticate_http="true" --authenticatee="crammd5"
--authentication_backoff_factor="1secs" --authorizer="local" --cgroups_cpu_enable_pids_and_tids_count="false"
--cgroups_enable_cfs="false" --cgroups_hierarchy="/sys/fs/cgroup" --cgroups_limit_swap="false"
--cgroups_root="mesos" --container_disk_watch_interval="15secs" --containerizers="mesos" --credential="/tmp/Endpoint_SlaveEndpointTest_NoAuthorizer_0_SGnx89/credential"
--default_role="*" --disk_watch_interval="1mins" --docker="docker" --docker_kill_orphans="true"
--docker_registry="https://registry-1.docker.io" --docker_remove_delay="6hrs" --docker_socket="/var/run/docker.sock"
--docker_stop_timeout="0ns" --docker_store_dir="/tmp/mesos/store/docker" --docker_volume_checkpoint_dir="/var/run/mesos/isolators/docker/volume"
--enforce_container_disk_quota="false" --executor_registration_timeout="1mins" --executor_shutdown_grace_period="5secs"
--fetcher_cache_dir="/tmp/Endpoint_SlaveEndpointTest_NoAuthorizer_0_SGnx89/fetch" --fetcher_cache_size="2GB"
--frameworks_home="" --gc_delay="1weeks" --gc_disk_headroom="0.1" --hadoop_home="" --help="false"
--hostname_lookup="true" --http_authenticators="basic" --http_command_executor="false" --http_credentials="/tmp/Endpoint_SlaveEndpointTest_NoAuthorizer_0_SGnx89/http_credentials"
--image_provisioner_backend="copy" --initialize_driver_logging="true" --isolation="posix/cpu,posix/mem"
--launcher_dir="/mesos/mesos-1.1.0/_build/src" --logbufsecs="0" --logging_level="INFO" --oversubscribed_resources_interval="15secs"
--perf_duration="10secs" --perf_interval="1mins" --qos_correction_interval_min="0ns" --quiet="false"
--recover="reconnect" --recovery_timeout="15mins" --registration_backoff_factor="10ms" --resources="cpus:2;gpus:0;mem:1024;disk:1024;ports:[31000-32000]"
--revocable_cpu_low_priority="true" --sandbox_directory="/mnt/mesos/sandbox" --strict="true"
--switch_user="true" --systemd_enable_support="true" --systemd_runtime_directory="/run/systemd/system"
--version="false" --work_dir="/tmp/Endpoint_SlaveEndpointTest_NoAuthorizer_0_SGnx89"
I0708 05:45:43.099164 28133 credentials.hpp:86] Loading credential for authentication from
'/tmp/Endpoint_SlaveEndpointTest_NoAuthorizer_0_SGnx89/credential'
I0708 05:45:43.099325 28133 slave.cpp:343] Agent using credential for: test-principal
I0708 05:45:43.099357 28133 credentials.hpp:37] Loading credentials for authentication from
'/tmp/Endpoint_SlaveEndpointTest_NoAuthorizer_0_SGnx89/http_credentials'
I0708 05:45:43.099637 28133 slave.cpp:395] Using default 'basic' HTTP authenticator
I0708 05:45:43.100041 28133 resources.cpp:572] Parsing resources as JSON failed: cpus:2;gpus:0;mem:1024;disk:1024;ports:[31000-32000]
Trying semicolon-delimited string format instead
I0708 05:45:43.100370 28133 resources.cpp:572] Parsing resources as JSON failed: cpus:2;gpus:0;mem:1024;disk:1024;ports:[31000-32000]
Trying semicolon-delimited string format instead
I0708 05:45:43.100704 28133 slave.cpp:594] Agent resources: cpus(*):2; mem(*):1024; disk(*):1024;
ports(*):[31000-32000]
I0708 05:45:43.100762 28133 slave.cpp:602] Agent attributes: [  ]
I0708 05:45:43.100775 28133 slave.cpp:607] Agent hostname: 989c65822bae
I0708 05:45:43.102227 28139 state.cpp:57] Recovering state from '/tmp/Endpoint_SlaveEndpointTest_NoAuthorizer_0_SGnx89/meta'
I0708 05:45:43.102257 28133 process.cpp:3322] Handling HTTP event for process 'slave(555)'
with path: '/slave(555)/monitor/statistics'
I0708 05:45:43.102712 28127 status_update_manager.cpp:200] Recovering status update manager
I0708 05:45:43.102854 28135 containerizer.cpp:522] Recovering containerizer
I0708 05:45:43.103159 28124 http.cpp:829] Authorizing principal 'test-principal' to GET the
'/monitor/statistics' endpoint
I0708 05:45:43.104164 28130 provisioner.cpp:253] Provisioner recovery complete
I0708 05:45:43.104557 28124 slave.cpp:4856] Finished recovery
I0708 05:45:43.105005 28124 slave.cpp:5028] Querying resource estimator for oversubscribable
resources
I0708 05:45:43.105234 28132 slave.cpp:5042] Received oversubscribable resources  from the
resource estimator
I0708 05:45:43.106526 28138 slave.cpp:841] Agent terminating
[       OK ] Endpoint/SlaveEndpointTest.NoAuthorizer/0 (21 ms)
[ RUN      ] Endpoint/SlaveEndpointTest.NoAuthorizer/1
I0708 05:45:43.121018 28105 containerizer.cpp:196] Using isolation: posix/cpu,posix/mem,filesystem/posix,network/cni
W0708 05:45:43.121778 28105 backend.cpp:75] Failed to create 'aufs' backend: AufsBackend requires
root privileges, but is running as user mesos
W0708 05:45:43.121975 28105 backend.cpp:75] Failed to create 'bind' backend: BindBackend requires
root privileges
I0708 05:45:43.123680 28105 cluster.cpp:432] Creating default 'local' authorizer
I0708 05:45:43.125869 28137 slave.cpp:205] Agent started on 556)@172.17.0.2:36542
I0708 05:45:43.125898 28137 slave.cpp:206] Flags at startup: --acls="" --appc_simple_discovery_uri_prefix="http://"
--appc_store_dir="/tmp/mesos/store/appc" --authenticate_http="true" --authenticatee="crammd5"
--authentication_backoff_factor="1secs" --authorizer="local" --cgroups_cpu_enable_pids_and_tids_count="false"
--cgroups_enable_cfs="false" --cgroups_hierarchy="/sys/fs/cgroup" --cgroups_limit_swap="false"
--cgroups_root="mesos" --container_disk_watch_interval="15secs" --containerizers="mesos" --credential="/tmp/Endpoint_SlaveEndpointTest_NoAuthorizer_1_PRt5h3/credential"
--default_role="*" --disk_watch_interval="1mins" --docker="docker" --docker_kill_orphans="true"
--docker_registry="https://registry-1.docker.io" --docker_remove_delay="6hrs" --docker_socket="/var/run/docker.sock"
--docker_stop_timeout="0ns" --docker_store_dir="/tmp/mesos/store/docker" --docker_volume_checkpoint_dir="/var/run/mesos/isolators/docker/volume"
--enforce_container_disk_quota="false" --executor_registration_timeout="1mins" --executor_shutdown_grace_period="5secs"
--fetcher_cache_dir="/tmp/Endpoint_SlaveEndpointTest_NoAuthorizer_1_PRt5h3/fetch" --fetcher_cache_size="2GB"
--frameworks_home="" --gc_delay="1weeks" --gc_disk_headroom="0.1" --hadoop_home="" --help="false"
--hostname_lookup="true" --http_authenticators="basic" --http_command_executor="false" --http_credentials="/tmp/Endpoint_SlaveEndpointTest_NoAuthorizer_1_PRt5h3/http_credentials"
--image_provisioner_backend="copy" --initialize_driver_logging="true" --isolation="posix/cpu,posix/mem"
--launcher_dir="/mesos/mesos-1.1.0/_build/src" --logbufsecs="0" --logging_level="INFO" --oversubscribed_resources_interval="15secs"
--perf_duration="10secs" --perf_interval="1mins" --qos_correction_interval_min="0ns" --quiet="false"
--recover="reconnect" --recovery_timeout="15mins" --registration_backoff_factor="10ms" --resources="cpus:2;gpus:0;mem:1024;disk:1024;ports:[31000-32000]"
--revocable_cpu_low_priority="true" --sandbox_directory="/mnt/mesos/sandbox" --strict="true"
--switch_user="true" --systemd_enable_support="true" --systemd_runtime_directory="/run/systemd/system"
--version="false" --work_dir="/tmp/Endpoint_SlaveEndpointTest_NoAuthorizer_1_PRt5h3"
I0708 05:45:43.126505 28137 credentials.hpp:86] Loading credential for authentication from
'/tmp/Endpoint_SlaveEndpointTest_NoAuthorizer_1_PRt5h3/credential'
I0708 05:45:43.126736 28137 slave.cpp:343] Agent using credential for: test-principal
I0708 05:45:43.126780 28137 credentials.hpp:37] Loading credentials for authentication from
'/tmp/Endpoint_SlaveEndpointTest_NoAuthorizer_1_PRt5h3/http_credentials'
I0708 05:45:43.127073 28137 slave.cpp:395] Using default 'basic' HTTP authenticator
I0708 05:45:43.127362 28137 resources.cpp:572] Parsing resources as JSON failed: cpus:2;gpus:0;mem:1024;disk:1024;ports:[31000-32000]
Trying semicolon-delimited string format instead
I0708 05:45:43.127637 28137 resources.cpp:572] Parsing resources as JSON failed: cpus:2;gpus:0;mem:1024;disk:1024;ports:[31000-32000]
Trying semicolon-delimited string format instead
I0708 05:45:43.128120 28137 slave.cpp:594] Agent resources: cpus(*):2; mem(*):1024; disk(*):1024;
ports(*):[31000-32000]
I0708 05:45:43.128181 28137 slave.cpp:602] Agent attributes: [  ]
I0708 05:45:43.128198 28137 slave.cpp:607] Agent hostname: 989c65822bae
I0708 05:45:43.129500 28130 state.cpp:57] Recovering state from '/tmp/Endpoint_SlaveEndpointTest_NoAuthorizer_1_PRt5h3/meta'
I0708 05:45:43.129578 28137 process.cpp:3322] Handling HTTP event for process 'slave(556)'
with path: '/slave(556)/monitor/statistics.json'
I0708 05:45:43.129992 28124 status_update_manager.cpp:200] Recovering status update manager
I0708 05:45:43.130260 28137 containerizer.cpp:522] Recovering containerizer
I0708 05:45:43.130583 28124 http.cpp:829] Authorizing principal 'test-principal' to GET the
'/monitor/statistics.json' endpoint
I0708 05:45:43.131342 28139 provisioner.cpp:253] Provisioner recovery complete
I0708 05:45:43.132145 28128 slave.cpp:4856] Finished recovery
I0708 05:45:43.132644 28128 slave.cpp:5028] Querying resource estimator for oversubscribable
resources
I0708 05:45:43.132901 28128 slave.cpp:5042] Received oversubscribable resources  from the
resource estimator
I0708 05:45:43.134024 28132 slave.cpp:841] Agent terminating
[       OK ] Endpoint/SlaveEndpointTest.NoAuthorizer/1 (21 ms)
[ RUN      ] Endpoint/SlaveEndpointTest.NoAuthorizer/2
I0708 05:45:43.145426 28105 containerizer.cpp:196] Using isolation: posix/cpu,posix/mem,filesystem/posix,network/cni
W0708 05:45:43.146096 28105 backend.cpp:75] Failed to create 'aufs' backend: AufsBackend requires
root privileges, but is running as user mesos
W0708 05:45:43.146240 28105 backend.cpp:75] Failed to create 'bind' backend: BindBackend requires
root privileges
I0708 05:45:43.147641 28105 cluster.cpp:432] Creating default 'local' authorizer
I0708 05:45:43.149197 28132 slave.cpp:205] Agent started on 557)@172.17.0.2:36542
I0708 05:45:43.149220 28132 slave.cpp:206] Flags at startup: --acls="" --appc_simple_discovery_uri_prefix="http://"
--appc_store_dir="/tmp/mesos/store/appc" --authenticate_http="true" --authenticatee="crammd5"
--authentication_backoff_factor="1secs" --authorizer="local" --cgroups_cpu_enable_pids_and_tids_count="false"
--cgroups_enable_cfs="false" --cgroups_hierarchy="/sys/fs/cgroup" --cgroups_limit_swap="false"
--cgroups_root="mesos" --container_disk_watch_interval="15secs" --containerizers="mesos" --credential="/tmp/Endpoint_SlaveEndpointTest_NoAuthorizer_2_OW0oEW/credential"
--default_role="*" --disk_watch_interval="1mins" --docker="docker" --docker_kill_orphans="true"
--docker_registry="https://registry-1.docker.io" --docker_remove_delay="6hrs" --docker_socket="/var/run/docker.sock"
--docker_stop_timeout="0ns" --docker_store_dir="/tmp/mesos/store/docker" --docker_volume_checkpoint_dir="/var/run/mesos/isolators/docker/volume"
--enforce_container_disk_quota="false" --executor_registration_timeout="1mins" --executor_shutdown_grace_period="5secs"
--fetcher_cache_dir="/tmp/Endpoint_SlaveEndpointTest_NoAuthorizer_2_OW0oEW/fetch" --fetcher_cache_size="2GB"
--frameworks_home="" --gc_delay="1weeks" --gc_disk_headroom="0.1" --hadoop_home="" --help="false"
--hostname_lookup="true" --http_authenticators="basic" --http_command_executor="false" --http_credentials="/tmp/Endpoint_SlaveEndpointTest_NoAuthorizer_2_OW0oEW/http_credentials"
--image_provisioner_backend="copy" --initialize_driver_logging="true" --isolation="posix/cpu,posix/mem"
--launcher_dir="/mesos/mesos-1.1.0/_build/src" --logbufsecs="0" --logging_level="INFO" --oversubscribed_resources_interval="15secs"
--perf_duration="10secs" --perf_interval="1mins" --qos_correction_interval_min="0ns" --quiet="false"
--recover="reconnect" --recovery_timeout="15mins" --registration_backoff_factor="10ms" --resources="cpus:2;gpus:0;mem:1024;disk:1024;ports:[31000-32000]"
--revocable_cpu_low_priority="true" --sandbox_directory="/mnt/mesos/sandbox" --strict="true"
--switch_user="true" --systemd_enable_support="true" --systemd_runtime_directory="/run/systemd/system"
--version="false" --work_dir="/tmp/Endpoint_SlaveEndpointTest_NoAuthorizer_2_OW0oEW"
I0708 05:45:43.149819 28132 credentials.hpp:86] Loading credential for authentication from
'/tmp/Endpoint_SlaveEndpointTest_NoAuthorizer_2_OW0oEW/credential'
I0708 05:45:43.150066 28132 slave.cpp:343] Agent using credential for: test-principal
I0708 05:45:43.150096 28132 credentials.hpp:37] Loading credentials for authentication from
'/tmp/Endpoint_SlaveEndpointTest_NoAuthorizer_2_OW0oEW/http_credentials'
I0708 05:45:43.150353 28132 slave.cpp:395] Using default 'basic' HTTP authenticator
I0708 05:45:43.150637 28132 resources.cpp:572] Parsing resources as JSON failed: cpus:2;gpus:0;mem:1024;disk:1024;ports:[31000-32000]
Trying semicolon-delimited string format instead
I0708 05:45:43.150888 28132 resources.cpp:572] Parsing resources as JSON failed: cpus:2;gpus:0;mem:1024;disk:1024;ports:[31000-32000]
Trying semicolon-delimited string format instead
I0708 05:45:43.151224 28132 slave.cpp:594] Agent resources: cpus(*):2; mem(*):1024; disk(*):1024;
ports(*):[31000-32000]
I0708 05:45:43.151278 28132 slave.cpp:602] Agent attributes: [  ]
I0708 05:45:43.151288 28132 slave.cpp:607] Agent hostname: 989c65822bae
I0708 05:45:43.152525 28137 state.cpp:57] Recovering state from '/tmp/Endpoint_SlaveEndpointTest_NoAuthorizer_2_OW0oEW/meta'
I0708 05:45:43.152537 28132 process.cpp:3322] Handling HTTP event for process 'slave(557)'
with path: '/slave(557)/containers'
I0708 05:45:43.153385 28133 status_update_manager.cpp:200] Recovering status update manager
I0708 05:45:43.153642 28129 containerizer.cpp:522] Recovering containerizer
I0708 05:45:43.153812 28124 http.cpp:829] Authorizing principal 'test-principal' to GET the
'/containers' endpoint
I0708 05:45:43.155115 28127 provisioner.cpp:253] Provisioner recovery complete
I0708 05:45:43.155400 28129 slave.cpp:4856] Finished recovery
I0708 05:45:43.156069 28129 slave.cpp:5028] Querying resource estimator for oversubscribable
resources
I0708 05:45:43.156635 28135 slave.cpp:5042] Received oversubscribable resources  from the
resource estimator
I0708 05:45:43.158004 28128 slave.cpp:841] Agent terminating
[       OK ] Endpoint/SlaveEndpointTest.NoAuthorizer/2 (21 ms)
[----------] 9 tests from Endpoint/SlaveEndpointTest (237 ms total)

[----------] Global test environment tear-down
[==========] 1236 tests from 139 test cases ran. (961650 ms total)
[  PASSED  ] 1234 tests.
[  FAILED  ] 2 tests, listed below:
[  FAILED  ] ContentType/MasterAPITest.GetAgents/0, where GetParam() = application/x-protobuf
[  FAILED  ] ContentType/MasterAPITest.GetAgents/1, where GetParam() = application/json

 2 FAILED TESTS
  YOU HAVE 6 DISABLED TESTS

make[4]: *** [check-local] Error 1
make[4]: Leaving directory `/mesos/mesos-1.1.0/_build/src'
make[3]: *** [check-am] Error 2
make[3]: Leaving directory `/mesos/mesos-1.1.0/_build/src'
make[2]: *** [check] Error 2
make[2]: Leaving directory `/mesos/mesos-1.1.0/_build/src'
make[1]: *** [check-recursive] Error 1
make[1]: Leaving directory `/mesos/mesos-1.1.0/_build'
make: *** [distcheck] Error 1
+ docker rmi mesos-1467953754-12101
Untagged: mesos-1467953754-12101:latest
Deleted: 9df640c810c85f15d592ec26a1963010a6942c1374e6887c2b6e0a34d6ade2c4
Deleted: bc3bf275640588ebcbcc9abd99ab0033c3710c82c6ccd89bddf01de285ac11c7
Deleted: 6da3a8a3587adbac3a7d85ad487eedc9a1481081ea8102a3b703ee506d27cdca
Deleted: d5bf61da88845e2da7d33692e3fe5907512ff1bd35b23f9a4c1adafa65b506f0
Deleted: fb947a52f9e18bbd3a30e469e82ddd9cb69f54d6a42e3b88304b975f1befacaa
Deleted: d71790f8ce6e29b718caaf7e5ff91c696e41f26ebd0a66a753a580644cd5c22f
Deleted: 31dfda1a8403541e62da400aed81f26f6ae901423578ab2dc058e6cda270b0cb
Deleted: b7d9dd6c138e74963f3301612dbe2f9bc7abc5563f246453783c9c2b897fef1b
Deleted: 6b0c9e983e831312b03a16b8b4ceddee00fb628e14636c01981f25b0e86e9c27
Deleted: c041deba99813066a966f499d35f9aad924b44bc1ecf8490950a1cfce75fed64
Deleted: a79a916fab6f83693c5a7dce2a2cf4249b44bb83001cca32c48951d20be4bdd9
Deleted: 1fffe219daa39b47eb3886d03d8fbf58806415f18d0d3220948fcdd8791aa9f6
Deleted: 7b1b6c1a2186d83438ebc453296598453e0201cde0ab6365cf10c635fa7a5c9a
Deleted: 60bd74479fb4f62867c0329e85fb72edc1da9efd9277f21fe1819d68877d13b9
Deleted: 2d77faa265f9822a50d6c77a41d6aebc3cd54d3638e0aba10d87be1abe296fe3
Build step 'Execute shell' marked build as failure

Mime
View raw message