mesos-builds mailing list archives

Site index · List index
Message view « Date » · « Thread »
Top « Date » · « Thread »
From Apache Jenkins Server <jenk...@builds.apache.org>
Subject Build failed in Jenkins: mesos-reviewbot #14172
Date Wed, 06 Jul 2016 05:22:50 GMT
See <https://builds.apache.org/job/mesos-reviewbot/14172/changes>

Changes:

[bmahler] Fixed a whitespace rendering issue in the work groups document.

[bmahler] Added test for using an Nvidia Docker image.

[bmahler] Updated JSON::Value.find to return None when a Null is found.

[bmahler] Minor cleanups in JsonTest.Find.

[bmahler] Fixed a bug in JSON::Object.find: array subscript is dropped.

[bmahler] Fixed the docker executor to handle inspect failures.

------------------------------------------
[...truncated 11647 lines...]
[       OK ] SystemsTests.Sysname (0 ms)
[ RUN      ] SystemsTests.Release
[       OK ] SystemsTests.Release (0 ms)
[----------] 3 tests from SystemsTests (0 ms total)

[----------] 6 tests from PathTest
[ RUN      ] PathTest.Basename
[       OK ] PathTest.Basename (0 ms)
[ RUN      ] PathTest.Dirname
[       OK ] PathTest.Dirname (0 ms)
[ RUN      ] PathTest.Extension
[       OK ] PathTest.Extension (0 ms)
[ RUN      ] PathTest.Join
[       OK ] PathTest.Join (0 ms)
[ RUN      ] PathTest.Absolute
[       OK ] PathTest.Absolute (0 ms)
[ RUN      ] PathTest.Comparison
[       OK ] PathTest.Comparison (0 ms)
[----------] 6 tests from PathTest (0 ms total)

[----------] 1 test from PathFileTest
[ RUN      ] PathFileTest.ImplicitConversion
[       OK ] PathFileTest.ImplicitConversion (1 ms)
[----------] 1 test from PathFileTest (1 ms total)

[----------] 10 tests from ProtobufTest
[ RUN      ] ProtobufTest.JSON
[       OK ] ProtobufTest.JSON (2 ms)
[ RUN      ] ProtobufTest.JSONArray
[       OK ] ProtobufTest.JSONArray (0 ms)
[ RUN      ] ProtobufTest.JsonLargeIntegers
[       OK ] ProtobufTest.JsonLargeIntegers (0 ms)
[ RUN      ] ProtobufTest.SimpleMessageEquals
[       OK ] ProtobufTest.SimpleMessageEquals (0 ms)
[ RUN      ] ProtobufTest.ParseJSONArray
[       OK ] ProtobufTest.ParseJSONArray (0 ms)
[ RUN      ] ProtobufTest.ParseJSONNull
[       OK ] ProtobufTest.ParseJSONNull (1 ms)
[ RUN      ] ProtobufTest.ParseJSONNestedError
[       OK ] ProtobufTest.ParseJSONNestedError (0 ms)
[ RUN      ] ProtobufTest.Jsonify
[       OK ] ProtobufTest.Jsonify (0 ms)
[ RUN      ] ProtobufTest.JsonifyArray
[       OK ] ProtobufTest.JsonifyArray (0 ms)
[ RUN      ] ProtobufTest.JsonifyLargeIntegers
[       OK ] ProtobufTest.JsonifyLargeIntegers (0 ms)
[----------] 10 tests from ProtobufTest (3 ms total)

[----------] 2 tests from RecordIOTest
[ RUN      ] RecordIOTest.Encoder
[       OK ] RecordIOTest.Encoder (0 ms)
[ RUN      ] RecordIOTest.Decoder
[       OK ] RecordIOTest.Decoder (0 ms)
[----------] 2 tests from RecordIOTest (0 ms total)

[----------] 2 tests from ResultTest
[ RUN      ] ResultTest.TryToResultConversion
[       OK ] ResultTest.TryToResultConversion (0 ms)
[ RUN      ] ResultTest.ArrowOperator
[       OK ] ResultTest.ArrowOperator (0 ms)
[----------] 2 tests from ResultTest (0 ms total)

[----------] 1 test from SetTest
[ RUN      ] SetTest.Set
[       OK ] SetTest.Set (0 ms)
[----------] 1 test from SetTest (0 ms total)

[----------] 1 test from SomeTest
[ RUN      ] SomeTest.Some
[       OK ] SomeTest.Some (0 ms)
[----------] 1 test from SomeTest (0 ms total)

[----------] 39 tests from StringsTest
[ RUN      ] StringsTest.Format
[       OK ] StringsTest.Format (0 ms)
[ RUN      ] StringsTest.Remove
[       OK ] StringsTest.Remove (0 ms)
[ RUN      ] StringsTest.Replace
[       OK ] StringsTest.Replace (0 ms)
[ RUN      ] StringsTest.Trim
[       OK ] StringsTest.Trim (0 ms)
[ RUN      ] StringsTest.Tokenize
[       OK ] StringsTest.Tokenize (0 ms)
[ RUN      ] StringsTest.TokenizeStringWithDelimsAtStart
[       OK ] StringsTest.TokenizeStringWithDelimsAtStart (0 ms)
[ RUN      ] StringsTest.TokenizeStringWithDelimsAtEnd
[       OK ] StringsTest.TokenizeStringWithDelimsAtEnd (0 ms)
[ RUN      ] StringsTest.TokenizeStringWithDelimsAtStartAndEnd
[       OK ] StringsTest.TokenizeStringWithDelimsAtStartAndEnd (0 ms)
[ RUN      ] StringsTest.TokenizeWithMultipleDelims
[       OK ] StringsTest.TokenizeWithMultipleDelims (0 ms)
[ RUN      ] StringsTest.TokenizeEmptyString
[       OK ] StringsTest.TokenizeEmptyString (0 ms)
[ RUN      ] StringsTest.TokenizeDelimOnlyString
[       OK ] StringsTest.TokenizeDelimOnlyString (0 ms)
[ RUN      ] StringsTest.TokenizeNullByteDelim
[       OK ] StringsTest.TokenizeNullByteDelim (0 ms)
[ RUN      ] StringsTest.TokenizeNZero
[       OK ] StringsTest.TokenizeNZero (0 ms)
[ RUN      ] StringsTest.TokenizeNOne
[       OK ] StringsTest.TokenizeNOne (0 ms)
[ RUN      ] StringsTest.TokenizeNDelimOnlyString
[       OK ] StringsTest.TokenizeNDelimOnlyString (0 ms)
[ RUN      ] StringsTest.TokenizeN
[       OK ] StringsTest.TokenizeN (0 ms)
[ RUN      ] StringsTest.TokenizeNStringWithDelimsAtStart
[       OK ] StringsTest.TokenizeNStringWithDelimsAtStart (0 ms)
[ RUN      ] StringsTest.TokenizeNStringWithDelimsAtEnd
[       OK ] StringsTest.TokenizeNStringWithDelimsAtEnd (0 ms)
[ RUN      ] StringsTest.TokenizeNStringWithDelimsAtStartAndEnd
[       OK ] StringsTest.TokenizeNStringWithDelimsAtStartAndEnd (0 ms)
[ RUN      ] StringsTest.TokenizeNWithMultipleDelims
[       OK ] StringsTest.TokenizeNWithMultipleDelims (0 ms)
[ RUN      ] StringsTest.SplitEmptyString
[       OK ] StringsTest.SplitEmptyString (0 ms)
[ RUN      ] StringsTest.SplitDelimOnlyString
[       OK ] StringsTest.SplitDelimOnlyString (0 ms)
[ RUN      ] StringsTest.Split
[       OK ] StringsTest.Split (1 ms)
[ RUN      ] StringsTest.SplitStringWithDelimsAtStart
[       OK ] StringsTest.SplitStringWithDelimsAtStart (0 ms)
[ RUN      ] StringsTest.SplitStringWithDelimsAtEnd
[       OK ] StringsTest.SplitStringWithDelimsAtEnd (0 ms)
[ RUN      ] StringsTest.SplitStringWithDelimsAtStartAndEnd
[       OK ] StringsTest.SplitStringWithDelimsAtStartAndEnd (0 ms)
[ RUN      ] StringsTest.SplitWithMultipleDelims
[       OK ] StringsTest.SplitWithMultipleDelims (0 ms)
[ RUN      ] StringsTest.SplitNZero
[       OK ] StringsTest.SplitNZero (0 ms)
[ RUN      ] StringsTest.SplitNOne
[       OK ] StringsTest.SplitNOne (0 ms)
[ RUN      ] StringsTest.SplitNDelimOnlyString
[       OK ] StringsTest.SplitNDelimOnlyString (0 ms)
[ RUN      ] StringsTest.SplitN
[       OK ] StringsTest.SplitN (0 ms)
[ RUN      ] StringsTest.SplitNStringWithDelimsAtStart
[       OK ] StringsTest.SplitNStringWithDelimsAtStart (0 ms)
[ RUN      ] StringsTest.SplitNStringWithDelimsAtEnd
[       OK ] StringsTest.SplitNStringWithDelimsAtEnd (0 ms)
[ RUN      ] StringsTest.SplitNStringWithDelimsAtStartAndEnd
[       OK ] StringsTest.SplitNStringWithDelimsAtStartAndEnd (0 ms)
[ RUN      ] StringsTest.SplitNWithMultipleDelims
[       OK ] StringsTest.SplitNWithMultipleDelims (0 ms)
[ RUN      ] StringsTest.Pairs
[       OK ] StringsTest.Pairs (0 ms)
[ RUN      ] StringsTest.Join
[       OK ] StringsTest.Join (0 ms)
[ RUN      ] StringsTest.StartsWith
[       OK ] StringsTest.StartsWith (0 ms)
[ RUN      ] StringsTest.Contains
[       OK ] StringsTest.Contains (0 ms)
[----------] 39 tests from StringsTest (1 ms total)

[----------] 2 tests from SubcommandTest
[ RUN      ] SubcommandTest.Flags
[       OK ] SubcommandTest.Flags (0 ms)
[ RUN      ] SubcommandTest.Dispatch
[       OK ] SubcommandTest.Dispatch (0 ms)
[----------] 2 tests from SubcommandTest (0 ms total)

[----------] 2 tests from SVNTest
[ RUN      ] SVNTest.DiffPatch
Subcommand 'subcommand' is not available
Usage: command <subcommand> [OPTIONS]

Available subcommands:
    help
    subcommand2

Multiple subcommands have name 'subcommand'
[       OK ] SVNTest.DiffPatch (41 ms)
[ RUN      ] SVNTest.EmptyDiffPatch
[       OK ] SVNTest.EmptyDiffPatch (38 ms)
[----------] 2 tests from SVNTest (79 ms total)

[----------] 1 test from TryTest
[ RUN      ] TryTest.ArrowOperator
[       OK ] TryTest.ArrowOperator (0 ms)
[----------] 1 test from TryTest (0 ms total)

[----------] 2 tests from UUIDTest
[ RUN      ] UUIDTest.Test
[       OK ] UUIDTest.Test (0 ms)
[ RUN      ] UUIDTest.MalformedUUID
[       OK ] UUIDTest.MalformedUUID (0 ms)
[----------] 2 tests from UUIDTest (0 ms total)

[----------] 2 tests from VersionTest
[ RUN      ] VersionTest.Comparison
[       OK ] VersionTest.Comparison (0 ms)
[ RUN      ] VersionTest.Parse
[       OK ] VersionTest.Parse (1 ms)
[----------] 2 tests from VersionTest (1 ms total)

[----------] 6 tests from ProcTest
[ RUN      ] ProcTest.Pids
[       OK ] ProcTest.Pids (0 ms)
[ RUN      ] ProcTest.Cpus
[       OK ] ProcTest.Cpus (1 ms)
[ RUN      ] ProcTest.SystemStatus
[       OK ] ProcTest.SystemStatus (0 ms)
[ RUN      ] ProcTest.ProcessStatus
[       OK ] ProcTest.ProcessStatus (0 ms)
[ RUN      ] ProcTest.SingleThread
[       OK ] ProcTest.SingleThread (0 ms)
[ RUN      ] ProcTest.MultipleThreads
[       OK ] ProcTest.MultipleThreads (1 ms)
[----------] 6 tests from ProcTest (2 ms total)

[----------] Global test environment tear-down
[==========] 269 tests from 47 test cases ran. (393 ms total)
[  PASSED  ] 268 tests.
[  FAILED  ] 1 test, listed below:
[  FAILED  ] JsonTest.Find

 1 FAILED TEST
make[7]: *** [check-local] Error 1
make[7]: Leaving directory `/mesos/mesos-1.0.0/_build/3rdparty/stout'
make[6]: *** [check-am] Error 2
make[6]: Leaving directory `/mesos/mesos-1.0.0/_build/3rdparty/stout'
make[5]: Leaving directory `/mesos/mesos-1.0.0/_build/3rdparty/stout'
make[5]: *** [check-recursive] Error 1
make[4]: *** [check] Error 2
make[4]: Leaving directory `/mesos/mesos-1.0.0/_build/3rdparty/stout'
make[3]: *** [check-recursive] Error 1
make[3]: Leaving directory `/mesos/mesos-1.0.0/_build/3rdparty'
make[2]: *** [check] Error 2
make[2]: Leaving directory `/mesos/mesos-1.0.0/_build/3rdparty'
make[1]: *** [check-recursive] Error 1
make[1]: Leaving directory `/mesos/mesos-1.0.0/_build'
make: *** [distcheck] Error 1
+ docker rmi mesos-1467781125-25619
Untagged: mesos-1467781125-25619:latest
Deleted: 1f04e56633e701e96d1a636825cd5de0f1e5061ba549756069ef83403381ba0b
Deleted: b58f013939ba5ac393d8c835edfa2482ade33fef5260e3c47f20de463f00bcd6
Deleted: 52cefbc27f7c4d000e21cd76ae0ea45beb85887e0d56dfa70934c528dbaa137c
Deleted: 745e2e7a312d0e75ea29b38c7fd0dff663ff96022bc7d7075130b311f19445e6
Deleted: 291b584e29cb2e567b5b5ddac6f0477ccc1316c75ea470795267397e5dc57de5
Deleted: a4167ed7ee918efdacc99ae40a4ae6bc84268e781a3a17a0e35f693261b2085b
Deleted: 41f8b199dbdf6a3716346bee29b47b5d0f2799acc98a6151b5b35662944124b8
Deleted: a47e5fe87d0d502ae5afc85531fdf36f22132cf994c030d601fab90a922982df
Deleted: a358ad00b5015f6dc1f3c816faab39b4ff6d7415c36fa0d9468e86f4eac47477
Deleted: 619a667d86a5670475029d4edd3dd40535c74efbeb4737658ebc0766f27b615e
Deleted: b1a250e7f1dd7da8f5897c4f366e4fcc99c23bef47ce200ae9721b787126eb71
Deleted: 17a4d84baf4d9d82f78cae616a1b909de903f40ddc1e1663d7524f29986cc04b
Deleted: 4af66868b7418423e1d613faa7800700a92f83680b1869adb214f1e8617e4d67
Deleted: 3bb6fdbd997c9094408870cf4b4c84e676329fad3b4d25e190cdc57eef6cef70
Deleted: 4aa38da307cf78c6d222228e6ca78d01e8f0c29f87382455ad7b538ceb496f46
Build step 'Execute shell' marked build as failure

Mime
View raw message