mesos-builds mailing list archives

Site index · List index
Message view « Date » · « Thread »
Top « Date » · « Thread »
From Apache Jenkins Server <jenk...@builds.apache.org>
Subject Build failed in Jenkins: Mesos » cmake,gcc,--verbose --enable-libevent --enable-ssl,GLOG_v=1 MESOS_VERBOSE=1,ubuntu:14.04,(docker||Hadoop)&&(!ubuntu-us1)&&(!ubuntu-6) #2452
Date Wed, 06 Jul 2016 06:08:29 GMT
See <https://builds.apache.org/job/Mesos/BUILDTOOL=cmake,COMPILER=gcc,CONFIGURATION=--verbose%20--enable-libevent%20--enable-ssl,ENVIRONMENT=GLOG_v=1%20MESOS_VERBOSE=1,OS=ubuntu%3A14.04,label_exp=(docker%7C%7CHadoop)&&(!ubuntu-us1)&&(!ubuntu-6)/2452/changes>

Changes:

[anand] Refactored 'Master::Http::getTasks()' into helper function.

[anand] Refactored 'Master::Http::getAgents()' into helper function.

[anand] Refactored 'master::Http::getFrameworks()' to helper function.

[anand] Revised protobuf definition of 'GetState' response.

[anand] Refactored 'Master::Http::getExecutors()' into helper function.

[anand] Implemented 'GetState' call in v1 master API.

[anand] Implemented 'Subscribed' event for v1 master event stream.

------------------------------------------
[...truncated 8521 lines...]
[ RUN      ] UUIDTest.MalformedUUID
[       OK ] UUIDTest.MalformedUUID (0 ms)
[----------] 2 tests from UUIDTest (0 ms total)

[----------] 2 tests from VersionTest
[ RUN      ] VersionTest.Comparison
[       OK ] VersionTest.Comparison (0 ms)
[ RUN      ] VersionTest.Parse
[       OK ] VersionTest.Parse (0 ms)
[----------] 2 tests from VersionTest (0 ms total)

[----------] 25 tests from FlagsTest
[ RUN      ] FlagsTest.Load
[       OK ] FlagsTest.Load (0 ms)
[ RUN      ] FlagsTest.Add
[       OK ] FlagsTest.Add (1 ms)
[ RUN      ] FlagsTest.Alias
[       OK ] FlagsTest.Alias (0 ms)
[ RUN      ] FlagsTest.Flags
[       OK ] FlagsTest.Flags (0 ms)
[ RUN      ] FlagsTest.LoadFromEnvironment
[       OK ] FlagsTest.LoadFromEnvironment (0 ms)
[ RUN      ] FlagsTest.LoadFromCommandLine
[       OK ] FlagsTest.LoadFromCommandLine (0 ms)
[ RUN      ] FlagsTest.LoadFromCommandLineWithNonFlags
[       OK ] FlagsTest.LoadFromCommandLineWithNonFlags (1 ms)
[ RUN      ] FlagsTest.LoadFromCommandLineWithDashDash
[       OK ] FlagsTest.LoadFromCommandLineWithDashDash (0 ms)
[ RUN      ] FlagsTest.LoadFromCommandLineAndUpdateArgcArgv
[       OK ] FlagsTest.LoadFromCommandLineAndUpdateArgcArgv (0 ms)
[ RUN      ] FlagsTest.Stringification
[       OK ] FlagsTest.Stringification (0 ms)
[ RUN      ] FlagsTest.EffectiveName
[       OK ] FlagsTest.EffectiveName (0 ms)
[ RUN      ] FlagsTest.DeprecationWarning
[       OK ] FlagsTest.DeprecationWarning (0 ms)
[ RUN      ] FlagsTest.DuplicatesFromEnvironment
[       OK ] FlagsTest.DuplicatesFromEnvironment (0 ms)
[ RUN      ] FlagsTest.DuplicatesFromCommandLine
[       OK ] FlagsTest.DuplicatesFromCommandLine (0 ms)
[ RUN      ] FlagsTest.AliasDuplicateFromCommandLine
[       OK ] FlagsTest.AliasDuplicateFromCommandLine (0 ms)
[ RUN      ] FlagsTest.Errors
[       OK ] FlagsTest.Errors (1 ms)
[ RUN      ] FlagsTest.MissingRequiredFlag
[       OK ] FlagsTest.MissingRequiredFlag (0 ms)
[ RUN      ] FlagsTest.Validate
[       OK ] FlagsTest.Validate (0 ms)
[ RUN      ] FlagsTest.Usage
[       OK ] FlagsTest.Usage (0 ms)
[ RUN      ] FlagsTest.UsageMessage
[       OK ] FlagsTest.UsageMessage (0 ms)
[ RUN      ] FlagsTest.EmptyUsage
[       OK ] FlagsTest.EmptyUsage (0 ms)
[ RUN      ] FlagsTest.ProgramName
[       OK ] FlagsTest.ProgramName (0 ms)
[ RUN      ] FlagsTest.OptionalMessage
[       OK ] FlagsTest.OptionalMessage (0 ms)
[ RUN      ] FlagsTest.Duration
[       OK ] FlagsTest.Duration (0 ms)
[ RUN      ] FlagsTest.JSON
[       OK ] FlagsTest.JSON (1 ms)
[----------] 25 tests from FlagsTest (6 ms total)

[----------] 2 tests from FlagsFileTest
[ RUN      ] FlagsFileTest.JSONFile
WARNING: Logging before InitGoogleLogging() is written to STDERR
W0706 06:08:28.021528 19936 parse.hpp:89] Specifying an absolute filename to read a command
line option out of without using 'file:// is deprecated and will be removed in a future release.
Simply adding 'file://' to the beginning of the path should eliminate this warning.
[       OK ] FlagsFileTest.JSONFile (1 ms)
[ RUN      ] FlagsFileTest.FilePrefix
[       OK ] FlagsFileTest.FilePrefix (0 ms)
[----------] 2 tests from FlagsFileTest (1 ms total)

[----------] 18 tests from OsTest
[ RUN      ] OsTest.Environment
[       OK ] OsTest.Environment (0 ms)
[ RUN      ] OsTest.Argv
[       OK ] OsTest.Argv (0 ms)
[ RUN      ] OsTest.System
sh: 1: invalid.command: not found
[       OK ] OsTest.System (8 ms)
[ RUN      ] OsTest.Cloexec
[       OK ] OsTest.Cloexec (1 ms)
[ RUN      ] OsTest.Nonblock
[       OK ] OsTest.Nonblock (0 ms)
[ RUN      ] OsTest.Size
[       OK ] OsTest.Size (0 ms)
[ RUN      ] OsTest.BootId
[       OK ] OsTest.BootId (1 ms)
[ RUN      ] OsTest.Sleep
[       OK ] OsTest.Sleep (10 ms)
[ RUN      ] OsTest.Children
[       OK ] OsTest.Children (7 ms)
[ RUN      ] OsTest.Killtree
[       OK ] OsTest.Killtree (30 ms)
[ RUN      ] OsTest.KilltreeNoRoot
[       OK ] OsTest.KilltreeNoRoot (20 ms)
[ RUN      ] OsTest.ProcessExists
[       OK ] OsTest.ProcessExists (6 ms)
[ RUN      ] OsTest.User
[       OK ] OsTest.User (13 ms)
[ RUN      ] OsTest.Libraries
[       OK ] OsTest.Libraries (0 ms)
[ RUN      ] OsTest.Shell
sh: 1: foobar: not found
E0706 06:08:28.123356 19936 shell.hpp:106] Command 'foobar' failed; this is the output:
[       OK ] OsTest.Shell (10 ms)
[ RUN      ] OsTest.Mknod
[       OK ] OsTest.Mknod (1 ms)
[ RUN      ] OsTest.Realpath
[       OK ] OsTest.Realpath (0 ms)
[ RUN      ] OsTest.Which
[       OK ] OsTest.Which (1 ms)
[----------] 18 tests from OsTest (110 ms total)

[----------] 6 tests from PathTest
[ RUN      ] PathTest.Basename
[       OK ] PathTest.Basename (0 ms)
[ RUN      ] PathTest.Dirname
[       OK ] PathTest.Dirname (0 ms)
[ RUN      ] PathTest.Extension
[       OK ] PathTest.Extension (0 ms)
[ RUN      ] PathTest.Join
[       OK ] PathTest.Join (0 ms)
[ RUN      ] PathTest.Absolute
[       OK ] PathTest.Absolute (0 ms)
[ RUN      ] PathTest.Comparison
[       OK ] PathTest.Comparison (0 ms)
[----------] 6 tests from PathTest (0 ms total)

[----------] 1 test from PathFileTest
[ RUN      ] PathFileTest.ImplicitConversion
[       OK ] PathFileTest.ImplicitConversion (0 ms)
[----------] 1 test from PathFileTest (0 ms total)

[----------] 10 tests from ProtobufTest
[ RUN      ] ProtobufTest.JSON
[       OK ] ProtobufTest.JSON (3 ms)
[ RUN      ] ProtobufTest.JSONArray
[       OK ] ProtobufTest.JSONArray (0 ms)
[ RUN      ] ProtobufTest.JsonLargeIntegers
[       OK ] ProtobufTest.JsonLargeIntegers (1 ms)
[ RUN      ] ProtobufTest.SimpleMessageEquals
[       OK ] ProtobufTest.SimpleMessageEquals (0 ms)
[ RUN      ] ProtobufTest.ParseJSONArray
[       OK ] ProtobufTest.ParseJSONArray (0 ms)
[ RUN      ] ProtobufTest.ParseJSONNull
[       OK ] ProtobufTest.ParseJSONNull (0 ms)
[ RUN      ] ProtobufTest.ParseJSONNestedError
[       OK ] ProtobufTest.ParseJSONNestedError (0 ms)
[ RUN      ] ProtobufTest.Jsonify
[       OK ] ProtobufTest.Jsonify (0 ms)
[ RUN      ] ProtobufTest.JsonifyArray
[       OK ] ProtobufTest.JsonifyArray (0 ms)
[ RUN      ] ProtobufTest.JsonifyLargeIntegers
[       OK ] ProtobufTest.JsonifyLargeIntegers (0 ms)
[----------] 10 tests from ProtobufTest (5 ms total)

[----------] 2 tests from RecordIOTest
[ RUN      ] RecordIOTest.Encoder
[       OK ] RecordIOTest.Encoder (0 ms)
[ RUN      ] RecordIOTest.Decoder
[       OK ] RecordIOTest.Decoder (0 ms)
[----------] 2 tests from RecordIOTest (0 ms total)

[----------] 2 tests from SubcommandTest
[ RUN      ] SubcommandTest.Flags
[       OK ] SubcommandTest.Flags (0 ms)
[ RUN      ] SubcommandTest.Dispatch
Subcommand 'subcommand' is not available
Usage: command <subcommand> [OPTIONS]

Available subcommands:
    help
    subcommand2

Multiple subcommands have name 'subcommand'
[       OK ] SubcommandTest.Dispatch (1 ms)
[----------] 2 tests from SubcommandTest (1 ms total)

[----------] 2 tests from SVNTest
[ RUN      ] SVNTest.DiffPatch
[       OK ] SVNTest.DiffPatch (44 ms)
[ RUN      ] SVNTest.EmptyDiffPatch
[       OK ] SVNTest.EmptyDiffPatch (44 ms)
[----------] 2 tests from SVNTest (88 ms total)

[----------] 1 test from TryTest
[ RUN      ] TryTest.ArrowOperator
[       OK ] TryTest.ArrowOperator (0 ms)
[----------] 1 test from TryTest (0 ms total)

[----------] 1 test from OsSendfileTest
[ RUN      ] OsSendfileTest.Sendfile
[       OK ] OsSendfileTest.Sendfile (1 ms)
[----------] 1 test from OsSendfileTest (1 ms total)

[----------] 1 test from OsSignalsTest
[ RUN      ] OsSignalsTest.Suppress
[       OK ] OsSignalsTest.Suppress (0 ms)
[----------] 1 test from OsSignalsTest (0 ms total)

[----------] 6 tests from ProcTest
[ RUN      ] ProcTest.Pids
[       OK ] ProcTest.Pids (1 ms)
[ RUN      ] ProcTest.Cpus
[       OK ] ProcTest.Cpus (0 ms)
[ RUN      ] ProcTest.SystemStatus
[       OK ] ProcTest.SystemStatus (0 ms)
[ RUN      ] ProcTest.ProcessStatus
[       OK ] ProcTest.ProcessStatus (0 ms)
[ RUN      ] ProcTest.SingleThread
[       OK ] ProcTest.SingleThread (1 ms)
[ RUN      ] ProcTest.MultipleThreads
[       OK ] ProcTest.MultipleThreads (0 ms)
[----------] 6 tests from ProcTest (2 ms total)

[----------] Global test environment tear-down
[==========] 267 tests from 45 test cases ran. (250 ms total)
[  PASSED  ] 266 tests.
[  FAILED  ] 1 test, listed below:
[  FAILED  ] JsonTest.Find

 1 FAILED TEST
make[3]: *** [CMakeFiles/check] Error 1
make[3]: Leaving directory `/mesos/build'
make[2]: Leaving directory `/mesos/build'
make[2]: *** [CMakeFiles/check.dir/all] Error 2
make[1]: *** [CMakeFiles/check.dir/rule] Error 2
make[1]: Leaving directory `/mesos/build'
make: *** [check] Error 2
+ docker rmi mesos-1467784638-1869
Untagged: mesos-1467784638-1869:latest
Deleted: 4084b5728f9d8c412941e2d63f563bb60ccd943ff43f00fc6d60866d68453aaa
Deleted: 66c109fe91bb302e7d12cbf51bcee34ae04d75e3093bcd9cc36364ef03c8f71b
Deleted: 66745d01a9b4fb1f830fabfc0d76c3f80f7729b80e9f322f9702c3883e7c0339
Deleted: ba634c6c929a8d9f5762a4f88fa093426cda1aaafa2ec495d6feb95f6f7bc9e7
Deleted: dbe5069f35f745da4a6e53dbd0f06dd50430cff296bfd887c71659b8230ab6f6
Deleted: ea3d7bffd41bd56b84c5785bf9c7acbcaa1b8b5d4398444fa588f048121d10a9
Deleted: 59a657e73f8f0d0597ba19db8bcfe02671954c2dcc61e156b553e7c9b4bd3dd0
Deleted: 6f1a8998e040684f694ea74eeba620ff4c3d7b0aba0a782361ef58396c081f69
Deleted: 2803e347d3a633baeff3bf06d0aa2b413a99993c03ac0023c3cedc4af35dd0ee
Deleted: a7cfb1006ee57e23aee9988df6cfad90c65b5fab39d9993deddd7590c9a8d7c2
Deleted: b9c2a6ea2a89f36ec18862f533d636d56d458a3102d7640c811772add853b7b5
Deleted: ae5107869d6f4df812c38dceccd4120c77487248e8e2de11d5de233684870c1e
Deleted: 00f3f006ab0adb2c8d8bf70af52f715ad0ad24dbdebcdcc396d7791b002e7a26
Deleted: 5fad0ab64ad83e616d57b6e0aa40988af3d2cda816b8a11ca4b0f8f299d50c12
Deleted: 2ecbca1cdc09989feb46035b3e74dbf3c123bfe2cd5a891e11ff6de77da9081e
Build step 'Execute shell' marked build as failure

Mime
View raw message