mesos-builds mailing list archives

Site index · List index
Message view « Date » · « Thread »
Top « Date » · « Thread »
From Apache Jenkins Server <jenk...@builds.apache.org>
Subject Build failed in Jenkins: Mesos » autotools,gcc,--verbose,GLOG_v=1 MESOS_VERBOSE=1,ubuntu:14.04,(docker||Hadoop)&&(!ubuntu-us1)&&(!ubuntu-6) #2438
Date Tue, 05 Jul 2016 13:21:40 GMT
See <https://builds.apache.org/job/Mesos/BUILDTOOL=autotools,COMPILER=gcc,CONFIGURATION=--verbose,ENVIRONMENT=GLOG_v=1%20MESOS_VERBOSE=1,OS=ubuntu%3A14.04,label_exp=(docker%7C%7CHadoop)&&(!ubuntu-us1)&&(!ubuntu-6)/2438/changes>

Changes:

[mpark] Changed Aurora URL since it's not an incubator anymore.

------------------------------------------
[...truncated 193859 lines...]
I0705 13:21:38.696529 28189 slave.cpp:592] Agent resources: cpus(*):2; mem(*):1024; disk(*):1024;
ports(*):[31000-32000]
I0705 13:21:38.696586 28189 slave.cpp:600] Agent attributes: [  ]
I0705 13:21:38.696597 28189 slave.cpp:605] Agent hostname: c92aa051e3c4
I0705 13:21:38.698128 28185 state.cpp:57] Recovering state from '/tmp/Endpoint_SlaveEndpointTest_AuthorizedRequest_1_5Gd8vP/meta'
I0705 13:21:38.698186 28189 process.cpp:3322] Handling HTTP event for process 'slave(541)'
with path: '/slave(541)/monitor/statistics.json'
I0705 13:21:38.698689 28188 status_update_manager.cpp:200] Recovering status update manager
I0705 13:21:38.699057 28183 containerizer.cpp:522] Recovering containerizer
I0705 13:21:38.699295 28191 http.cpp:765] Authorizing principal 'test-principal' to GET the
'/monitor/statistics.json' endpoint
I0705 13:21:38.700882 28191 provisioner.cpp:253] Provisioner recovery complete
I0705 13:21:38.701370 28187 slave.cpp:4838] Finished recovery
I0705 13:21:38.702047 28187 slave.cpp:5010] Querying resource estimator for oversubscribable
resources
I0705 13:21:38.702627 28197 slave.cpp:5024] Received oversubscribable resources  from the
resource estimator
I0705 13:21:38.703135 28184 slave.cpp:839] Agent terminating
[       OK ] Endpoint/SlaveEndpointTest.AuthorizedRequest/1 (23 ms)
[ RUN      ] Endpoint/SlaveEndpointTest.AuthorizedRequest/2
I0705 13:21:38.714787 28164 containerizer.cpp:196] Using isolation: posix/cpu,posix/mem,filesystem/posix,network/cni
W0705 13:21:38.715541 28164 backend.cpp:75] Failed to create 'aufs' backend: AufsBackend requires
root privileges, but is running as user mesos
W0705 13:21:38.715706 28164 backend.cpp:75] Failed to create 'bind' backend: BindBackend requires
root privileges
I0705 13:21:38.718600 28187 slave.cpp:203] Agent started on 542)@172.17.0.2:44394
I0705 13:21:38.718627 28187 slave.cpp:204] Flags at startup: --acls="" --appc_simple_discovery_uri_prefix="http://"
--appc_store_dir="/tmp/mesos/store/appc" --authenticate_http="true" --authenticatee="crammd5"
--authorizer="local" --cgroups_cpu_enable_pids_and_tids_count="false" --cgroups_enable_cfs="false"
--cgroups_hierarchy="/sys/fs/cgroup" --cgroups_limit_swap="false" --cgroups_root="mesos" --container_disk_watch_interval="15secs"
--containerizers="mesos" --credential="/tmp/Endpoint_SlaveEndpointTest_AuthorizedRequest_2_pbvMmC/credential"
--default_role="*" --disk_watch_interval="1mins" --docker="docker" --docker_kill_orphans="true"
--docker_registry="https://registry-1.docker.io" --docker_remove_delay="6hrs" --docker_socket="/var/run/docker.sock"
--docker_stop_timeout="0ns" --docker_store_dir="/tmp/mesos/store/docker" --docker_volume_checkpoint_dir="/var/run/mesos/isolators/docker/volume"
--enforce_container_disk_quota="false" --executor_registration_timeout="1mins" --executor_shutdown_grace_period="5secs"
--fetcher_cache_dir="/tmp/Endpoint_SlaveEndpointTest_AuthorizedRequest_2_pbvMmC/fetch" --fetcher_cache_size="2GB"
--frameworks_home="" --gc_delay="1weeks" --gc_disk_headroom="0.1" --hadoop_home="" --help="true"
--hostname_lookup="true" --http_authenticators="basic" --http_command_executor="false" --http_credentials="/tmp/Endpoint_SlaveEndpointTest_AuthorizedRequest_2_pbvMmC/http_credentials"
--image_provisioner_backend="copy" --initialize_driver_logging="true" --isolation="posix/cpu,posix/mem"
--launcher_dir="/mesos/mesos-1.0.0/_build/src" --logbufsecs="0" --logging_level="INFO" --oversubscribed_resources_interval="15secs"
--perf_duration="10secs" --perf_interval="1mins" --qos_correction_interval_min="0ns" --quiet="false"
--recover="reconnect" --recovery_timeout="15mins" --registration_backoff_factor="10ms" --resources="cpus:2;gpus:0;mem:1024;disk:1024;ports:[31000-32000]"
--revocable_cpu_low_priority="true" --sandbox_directory="/mnt/mesos/sandbox" --strict="true"
--switch_user="true" --systemd_enable_support="true" --systemd_runtime_directory="/run/systemd/system"
--version="false" --work_dir="/tmp/Endpoint_SlaveEndpointTest_AuthorizedRequest_2_pbvMmC"
I0705 13:21:38.719313 28187 credentials.hpp:86] Loading credential for authentication from
'/tmp/Endpoint_SlaveEndpointTest_AuthorizedRequest_2_pbvMmC/credential'
I0705 13:21:38.719522 28187 slave.cpp:341] Agent using credential for: test-principal
I0705 13:21:38.719558 28187 credentials.hpp:37] Loading credentials for authentication from
'/tmp/Endpoint_SlaveEndpointTest_AuthorizedRequest_2_pbvMmC/http_credentials'
I0705 13:21:38.719837 28187 slave.cpp:393] Using default 'basic' HTTP authenticator
I0705 13:21:38.720482 28187 resources.cpp:572] Parsing resources as JSON failed: cpus:2;gpus:0;mem:1024;disk:1024;ports:[31000-32000]
Trying semicolon-delimited string format instead
I0705 13:21:38.720897 28187 resources.cpp:572] Parsing resources as JSON failed: cpus:2;gpus:0;mem:1024;disk:1024;ports:[31000-32000]
Trying semicolon-delimited string format instead
I0705 13:21:38.721488 28187 slave.cpp:592] Agent resources: cpus(*):2; mem(*):1024; disk(*):1024;
ports(*):[31000-32000]
I0705 13:21:38.721570 28187 slave.cpp:600] Agent attributes: [  ]
I0705 13:21:38.721585 28187 slave.cpp:605] Agent hostname: c92aa051e3c4
I0705 13:21:38.723381 28185 state.cpp:57] Recovering state from '/tmp/Endpoint_SlaveEndpointTest_AuthorizedRequest_2_pbvMmC/meta'
I0705 13:21:38.723467 28187 process.cpp:3322] Handling HTTP event for process 'slave(542)'
with path: '/slave(542)/containers'
I0705 13:21:38.723958 28189 status_update_manager.cpp:200] Recovering status update manager
I0705 13:21:38.724270 28198 containerizer.cpp:522] Recovering containerizer
I0705 13:21:38.725127 28193 http.cpp:765] Authorizing principal 'test-principal' to GET the
'/containers' endpoint
I0705 13:21:38.725350 28197 provisioner.cpp:253] Provisioner recovery complete
I0705 13:21:38.726721 28193 slave.cpp:4838] Finished recovery
I0705 13:21:38.727442 28193 slave.cpp:5010] Querying resource estimator for oversubscribable
resources
I0705 13:21:38.727694 28194 slave.cpp:5024] Received oversubscribable resources  from the
resource estimator
I0705 13:21:38.729385 28188 slave.cpp:839] Agent terminating
[       OK ] Endpoint/SlaveEndpointTest.AuthorizedRequest/2 (24 ms)
[ RUN      ] Endpoint/SlaveEndpointTest.UnauthorizedRequest/0
I0705 13:21:38.737900 28164 containerizer.cpp:196] Using isolation: posix/cpu,posix/mem,filesystem/posix,network/cni
W0705 13:21:38.738631 28164 backend.cpp:75] Failed to create 'aufs' backend: AufsBackend requires
root privileges, but is running as user mesos
W0705 13:21:38.738770 28164 backend.cpp:75] Failed to create 'bind' backend: BindBackend requires
root privileges
I0705 13:21:38.741816 28188 slave.cpp:203] Agent started on 543)@172.17.0.2:44394
I0705 13:21:38.741848 28188 slave.cpp:204] Flags at startup: --acls="" --appc_simple_discovery_uri_prefix="http://"
--appc_store_dir="/tmp/mesos/store/appc" --authenticate_http="true" --authenticatee="crammd5"
--authorizer="local" --cgroups_cpu_enable_pids_and_tids_count="false" --cgroups_enable_cfs="false"
--cgroups_hierarchy="/sys/fs/cgroup" --cgroups_limit_swap="false" --cgroups_root="mesos" --container_disk_watch_interval="15secs"
--containerizers="mesos" --credential="/tmp/Endpoint_SlaveEndpointTest_UnauthorizedRequest_0_vrngpp/credential"
--default_role="*" --disk_watch_interval="1mins" --docker="docker" --docker_kill_orphans="true"
--docker_registry="https://registry-1.docker.io" --docker_remove_delay="6hrs" --docker_socket="/var/run/docker.sock"
--docker_stop_timeout="0ns" --docker_store_dir="/tmp/mesos/store/docker" --docker_volume_checkpoint_dir="/var/run/mesos/isolators/docker/volume"
--enforce_container_disk_quota="false" --executor_registration_timeout="1mins" --executor_shutdown_grace_period="5secs"
--fetcher_cache_dir="/tmp/Endpoint_SlaveEndpointTest_UnauthorizedRequest_0_vrngpp/fetch" --fetcher_cache_size="2GB"
--frameworks_home="" --gc_delay="1weeks" --gc_disk_headroom="0.1" --hadoop_home="" --help="true"
--hostname_lookup="true" --http_authenticators="basic" --http_command_executor="false" --http_credentials="/tmp/Endpoint_SlaveEndpointTest_UnauthorizedRequest_0_vrngpp/http_credentials"
--image_provisioner_backend="copy" --initialize_driver_logging="true" --isolation="posix/cpu,posix/mem"
--launcher_dir="/mesos/mesos-1.0.0/_build/src" --logbufsecs="0" --logging_level="INFO" --oversubscribed_resources_interval="15secs"
--perf_duration="10secs" --perf_interval="1mins" --qos_correction_interval_min="0ns" --quiet="false"
--recover="reconnect" --recovery_timeout="15mins" --registration_backoff_factor="10ms" --resources="cpus:2;gpus:0;mem:1024;disk:1024;ports:[31000-32000]"
--revocable_cpu_low_priority="true" --sandbox_directory="/mnt/mesos/sandbox" --strict="true"
--switch_user="true" --systemd_enable_support="true" --systemd_runtime_directory="/run/systemd/system"
--version="false" --work_dir="/tmp/Endpoint_SlaveEndpointTest_UnauthorizedRequest_0_vrngpp"
I0705 13:21:38.742347 28188 credentials.hpp:86] Loading credential for authentication from
'/tmp/Endpoint_SlaveEndpointTest_UnauthorizedRequest_0_vrngpp/credential'
I0705 13:21:38.742552 28188 slave.cpp:341] Agent using credential for: test-principal
I0705 13:21:38.742676 28188 credentials.hpp:37] Loading credentials for authentication from
'/tmp/Endpoint_SlaveEndpointTest_UnauthorizedRequest_0_vrngpp/http_credentials'
I0705 13:21:38.742945 28188 slave.cpp:393] Using default 'basic' HTTP authenticator
I0705 13:21:38.743347 28188 resources.cpp:572] Parsing resources as JSON failed: cpus:2;gpus:0;mem:1024;disk:1024;ports:[31000-32000]
Trying semicolon-delimited string format instead
I0705 13:21:38.743715 28188 resources.cpp:572] Parsing resources as JSON failed: cpus:2;gpus:0;mem:1024;disk:1024;ports:[31000-32000]
Trying semicolon-delimited string format instead
I0705 13:21:38.744274 28188 slave.cpp:592] Agent resources: cpus(*):2; mem(*):1024; disk(*):1024;
ports(*):[31000-32000]
I0705 13:21:38.744331 28188 slave.cpp:600] Agent attributes: [  ]
I0705 13:21:38.744343 28188 slave.cpp:605] Agent hostname: c92aa051e3c4
I0705 13:21:38.745911 28191 state.cpp:57] Recovering state from '/tmp/Endpoint_SlaveEndpointTest_UnauthorizedRequest_0_vrngpp/meta'
I0705 13:21:38.746022 28188 process.cpp:3322] Handling HTTP event for process 'slave(543)'
with path: '/slave(543)/monitor/statistics'
I0705 13:21:38.746614 28196 status_update_manager.cpp:200] Recovering status update manager
I0705 13:21:38.746853 28189 containerizer.cpp:522] Recovering containerizer
I0705 13:21:38.747198 28188 http.cpp:765] Authorizing principal 'test-principal' to GET the
'/monitor/statistics' endpoint
I0705 13:21:38.748283 28191 provisioner.cpp:253] Provisioner recovery complete
I0705 13:21:38.748581 28183 slave.cpp:4838] Finished recovery
I0705 13:21:38.749207 28183 slave.cpp:5010] Querying resource estimator for oversubscribable
resources
I0705 13:21:38.749440 28196 slave.cpp:839] Agent terminating
[       OK ] Endpoint/SlaveEndpointTest.UnauthorizedRequest/0 (19 ms)
[ RUN      ] Endpoint/SlaveEndpointTest.UnauthorizedRequest/1
I0705 13:21:38.757598 28164 containerizer.cpp:196] Using isolation: posix/cpu,posix/mem,filesystem/posix,network/cni
W0705 13:21:38.758302 28164 backend.cpp:75] Failed to create 'aufs' backend: AufsBackend requires
root privileges, but is running as user mesos
W0705 13:21:38.758455 28164 backend.cpp:75] Failed to create 'bind' backend: BindBackend requires
root privileges
I0705 13:21:38.761416 28185 slave.cpp:203] Agent started on 544)@172.17.0.2:44394
I0705 13:21:38.761473 28185 slave.cpp:204] Flags at startup: --acls="" --appc_simple_discovery_uri_prefix="http://"
--appc_store_dir="/tmp/mesos/store/appc" --authenticate_http="true" --authenticatee="crammd5"
--authorizer="local" --cgroups_cpu_enable_pids_and_tids_count="false" --cgroups_enable_cfs="false"
--cgroups_hierarchy="/sys/fs/cgroup" --cgroups_limit_swap="false" --cgroups_root="mesos" --container_disk_watch_interval="15secs"
--containerizers="mesos" --credential="/tmp/Endpoint_SlaveEndpointTest_UnauthorizedRequest_1_jn3HBc/credential"
--default_role="*" --disk_watch_interval="1mins" --docker="docker" --docker_kill_orphans="true"
--docker_registry="https://registry-1.docker.io" --docker_remove_delay="6hrs" --docker_socket="/var/run/docker.sock"
--docker_stop_timeout="0ns" --docker_store_dir="/tmp/mesos/store/docker" --docker_volume_checkpoint_dir="/var/run/mesos/isolators/docker/volume"
--enforce_container_disk_quota="false" --executor_registration_timeout="1mins" --executor_shutdown_grace_period="5secs"
--fetcher_cache_dir="/tmp/Endpoint_SlaveEndpointTest_UnauthorizedRequest_1_jn3HBc/fetch" --fetcher_cache_size="2GB"
--frameworks_home="" --gc_delay="1weeks" --gc_disk_headroom="0.1" --hadoop_home="" --help="true"
--hostname_lookup="true" --http_authenticators="basic" --http_command_executor="false" --http_credentials="/tmp/Endpoint_SlaveEndpointTest_UnauthorizedRequest_1_jn3HBc/http_credentials"
--image_provisioner_backend="copy" --initialize_driver_logging="true" --isolation="posix/cpu,posix/mem"
--launcher_dir="/mesos/mesos-1.0.0/_build/src" --logbufsecs="0" --logging_level="INFO" --oversubscribed_resources_interval="15secs"
--perf_duration="10secs" --perf_interval="1mins" --qos_correction_interval_min="0ns" --quiet="false"
--recover="reconnect" --recovery_timeout="15mins" --registration_backoff_factor="10ms" --resources="cpus:2;gpus:0;mem:1024;disk:1024;ports:[31000-32000]"
--revocable_cpu_low_priority="true" --sandbox_directory="/mnt/mesos/sandbox" --strict="true"
--switch_user="true" --systemd_enable_support="true" --systemd_runtime_directory="/run/systemd/system"
--version="false" --work_dir="/tmp/Endpoint_SlaveEndpointTest_UnauthorizedRequest_1_jn3HBc"
I0705 13:21:38.762281 28185 credentials.hpp:86] Loading credential for authentication from
'/tmp/Endpoint_SlaveEndpointTest_UnauthorizedRequest_1_jn3HBc/credential'
I0705 13:21:38.762590 28185 slave.cpp:341] Agent using credential for: test-principal
I0705 13:21:38.762641 28185 credentials.hpp:37] Loading credentials for authentication from
'/tmp/Endpoint_SlaveEndpointTest_UnauthorizedRequest_1_jn3HBc/http_credentials'
I0705 13:21:38.763041 28185 slave.cpp:393] Using default 'basic' HTTP authenticator
I0705 13:21:38.763532 28185 resources.cpp:572] Parsing resources as JSON failed: cpus:2;gpus:0;mem:1024;disk:1024;ports:[31000-32000]
Trying semicolon-delimited string format instead
I0705 13:21:38.763849 28185 resources.cpp:572] Parsing resources as JSON failed: cpus:2;gpus:0;mem:1024;disk:1024;ports:[31000-32000]
Trying semicolon-delimited string format instead
I0705 13:21:38.764204 28185 slave.cpp:592] Agent resources: cpus(*):2; mem(*):1024; disk(*):1024;
ports(*):[31000-32000]
I0705 13:21:38.764261 28185 slave.cpp:600] Agent attributes: [  ]
I0705 13:21:38.764271 28185 slave.cpp:605] Agent hostname: c92aa051e3c4
I0705 13:21:38.766007 28187 state.cpp:57] Recovering state from '/tmp/Endpoint_SlaveEndpointTest_UnauthorizedRequest_1_jn3HBc/meta'
I0705 13:21:38.766103 28185 process.cpp:3322] Handling HTTP event for process 'slave(544)'
with path: '/slave(544)/monitor/statistics.json'
I0705 13:21:38.766661 28191 status_update_manager.cpp:200] Recovering status update manager
I0705 13:21:38.766880 28195 containerizer.cpp:522] Recovering containerizer
I0705 13:21:38.767027 28185 http.cpp:765] Authorizing principal 'test-principal' to GET the
'/monitor/statistics.json' endpoint
I0705 13:21:38.768226 28190 provisioner.cpp:253] Provisioner recovery complete
I0705 13:21:38.768540 28198 slave.cpp:4838] Finished recovery
I0705 13:21:38.769155 28198 slave.cpp:5010] Querying resource estimator for oversubscribable
resources
I0705 13:21:38.769489 28186 slave.cpp:5024] Received oversubscribable resources  from the
resource estimator
I0705 13:21:38.769608 28197 slave.cpp:839] Agent terminating
[       OK ] Endpoint/SlaveEndpointTest.UnauthorizedRequest/1 (19 ms)
[ RUN      ] Endpoint/SlaveEndpointTest.UnauthorizedRequest/2
I0705 13:21:38.777526 28164 containerizer.cpp:196] Using isolation: posix/cpu,posix/mem,filesystem/posix,network/cni
W0705 13:21:38.778194 28164 backend.cpp:75] Failed to create 'aufs' backend: AufsBackend requires
root privileges, but is running as user mesos
W0705 13:21:38.778329 28164 backend.cpp:75] Failed to create 'bind' backend: BindBackend requires
root privileges
I0705 13:21:38.781654 28198 slave.cpp:203] Agent started on 545)@172.17.0.2:44394
I0705 13:21:38.781679 28198 slave.cpp:204] Flags at startup: --acls="" --appc_simple_discovery_uri_prefix="http://"
--appc_store_dir="/tmp/mesos/store/appc" --authenticate_http="true" --authenticatee="crammd5"
--authorizer="local" --cgroups_cpu_enable_pids_and_tids_count="false" --cgroups_enable_cfs="false"
--cgroups_hierarchy="/sys/fs/cgroup" --cgroups_limit_swap="false" --cgroups_root="mesos" --container_disk_watch_interval="15secs"
--containerizers="mesos" --credential="/tmp/Endpoint_SlaveEndpointTest_UnauthorizedRequest_2_ZVwSXZ/credential"
--default_role="*" --disk_watch_interval="1mins" --docker="docker" --docker_kill_orphans="true"
--docker_registry="https://registry-1.docker.io" --docker_remove_delay="6hrs" --docker_socket="/var/run/docker.sock"
--docker_stop_timeout="0ns" --docker_store_dir="/tmp/mesos/store/docker" --docker_volume_checkpoint_dir="/var/run/mesos/isolators/docker/volume"
--enforce_container_disk_quota="false" --executor_registration_timeout="1mins" --executor_shutdown_grace_period="5secs"
--fetcher_cache_dir="/tmp/Endpoint_SlaveEndpointTest_UnauthorizedRequest_2_ZVwSXZ/fetch" --fetcher_cache_size="2GB"
--frameworks_home="" --gc_delay="1weeks" --gc_disk_headroom="0.1" --hadoop_home="" --help="true"
--hostname_lookup="true" --http_authenticators="basic" --http_command_executor="false" --http_credentials="/tmp/Endpoint_SlaveEndpointTest_UnauthorizedRequest_2_ZVwSXZ/http_credentials"
--image_provisioner_backend="copy" --initialize_driver_logging="true" --isolation="posix/cpu,posix/mem"
--launcher_dir="/mesos/mesos-1.0.0/_build/src" --logbufsecs="0" --logging_level="INFO" --oversubscribed_resources_interval="15secs"
--perf_duration="10secs" --perf_interval="1mins" --qos_correction_interval_min="0ns" --quiet="false"
--recover="reconnect" --recovery_timeout="15mins" --registration_backoff_factor="10ms" --resources="cpus:2;gpus:0;mem:1024;disk:1024;ports:[31000-32000]"
--revocable_cpu_low_priority="true" --sandbox_directory="/mnt/mesos/sandbox" --strict="true"
--switch_user="true" --systemd_enable_support="true" --systemd_runtime_directory="/run/systemd/system"
--version="false" --work_dir="/tmp/Endpoint_SlaveEndpointTest_UnauthorizedRequest_2_ZVwSXZ"
I0705 13:21:38.782112 28198 credentials.hpp:86] Loading credential for authentication from
'/tmp/Endpoint_SlaveEndpointTest_UnauthorizedRequest_2_ZVwSXZ/credential'
I0705 13:21:38.782276 28198 slave.cpp:341] Agent using credential for: test-principal
I0705 13:21:38.782305 28198 credentials.hpp:37] Loading credentials for authentication from
'/tmp/Endpoint_SlaveEndpointTest_UnauthorizedRequest_2_ZVwSXZ/http_credentials'
I0705 13:21:38.782526 28198 slave.cpp:393] Using default 'basic' HTTP authenticator
I0705 13:21:38.783087 28198 resources.cpp:572] Parsing resources as JSON failed: cpus:2;gpus:0;mem:1024;disk:1024;ports:[31000-32000]
Trying semicolon-delimited string format instead
I0705 13:21:38.783509 28198 resources.cpp:572] Parsing resources as JSON failed: cpus:2;gpus:0;mem:1024;disk:1024;ports:[31000-32000]
Trying semicolon-delimited string format instead
I0705 13:21:38.784032 28198 slave.cpp:592] Agent resources: cpus(*):2; mem(*):1024; disk(*):1024;
ports(*):[31000-32000]
I0705 13:21:38.784095 28198 slave.cpp:600] Agent attributes: [  ]
I0705 13:21:38.784112 28198 slave.cpp:605] Agent hostname: c92aa051e3c4
I0705 13:21:38.785682 28191 state.cpp:57] Recovering state from '/tmp/Endpoint_SlaveEndpointTest_UnauthorizedRequest_2_ZVwSXZ/meta'
I0705 13:21:38.785773 28198 process.cpp:3322] Handling HTTP event for process 'slave(545)'
with path: '/slave(545)/containers'
I0705 13:21:38.786259 28191 status_update_manager.cpp:200] Recovering status update manager
I0705 13:21:38.786540 28191 containerizer.cpp:522] Recovering containerizer
I0705 13:21:38.786860 28184 http.cpp:765] Authorizing principal 'test-principal' to GET the
'/containers' endpoint
I0705 13:21:38.788229 28198 provisioner.cpp:253] Provisioner recovery complete
I0705 13:21:38.788663 28198 slave.cpp:4838] Finished recovery
I0705 13:21:38.789216 28198 slave.cpp:5010] Querying resource estimator for oversubscribable
resources
I0705 13:21:38.789357 28198 slave.cpp:839] Agent terminating
[       OK ] Endpoint/SlaveEndpointTest.UnauthorizedRequest/2 (19 ms)
[ RUN      ] Endpoint/SlaveEndpointTest.NoAuthorizer/0
I0705 13:21:38.797585 28164 containerizer.cpp:196] Using isolation: posix/cpu,posix/mem,filesystem/posix,network/cni
W0705 13:21:38.798300 28164 backend.cpp:75] Failed to create 'aufs' backend: AufsBackend requires
root privileges, but is running as user mesos
W0705 13:21:38.798470 28164 backend.cpp:75] Failed to create 'bind' backend: BindBackend requires
root privileges
I0705 13:21:38.799828 28164 cluster.cpp:432] Creating default 'local' authorizer
I0705 13:21:38.801542 28196 slave.cpp:203] Agent started on 546)@172.17.0.2:44394
I0705 13:21:38.801564 28196 slave.cpp:204] Flags at startup: --acls="" --appc_simple_discovery_uri_prefix="http://"
--appc_store_dir="/tmp/mesos/store/appc" --authenticate_http="true" --authenticatee="crammd5"
--authorizer="local" --cgroups_cpu_enable_pids_and_tids_count="false" --cgroups_enable_cfs="false"
--cgroups_hierarchy="/sys/fs/cgroup" --cgroups_limit_swap="false" --cgroups_root="mesos" --container_disk_watch_interval="15secs"
--containerizers="mesos" --credential="/tmp/Endpoint_SlaveEndpointTest_NoAuthorizer_0_9ixLtN/credential"
--default_role="*" --disk_watch_interval="1mins" --docker="docker" --docker_kill_orphans="true"
--docker_registry="https://registry-1.docker.io" --docker_remove_delay="6hrs" --docker_socket="/var/run/docker.sock"
--docker_stop_timeout="0ns" --docker_store_dir="/tmp/mesos/store/docker" --docker_volume_checkpoint_dir="/var/run/mesos/isolators/docker/volume"
--enforce_container_disk_quota="false" --executor_registration_timeout="1mins" --executor_shutdown_grace_period="5secs"
--fetcher_cache_dir="/tmp/Endpoint_SlaveEndpointTest_NoAuthorizer_0_9ixLtN/fetch" --fetcher_cache_size="2GB"
--frameworks_home="" --gc_delay="1weeks" --gc_disk_headroom="0.1" --hadoop_home="" --help="false"
--hostname_lookup="true" --http_authenticators="basic" --http_command_executor="false" --http_credentials="/tmp/Endpoint_SlaveEndpointTest_NoAuthorizer_0_9ixLtN/http_credentials"
--image_provisioner_backend="copy" --initialize_driver_logging="true" --isolation="posix/cpu,posix/mem"
--launcher_dir="/mesos/mesos-1.0.0/_build/src" --logbufsecs="0" --logging_level="INFO" --oversubscribed_resources_interval="15secs"
--perf_duration="10secs" --perf_interval="1mins" --qos_correction_interval_min="0ns" --quiet="false"
--recover="reconnect" --recovery_timeout="15mins" --registration_backoff_factor="10ms" --resources="cpus:2;gpus:0;mem:1024;disk:1024;ports:[31000-32000]"
--revocable_cpu_low_priority="true" --sandbox_directory="/mnt/mesos/sandbox" --strict="true"
--switch_user="true" --systemd_enable_support="true" --systemd_runtime_directory="/run/systemd/system"
--version="false" --work_dir="/tmp/Endpoint_SlaveEndpointTest_NoAuthorizer_0_9ixLtN"
I0705 13:21:38.802239 28196 credentials.hpp:86] Loading credential for authentication from
'/tmp/Endpoint_SlaveEndpointTest_NoAuthorizer_0_9ixLtN/credential'
I0705 13:21:38.802464 28196 slave.cpp:341] Agent using credential for: test-principal
I0705 13:21:38.802506 28196 credentials.hpp:37] Loading credentials for authentication from
'/tmp/Endpoint_SlaveEndpointTest_NoAuthorizer_0_9ixLtN/http_credentials'
I0705 13:21:38.802762 28196 slave.cpp:393] Using default 'basic' HTTP authenticator
I0705 13:21:38.803176 28196 resources.cpp:572] Parsing resources as JSON failed: cpus:2;gpus:0;mem:1024;disk:1024;ports:[31000-32000]
Trying semicolon-delimited string format instead
I0705 13:21:38.803519 28196 resources.cpp:572] Parsing resources as JSON failed: cpus:2;gpus:0;mem:1024;disk:1024;ports:[31000-32000]
Trying semicolon-delimited string format instead
I0705 13:21:38.803899 28196 slave.cpp:592] Agent resources: cpus(*):2; mem(*):1024; disk(*):1024;
ports(*):[31000-32000]
I0705 13:21:38.803982 28196 slave.cpp:600] Agent attributes: [  ]
I0705 13:21:38.803994 28196 slave.cpp:605] Agent hostname: c92aa051e3c4
I0705 13:21:38.805366 28194 state.cpp:57] Recovering state from '/tmp/Endpoint_SlaveEndpointTest_NoAuthorizer_0_9ixLtN/meta'
I0705 13:21:38.805445 28196 process.cpp:3322] Handling HTTP event for process 'slave(546)'
with path: '/slave(546)/monitor/statistics'
I0705 13:21:38.805879 28187 status_update_manager.cpp:200] Recovering status update manager
I0705 13:21:38.806076 28195 containerizer.cpp:522] Recovering containerizer
I0705 13:21:38.806392 28198 http.cpp:765] Authorizing principal 'test-principal' to GET the
'/monitor/statistics' endpoint
I0705 13:21:38.807413 28187 provisioner.cpp:253] Provisioner recovery complete
I0705 13:21:38.807817 28198 slave.cpp:4838] Finished recovery
I0705 13:21:38.808348 28198 slave.cpp:5010] Querying resource estimator for oversubscribable
resources
I0705 13:21:38.808604 28186 slave.cpp:5024] Received oversubscribable resources  from the
resource estimator
I0705 13:21:38.809649 28191 slave.cpp:839] Agent terminating
[       OK ] Endpoint/SlaveEndpointTest.NoAuthorizer/0 (19 ms)
[ RUN      ] Endpoint/SlaveEndpointTest.NoAuthorizer/1
I0705 13:21:38.816982 28164 containerizer.cpp:196] Using isolation: posix/cpu,posix/mem,filesystem/posix,network/cni
W0705 13:21:38.817630 28164 backend.cpp:75] Failed to create 'aufs' backend: AufsBackend requires
root privileges, but is running as user mesos
W0705 13:21:38.817788 28164 backend.cpp:75] Failed to create 'bind' backend: BindBackend requires
root privileges
I0705 13:21:38.819115 28164 cluster.cpp:432] Creating default 'local' authorizer
I0705 13:21:38.820525 28197 slave.cpp:203] Agent started on 547)@172.17.0.2:44394
I0705 13:21:38.820549 28197 slave.cpp:204] Flags at startup: --acls="" --appc_simple_discovery_uri_prefix="http://"
--appc_store_dir="/tmp/mesos/store/appc" --authenticate_http="true" --authenticatee="crammd5"
--authorizer="local" --cgroups_cpu_enable_pids_and_tids_count="false" --cgroups_enable_cfs="false"
--cgroups_hierarchy="/sys/fs/cgroup" --cgroups_limit_swap="false" --cgroups_root="mesos" --container_disk_watch_interval="15secs"
--containerizers="mesos" --credential="/tmp/Endpoint_SlaveEndpointTest_NoAuthorizer_1_HtJ68A/credential"
--default_role="*" --disk_watch_interval="1mins" --docker="docker" --docker_kill_orphans="true"
--docker_registry="https://registry-1.docker.io" --docker_remove_delay="6hrs" --docker_socket="/var/run/docker.sock"
--docker_stop_timeout="0ns" --docker_store_dir="/tmp/mesos/store/docker" --docker_volume_checkpoint_dir="/var/run/mesos/isolators/docker/volume"
--enforce_container_disk_quota="false" --executor_registration_timeout="1mins" --executor_shutdown_grace_period="5secs"
--fetcher_cache_dir="/tmp/Endpoint_SlaveEndpointTest_NoAuthorizer_1_HtJ68A/fetch" --fetcher_cache_size="2GB"
--frameworks_home="" --gc_delay="1weeks" --gc_disk_headroom="0.1" --hadoop_home="" --help="false"
--hostname_lookup="true" --http_authenticators="basic" --http_command_executor="false" --http_credentials="/tmp/Endpoint_SlaveEndpointTest_NoAuthorizer_1_HtJ68A/http_credentials"
--image_provisioner_backend="copy" --initialize_driver_logging="true" --isolation="posix/cpu,posix/mem"
--launcher_dir="/mesos/mesos-1.0.0/_build/src" --logbufsecs="0" --logging_level="INFO" --oversubscribed_resources_interval="15secs"
--perf_duration="10secs" --perf_interval="1mins" --qos_correction_interval_min="0ns" --quiet="false"
--recover="reconnect" --recovery_timeout="15mins" --registration_backoff_factor="10ms" --resources="cpus:2;gpus:0;mem:1024;disk:1024;ports:[31000-32000]"
--revocable_cpu_low_priority="true" --sandbox_directory="/mnt/mesos/sandbox" --strict="true"
--switch_user="true" --systemd_enable_support="true" --systemd_runtime_directory="/run/systemd/system"
--version="false" --work_dir="/tmp/Endpoint_SlaveEndpointTest_NoAuthorizer_1_HtJ68A"
I0705 13:21:38.821250 28197 credentials.hpp:86] Loading credential for authentication from
'/tmp/Endpoint_SlaveEndpointTest_NoAuthorizer_1_HtJ68A/credential'
I0705 13:21:38.821408 28197 slave.cpp:341] Agent using credential for: test-principal
I0705 13:21:38.821435 28197 credentials.hpp:37] Loading credentials for authentication from
'/tmp/Endpoint_SlaveEndpointTest_NoAuthorizer_1_HtJ68A/http_credentials'
I0705 13:21:38.821625 28197 slave.cpp:393] Using default 'basic' HTTP authenticator
I0705 13:21:38.821915 28197 resources.cpp:572] Parsing resources as JSON failed: cpus:2;gpus:0;mem:1024;disk:1024;ports:[31000-32000]
Trying semicolon-delimited string format instead
I0705 13:21:38.822408 28197 resources.cpp:572] Parsing resources as JSON failed: cpus:2;gpus:0;mem:1024;disk:1024;ports:[31000-32000]
Trying semicolon-delimited string format instead
I0705 13:21:38.822808 28197 slave.cpp:592] Agent resources: cpus(*):2; mem(*):1024; disk(*):1024;
ports(*):[31000-32000]
I0705 13:21:38.822870 28197 slave.cpp:600] Agent attributes: [  ]
I0705 13:21:38.822881 28197 slave.cpp:605] Agent hostname: c92aa051e3c4
I0705 13:21:38.824467 28190 state.cpp:57] Recovering state from '/tmp/Endpoint_SlaveEndpointTest_NoAuthorizer_1_HtJ68A/meta'
I0705 13:21:38.824554 28197 process.cpp:3322] Handling HTTP event for process 'slave(547)'
with path: '/slave(547)/monitor/statistics.json'
I0705 13:21:38.825085 28195 status_update_manager.cpp:200] Recovering status update manager
I0705 13:21:38.825289 28193 containerizer.cpp:522] Recovering containerizer
I0705 13:21:38.825568 28188 http.cpp:765] Authorizing principal 'test-principal' to GET the
'/monitor/statistics.json' endpoint
I0705 13:21:38.826444 28192 provisioner.cpp:253] Provisioner recovery complete
I0705 13:21:38.827025 28196 slave.cpp:4838] Finished recovery
I0705 13:21:38.827539 28196 slave.cpp:5010] Querying resource estimator for oversubscribable
resources
I0705 13:21:38.827735 28190 slave.cpp:5024] Received oversubscribable resources  from the
resource estimator
I0705 13:21:38.828604 28191 slave.cpp:839] Agent terminating
[       OK ] Endpoint/SlaveEndpointTest.NoAuthorizer/1 (19 ms)
[ RUN      ] Endpoint/SlaveEndpointTest.NoAuthorizer/2
I0705 13:21:38.837900 28164 containerizer.cpp:196] Using isolation: posix/cpu,posix/mem,filesystem/posix,network/cni
W0705 13:21:38.838749 28164 backend.cpp:75] Failed to create 'aufs' backend: AufsBackend requires
root privileges, but is running as user mesos
W0705 13:21:38.838886 28164 backend.cpp:75] Failed to create 'bind' backend: BindBackend requires
root privileges
I0705 13:21:38.840189 28164 cluster.cpp:432] Creating default 'local' authorizer
I0705 13:21:38.841656 28183 slave.cpp:203] Agent started on 548)@172.17.0.2:44394
I0705 13:21:38.841681 28183 slave.cpp:204] Flags at startup: --acls="" --appc_simple_discovery_uri_prefix="http://"
--appc_store_dir="/tmp/mesos/store/appc" --authenticate_http="true" --authenticatee="crammd5"
--authorizer="local" --cgroups_cpu_enable_pids_and_tids_count="false" --cgroups_enable_cfs="false"
--cgroups_hierarchy="/sys/fs/cgroup" --cgroups_limit_swap="false" --cgroups_root="mesos" --container_disk_watch_interval="15secs"
--containerizers="mesos" --credential="/tmp/Endpoint_SlaveEndpointTest_NoAuthorizer_2_NIwXXo/credential"
--default_role="*" --disk_watch_interval="1mins" --docker="docker" --docker_kill_orphans="true"
--docker_registry="https://registry-1.docker.io" --docker_remove_delay="6hrs" --docker_socket="/var/run/docker.sock"
--docker_stop_timeout="0ns" --docker_store_dir="/tmp/mesos/store/docker" --docker_volume_checkpoint_dir="/var/run/mesos/isolators/docker/volume"
--enforce_container_disk_quota="false" --executor_registration_timeout="1mins" --executor_shutdown_grace_period="5secs"
--fetcher_cache_dir="/tmp/Endpoint_SlaveEndpointTest_NoAuthorizer_2_NIwXXo/fetch" --fetcher_cache_size="2GB"
--frameworks_home="" --gc_delay="1weeks" --gc_disk_headroom="0.1" --hadoop_home="" --help="false"
--hostname_lookup="true" --http_authenticators="basic" --http_command_executor="false" --http_credentials="/tmp/Endpoint_SlaveEndpointTest_NoAuthorizer_2_NIwXXo/http_credentials"
--image_provisioner_backend="copy" --initialize_driver_logging="true" --isolation="posix/cpu,posix/mem"
--launcher_dir="/mesos/mesos-1.0.0/_build/src" --logbufsecs="0" --logging_level="INFO" --oversubscribed_resources_interval="15secs"
--perf_duration="10secs" --perf_interval="1mins" --qos_correction_interval_min="0ns" --quiet="false"
--recover="reconnect" --recovery_timeout="15mins" --registration_backoff_factor="10ms" --resources="cpus:2;gpus:0;mem:1024;disk:1024;ports:[31000-32000]"
--revocable_cpu_low_priority="true" --sandbox_directory="/mnt/mesos/sandbox" --strict="true"
--switch_user="true" --systemd_enable_support="true" --systemd_runtime_directory="/run/systemd/system"
--version="false" --work_dir="/tmp/Endpoint_SlaveEndpointTest_NoAuthorizer_2_NIwXXo"
I0705 13:21:38.842105 28183 credentials.hpp:86] Loading credential for authentication from
'/tmp/Endpoint_SlaveEndpointTest_NoAuthorizer_2_NIwXXo/credential'
I0705 13:21:38.842278 28183 slave.cpp:341] Agent using credential for: test-principal
I0705 13:21:38.842380 28183 credentials.hpp:37] Loading credentials for authentication from
'/tmp/Endpoint_SlaveEndpointTest_NoAuthorizer_2_NIwXXo/http_credentials'
I0705 13:21:38.842726 28183 slave.cpp:393] Using default 'basic' HTTP authenticator
I0705 13:21:38.843296 28183 resources.cpp:572] Parsing resources as JSON failed: cpus:2;gpus:0;mem:1024;disk:1024;ports:[31000-32000]
Trying semicolon-delimited string format instead
I0705 13:21:38.843974 28183 resources.cpp:572] Parsing resources as JSON failed: cpus:2;gpus:0;mem:1024;disk:1024;ports:[31000-32000]
Trying semicolon-delimited string format instead
I0705 13:21:38.844390 28183 slave.cpp:592] Agent resources: cpus(*):2; mem(*):1024; disk(*):1024;
ports(*):[31000-32000]
I0705 13:21:38.844454 28183 slave.cpp:600] Agent attributes: [  ]
I0705 13:21:38.844471 28183 slave.cpp:605] Agent hostname: c92aa051e3c4
I0705 13:21:38.845896 28192 state.cpp:57] Recovering state from '/tmp/Endpoint_SlaveEndpointTest_NoAuthorizer_2_NIwXXo/meta'
I0705 13:21:38.846019 28183 process.cpp:3322] Handling HTTP event for process 'slave(548)'
with path: '/slave(548)/containers'
I0705 13:21:38.846447 28198 status_update_manager.cpp:200] Recovering status update manager
I0705 13:21:38.846990 28192 containerizer.cpp:522] Recovering containerizer
I0705 13:21:38.847443 28186 http.cpp:765] Authorizing principal 'test-principal' to GET the
'/containers' endpoint
I0705 13:21:38.848248 28191 provisioner.cpp:253] Provisioner recovery complete
I0705 13:21:38.848990 28186 slave.cpp:4838] Finished recovery
I0705 13:21:38.849570 28186 slave.cpp:5010] Querying resource estimator for oversubscribable
resources
I0705 13:21:38.849771 28189 slave.cpp:5024] Received oversubscribable resources  from the
resource estimator
I0705 13:21:38.850811 28164 slave.cpp:839] Agent terminating
[       OK ] Endpoint/SlaveEndpointTest.NoAuthorizer/2 (22 ms)
[----------] 9 tests from Endpoint/SlaveEndpointTest (192 ms total)

[----------] Global test environment tear-down
[==========] 1223 tests from 139 test cases ran. (375580 ms total)
[  PASSED  ] 1222 tests.
[  FAILED  ] 1 test, listed below:
[  FAILED  ] DiskQuotaTest.SlaveRecovery

 1 FAILED TEST
  YOU HAVE 6 DISABLED TESTS

make[4]: *** [check-local] Error 1
make[4]: Leaving directory `/mesos/mesos-1.0.0/_build/src'
make[3]: *** [check-am] Error 2
make[3]: Leaving directory `/mesos/mesos-1.0.0/_build/src'
make[2]: *** [check] Error 2
make[2]: Leaving directory `/mesos/mesos-1.0.0/_build/src'
make[1]: *** [check-recursive] Error 1
make[1]: Leaving directory `/mesos/mesos-1.0.0/_build'
make: *** [distcheck] Error 1
+ docker rmi mesos-1467722808-386
Untagged: mesos-1467722808-386:latest
Deleted: 580a36318f32411c782bf82a3af2230268793f83c2170e30b91465c6ddeb4ecd
Deleted: 0935d1644f2710cd047d7874c619cee97c6f81fde2c4543cfd02e2d43258ee75
Deleted: e03e3136460f9f144939d963d5adce070d58d4cd614076721f1501dfe1994284
Deleted: 834a4af0b60dda84b11bad4fd12f6965da59a9f1cc89ff7b21acf056e81cc672
Deleted: e6adfa111459f3c90f26a3dcae5645fa50078f3f1afd5a0a3b9cd49221cac57c
Deleted: cf0ec8f4d55779cd7d610a845e97efce7cbbad8a16ea7f1672031747fce726bb
Deleted: 00653c2bc06fa289b74353992d766ced7a5ed98696f1672a3eaf0211bd13f5c8
Deleted: 69706b51d4e5d2e638ce8732c9aaf962c58c6074ab206997bfc99cb1f89c7136
Deleted: 54d7e22b85ecff12e3719731ea76385e8ab45d741c43d0f1647323fae909bc0c
Deleted: 6d4bc5096cbcbf1edbc80f32a850932f82e6bcce2e2e8641a8650c3d692aab8d
Deleted: 256caa51522de1b0216ec10b126b1929ebaad99294ebb0627a9d351cccc33fd5
Deleted: 95ca898916ece676526ec49ec86fa167ec01881b8adb08314fe5555650fe4557
Deleted: ac19589e3f3ed06e24e8e38be0822df61cac752664abdba6e3792d8fb4c6ba75
Deleted: 87897574793a9dcb0e077de91b10689bdb683624fb9b2574bd056a4320239759
Deleted: 00ca422b6a7ed11d6e952df62338d16f25f4f15cb83ad360089e0bba1460313b
Build step 'Execute shell' marked build as failure

Mime
View raw message