mesos-builds mailing list archives

Site index · List index
Message view « Date » · « Thread »
Top « Date » · « Thread »
From Apache Jenkins Server <jenk...@builds.apache.org>
Subject Build failed in Jenkins: Mesos » autotools,gcc,--verbose,GLOG_v=1 MESOS_VERBOSE=1,ubuntu:14.04,(docker||Hadoop)&&(!ubuntu-us1)&&(!ubuntu-6) #2435
Date Mon, 04 Jul 2016 21:11:45 GMT
See <https://builds.apache.org/job/Mesos/BUILDTOOL=autotools,COMPILER=gcc,CONFIGURATION=--verbose,ENVIRONMENT=GLOG_v=1%20MESOS_VERBOSE=1,OS=ubuntu%3A14.04,label_exp=(docker%7C%7CHadoop)&&(!ubuntu-us1)&&(!ubuntu-6)/2435/changes>

Changes:

[yujie.jay] Implemented file volume support in mesos containerizer.

[yujie.jay] Added test for file volume from host.

[yujie.jay] Added test for file volume from host sandbox mountpoint.

[yujie.jay] Fixed line in '3rdParty/Makefile.am' that had potential to 'rm -rf /'.

[yujie.jay] Temporarily disabled ROOT_GarbageCollectorUndeletableFilesTest.

------------------------------------------
[...truncated 193837 lines...]
I0704 21:11:43.307051 28198 slave.cpp:600] Agent attributes: [  ]
I0704 21:11:43.307070 28198 slave.cpp:605] Agent hostname: 22296fbcbbc2
I0704 21:11:43.308401 28197 state.cpp:57] Recovering state from '/tmp/Endpoint_SlaveEndpointTest_AuthorizedRequest_1_5uJWt9/meta'
I0704 21:11:43.308421 28198 process.cpp:3322] Handling HTTP event for process 'slave(541)'
with path: '/slave(541)/monitor/statistics.json'
I0704 21:11:43.309010 28191 status_update_manager.cpp:200] Recovering status update manager
I0704 21:11:43.309218 28189 containerizer.cpp:522] Recovering containerizer
I0704 21:11:43.309381 28192 http.cpp:765] Authorizing principal 'test-principal' to GET the
'/monitor/statistics.json' endpoint
I0704 21:11:43.310629 28193 provisioner.cpp:253] Provisioner recovery complete
I0704 21:11:43.311017 28197 slave.cpp:4838] Finished recovery
I0704 21:11:43.311465 28197 slave.cpp:5010] Querying resource estimator for oversubscribable
resources
I0704 21:11:43.311631 28189 slave.cpp:5024] Received oversubscribable resources  from the
resource estimator
I0704 21:11:43.312536 28195 slave.cpp:839] Agent terminating
[       OK ] Endpoint/SlaveEndpointTest.AuthorizedRequest/1 (21 ms)
[ RUN      ] Endpoint/SlaveEndpointTest.AuthorizedRequest/2
I0704 21:11:43.321902 28165 containerizer.cpp:196] Using isolation: posix/cpu,posix/mem,filesystem/posix,network/cni
W0704 21:11:43.322779 28165 backend.cpp:75] Failed to create 'aufs' backend: AufsBackend requires
root privileges, but is running as user mesos
W0704 21:11:43.323012 28165 backend.cpp:75] Failed to create 'bind' backend: BindBackend requires
root privileges
I0704 21:11:43.326606 28189 slave.cpp:203] Agent started on 542)@172.17.0.2:33880
I0704 21:11:43.326635 28189 slave.cpp:204] Flags at startup: --acls="" --appc_simple_discovery_uri_prefix="http://"
--appc_store_dir="/tmp/mesos/store/appc" --authenticate_http="true" --authenticatee="crammd5"
--authorizer="local" --cgroups_cpu_enable_pids_and_tids_count="false" --cgroups_enable_cfs="false"
--cgroups_hierarchy="/sys/fs/cgroup" --cgroups_limit_swap="false" --cgroups_root="mesos" --container_disk_watch_interval="15secs"
--containerizers="mesos" --credential="/tmp/Endpoint_SlaveEndpointTest_AuthorizedRequest_2_K45k3U/credential"
--default_role="*" --disk_watch_interval="1mins" --docker="docker" --docker_kill_orphans="true"
--docker_registry="https://registry-1.docker.io" --docker_remove_delay="6hrs" --docker_socket="/var/run/docker.sock"
--docker_stop_timeout="0ns" --docker_store_dir="/tmp/mesos/store/docker" --docker_volume_checkpoint_dir="/var/run/mesos/isolators/docker/volume"
--enforce_container_disk_quota="false" --executor_registration_timeout="1mins" --executor_shutdown_grace_period="5secs"
--fetcher_cache_dir="/tmp/Endpoint_SlaveEndpointTest_AuthorizedRequest_2_K45k3U/fetch" --fetcher_cache_size="2GB"
--frameworks_home="" --gc_delay="1weeks" --gc_disk_headroom="0.1" --hadoop_home="" --help="true"
--hostname_lookup="true" --http_authenticators="basic" --http_command_executor="false" --http_credentials="/tmp/Endpoint_SlaveEndpointTest_AuthorizedRequest_2_K45k3U/http_credentials"
--image_provisioner_backend="copy" --initialize_driver_logging="true" --isolation="posix/cpu,posix/mem"
--launcher_dir="/mesos/mesos-1.0.0/_build/src" --logbufsecs="0" --logging_level="INFO" --oversubscribed_resources_interval="15secs"
--perf_duration="10secs" --perf_interval="1mins" --qos_correction_interval_min="0ns" --quiet="false"
--recover="reconnect" --recovery_timeout="15mins" --registration_backoff_factor="10ms" --resources="cpus:2;gpus:0;mem:1024;disk:1024;ports:[31000-32000]"
--revocable_cpu_low_priority="true" --sandbox_directory="/mnt/mesos/sandbox" --strict="true"
--switch_user="true" --systemd_enable_support="true" --systemd_runtime_directory="/run/systemd/system"
--version="false" --work_dir="/tmp/Endpoint_SlaveEndpointTest_AuthorizedRequest_2_K45k3U"
I0704 21:11:43.327251 28189 credentials.hpp:86] Loading credential for authentication from
'/tmp/Endpoint_SlaveEndpointTest_AuthorizedRequest_2_K45k3U/credential'
I0704 21:11:43.327463 28189 slave.cpp:341] Agent using credential for: test-principal
I0704 21:11:43.327507 28189 credentials.hpp:37] Loading credentials for authentication from
'/tmp/Endpoint_SlaveEndpointTest_AuthorizedRequest_2_K45k3U/http_credentials'
I0704 21:11:43.327786 28189 slave.cpp:393] Using default 'basic' HTTP authenticator
I0704 21:11:43.328084 28189 resources.cpp:572] Parsing resources as JSON failed: cpus:2;gpus:0;mem:1024;disk:1024;ports:[31000-32000]
Trying semicolon-delimited string format instead
I0704 21:11:43.328356 28189 resources.cpp:572] Parsing resources as JSON failed: cpus:2;gpus:0;mem:1024;disk:1024;ports:[31000-32000]
Trying semicolon-delimited string format instead
I0704 21:11:43.328784 28189 slave.cpp:592] Agent resources: cpus(*):2; mem(*):1024; disk(*):1024;
ports(*):[31000-32000]
I0704 21:11:43.328861 28189 slave.cpp:600] Agent attributes: [  ]
I0704 21:11:43.328883 28189 slave.cpp:605] Agent hostname: 22296fbcbbc2
I0704 21:11:43.330348 28199 state.cpp:57] Recovering state from '/tmp/Endpoint_SlaveEndpointTest_AuthorizedRequest_2_K45k3U/meta'
I0704 21:11:43.330409 28189 process.cpp:3322] Handling HTTP event for process 'slave(542)'
with path: '/slave(542)/containers'
I0704 21:11:43.330863 28186 status_update_manager.cpp:200] Recovering status update manager
I0704 21:11:43.331038 28184 containerizer.cpp:522] Recovering containerizer
I0704 21:11:43.331351 28185 http.cpp:765] Authorizing principal 'test-principal' to GET the
'/containers' endpoint
I0704 21:11:43.332288 28189 provisioner.cpp:253] Provisioner recovery complete
I0704 21:11:43.332520 28185 slave.cpp:4838] Finished recovery
I0704 21:11:43.333052 28185 slave.cpp:5010] Querying resource estimator for oversubscribable
resources
I0704 21:11:43.333375 28192 slave.cpp:5024] Received oversubscribable resources  from the
resource estimator
I0704 21:11:43.334254 28199 slave.cpp:839] Agent terminating
[       OK ] Endpoint/SlaveEndpointTest.AuthorizedRequest/2 (21 ms)
[ RUN      ] Endpoint/SlaveEndpointTest.UnauthorizedRequest/0
I0704 21:11:43.342751 28165 containerizer.cpp:196] Using isolation: posix/cpu,posix/mem,filesystem/posix,network/cni
W0704 21:11:43.343588 28165 backend.cpp:75] Failed to create 'aufs' backend: AufsBackend requires
root privileges, but is running as user mesos
W0704 21:11:43.343745 28165 backend.cpp:75] Failed to create 'bind' backend: BindBackend requires
root privileges
I0704 21:11:43.347329 28187 slave.cpp:203] Agent started on 543)@172.17.0.2:33880
I0704 21:11:43.347359 28187 slave.cpp:204] Flags at startup: --acls="" --appc_simple_discovery_uri_prefix="http://"
--appc_store_dir="/tmp/mesos/store/appc" --authenticate_http="true" --authenticatee="crammd5"
--authorizer="local" --cgroups_cpu_enable_pids_and_tids_count="false" --cgroups_enable_cfs="false"
--cgroups_hierarchy="/sys/fs/cgroup" --cgroups_limit_swap="false" --cgroups_root="mesos" --container_disk_watch_interval="15secs"
--containerizers="mesos" --credential="/tmp/Endpoint_SlaveEndpointTest_UnauthorizedRequest_0_ViS7MG/credential"
--default_role="*" --disk_watch_interval="1mins" --docker="docker" --docker_kill_orphans="true"
--docker_registry="https://registry-1.docker.io" --docker_remove_delay="6hrs" --docker_socket="/var/run/docker.sock"
--docker_stop_timeout="0ns" --docker_store_dir="/tmp/mesos/store/docker" --docker_volume_checkpoint_dir="/var/run/mesos/isolators/docker/volume"
--enforce_container_disk_quota="false" --executor_registration_timeout="1mins" --executor_shutdown_grace_period="5secs"
--fetcher_cache_dir="/tmp/Endpoint_SlaveEndpointTest_UnauthorizedRequest_0_ViS7MG/fetch" --fetcher_cache_size="2GB"
--frameworks_home="" --gc_delay="1weeks" --gc_disk_headroom="0.1" --hadoop_home="" --help="true"
--hostname_lookup="true" --http_authenticators="basic" --http_command_executor="false" --http_credentials="/tmp/Endpoint_SlaveEndpointTest_UnauthorizedRequest_0_ViS7MG/http_credentials"
--image_provisioner_backend="copy" --initialize_driver_logging="true" --isolation="posix/cpu,posix/mem"
--launcher_dir="/mesos/mesos-1.0.0/_build/src" --logbufsecs="0" --logging_level="INFO" --oversubscribed_resources_interval="15secs"
--perf_duration="10secs" --perf_interval="1mins" --qos_correction_interval_min="0ns" --quiet="false"
--recover="reconnect" --recovery_timeout="15mins" --registration_backoff_factor="10ms" --resources="cpus:2;gpus:0;mem:1024;disk:1024;ports:[31000-32000]"
--revocable_cpu_low_priority="true" --sandbox_directory="/mnt/mesos/sandbox" --strict="true"
--switch_user="true" --systemd_enable_support="true" --systemd_runtime_directory="/run/systemd/system"
--version="false" --work_dir="/tmp/Endpoint_SlaveEndpointTest_UnauthorizedRequest_0_ViS7MG"
I0704 21:11:43.348135 28187 credentials.hpp:86] Loading credential for authentication from
'/tmp/Endpoint_SlaveEndpointTest_UnauthorizedRequest_0_ViS7MG/credential'
I0704 21:11:43.348286 28187 slave.cpp:341] Agent using credential for: test-principal
I0704 21:11:43.348326 28187 credentials.hpp:37] Loading credentials for authentication from
'/tmp/Endpoint_SlaveEndpointTest_UnauthorizedRequest_0_ViS7MG/http_credentials'
I0704 21:11:43.348608 28187 slave.cpp:393] Using default 'basic' HTTP authenticator
I0704 21:11:43.348968 28187 resources.cpp:572] Parsing resources as JSON failed: cpus:2;gpus:0;mem:1024;disk:1024;ports:[31000-32000]
Trying semicolon-delimited string format instead
I0704 21:11:43.349309 28187 resources.cpp:572] Parsing resources as JSON failed: cpus:2;gpus:0;mem:1024;disk:1024;ports:[31000-32000]
Trying semicolon-delimited string format instead
I0704 21:11:43.349753 28187 slave.cpp:592] Agent resources: cpus(*):2; mem(*):1024; disk(*):1024;
ports(*):[31000-32000]
I0704 21:11:43.349825 28187 slave.cpp:600] Agent attributes: [  ]
I0704 21:11:43.349846 28187 slave.cpp:605] Agent hostname: 22296fbcbbc2
I0704 21:11:43.351341 28196 state.cpp:57] Recovering state from '/tmp/Endpoint_SlaveEndpointTest_UnauthorizedRequest_0_ViS7MG/meta'
I0704 21:11:43.351451 28187 process.cpp:3322] Handling HTTP event for process 'slave(543)'
with path: '/slave(543)/monitor/statistics'
I0704 21:11:43.352097 28192 status_update_manager.cpp:200] Recovering status update manager
I0704 21:11:43.352285 28184 containerizer.cpp:522] Recovering containerizer
I0704 21:11:43.352669 28194 http.cpp:765] Authorizing principal 'test-principal' to GET the
'/monitor/statistics' endpoint
I0704 21:11:43.353632 28193 provisioner.cpp:253] Provisioner recovery complete
I0704 21:11:43.355347 28188 slave.cpp:4838] Finished recovery
I0704 21:11:43.355820 28188 slave.cpp:5010] Querying resource estimator for oversubscribable
resources
I0704 21:11:43.356178 28188 slave.cpp:839] Agent terminating
[       OK ] Endpoint/SlaveEndpointTest.UnauthorizedRequest/0 (23 ms)
[ RUN      ] Endpoint/SlaveEndpointTest.UnauthorizedRequest/1
I0704 21:11:43.365947 28165 containerizer.cpp:196] Using isolation: posix/cpu,posix/mem,filesystem/posix,network/cni
W0704 21:11:43.366773 28165 backend.cpp:75] Failed to create 'aufs' backend: AufsBackend requires
root privileges, but is running as user mesos
W0704 21:11:43.366981 28165 backend.cpp:75] Failed to create 'bind' backend: BindBackend requires
root privileges
I0704 21:11:43.370751 28192 slave.cpp:203] Agent started on 544)@172.17.0.2:33880
I0704 21:11:43.370781 28192 slave.cpp:204] Flags at startup: --acls="" --appc_simple_discovery_uri_prefix="http://"
--appc_store_dir="/tmp/mesos/store/appc" --authenticate_http="true" --authenticatee="crammd5"
--authorizer="local" --cgroups_cpu_enable_pids_and_tids_count="false" --cgroups_enable_cfs="false"
--cgroups_hierarchy="/sys/fs/cgroup" --cgroups_limit_swap="false" --cgroups_root="mesos" --container_disk_watch_interval="15secs"
--containerizers="mesos" --credential="/tmp/Endpoint_SlaveEndpointTest_UnauthorizedRequest_1_O0R0Hs/credential"
--default_role="*" --disk_watch_interval="1mins" --docker="docker" --docker_kill_orphans="true"
--docker_registry="https://registry-1.docker.io" --docker_remove_delay="6hrs" --docker_socket="/var/run/docker.sock"
--docker_stop_timeout="0ns" --docker_store_dir="/tmp/mesos/store/docker" --docker_volume_checkpoint_dir="/var/run/mesos/isolators/docker/volume"
--enforce_container_disk_quota="false" --executor_registration_timeout="1mins" --executor_shutdown_grace_period="5secs"
--fetcher_cache_dir="/tmp/Endpoint_SlaveEndpointTest_UnauthorizedRequest_1_O0R0Hs/fetch" --fetcher_cache_size="2GB"
--frameworks_home="" --gc_delay="1weeks" --gc_disk_headroom="0.1" --hadoop_home="" --help="true"
--hostname_lookup="true" --http_authenticators="basic" --http_command_executor="false" --http_credentials="/tmp/Endpoint_SlaveEndpointTest_UnauthorizedRequest_1_O0R0Hs/http_credentials"
--image_provisioner_backend="copy" --initialize_driver_logging="true" --isolation="posix/cpu,posix/mem"
--launcher_dir="/mesos/mesos-1.0.0/_build/src" --logbufsecs="0" --logging_level="INFO" --oversubscribed_resources_interval="15secs"
--perf_duration="10secs" --perf_interval="1mins" --qos_correction_interval_min="0ns" --quiet="false"
--recover="reconnect" --recovery_timeout="15mins" --registration_backoff_factor="10ms" --resources="cpus:2;gpus:0;mem:1024;disk:1024;ports:[31000-32000]"
--revocable_cpu_low_priority="true" --sandbox_directory="/mnt/mesos/sandbox" --strict="true"
--switch_user="true" --systemd_enable_support="true" --systemd_runtime_directory="/run/systemd/system"
--version="false" --work_dir="/tmp/Endpoint_SlaveEndpointTest_UnauthorizedRequest_1_O0R0Hs"
I0704 21:11:43.371377 28192 credentials.hpp:86] Loading credential for authentication from
'/tmp/Endpoint_SlaveEndpointTest_UnauthorizedRequest_1_O0R0Hs/credential'
I0704 21:11:43.371572 28192 slave.cpp:341] Agent using credential for: test-principal
I0704 21:11:43.371610 28192 credentials.hpp:37] Loading credentials for authentication from
'/tmp/Endpoint_SlaveEndpointTest_UnauthorizedRequest_1_O0R0Hs/http_credentials'
I0704 21:11:43.371945 28192 slave.cpp:393] Using default 'basic' HTTP authenticator
I0704 21:11:43.372303 28192 resources.cpp:572] Parsing resources as JSON failed: cpus:2;gpus:0;mem:1024;disk:1024;ports:[31000-32000]
Trying semicolon-delimited string format instead
I0704 21:11:43.372733 28192 resources.cpp:572] Parsing resources as JSON failed: cpus:2;gpus:0;mem:1024;disk:1024;ports:[31000-32000]
Trying semicolon-delimited string format instead
I0704 21:11:43.373217 28192 slave.cpp:592] Agent resources: cpus(*):2; mem(*):1024; disk(*):1024;
ports(*):[31000-32000]
I0704 21:11:43.373291 28192 slave.cpp:600] Agent attributes: [  ]
I0704 21:11:43.373304 28192 slave.cpp:605] Agent hostname: 22296fbcbbc2
I0704 21:11:43.374675 28187 state.cpp:57] Recovering state from '/tmp/Endpoint_SlaveEndpointTest_UnauthorizedRequest_1_O0R0Hs/meta'
I0704 21:11:43.374728 28192 process.cpp:3322] Handling HTTP event for process 'slave(544)'
with path: '/slave(544)/monitor/statistics.json'
I0704 21:11:43.375190 28185 status_update_manager.cpp:200] Recovering status update manager
I0704 21:11:43.375429 28188 containerizer.cpp:522] Recovering containerizer
I0704 21:11:43.375592 28195 http.cpp:765] Authorizing principal 'test-principal' to GET the
'/monitor/statistics.json' endpoint
I0704 21:11:43.376543 28186 provisioner.cpp:253] Provisioner recovery complete
I0704 21:11:43.376771 28187 slave.cpp:4838] Finished recovery
I0704 21:11:43.377243 28187 slave.cpp:5010] Querying resource estimator for oversubscribable
resources
I0704 21:11:43.377424 28197 slave.cpp:5024] Received oversubscribable resources  from the
resource estimator
I0704 21:11:43.377948 28188 slave.cpp:839] Agent terminating
[       OK ] Endpoint/SlaveEndpointTest.UnauthorizedRequest/1 (20 ms)
[ RUN      ] Endpoint/SlaveEndpointTest.UnauthorizedRequest/2
I0704 21:11:43.386210 28165 containerizer.cpp:196] Using isolation: posix/cpu,posix/mem,filesystem/posix,network/cni
W0704 21:11:43.387059 28165 backend.cpp:75] Failed to create 'aufs' backend: AufsBackend requires
root privileges, but is running as user mesos
W0704 21:11:43.387238 28165 backend.cpp:75] Failed to create 'bind' backend: BindBackend requires
root privileges
I0704 21:11:43.390878 28195 slave.cpp:203] Agent started on 545)@172.17.0.2:33880
I0704 21:11:43.390910 28195 slave.cpp:204] Flags at startup: --acls="" --appc_simple_discovery_uri_prefix="http://"
--appc_store_dir="/tmp/mesos/store/appc" --authenticate_http="true" --authenticatee="crammd5"
--authorizer="local" --cgroups_cpu_enable_pids_and_tids_count="false" --cgroups_enable_cfs="false"
--cgroups_hierarchy="/sys/fs/cgroup" --cgroups_limit_swap="false" --cgroups_root="mesos" --container_disk_watch_interval="15secs"
--containerizers="mesos" --credential="/tmp/Endpoint_SlaveEndpointTest_UnauthorizedRequest_2_t2Q2Me/credential"
--default_role="*" --disk_watch_interval="1mins" --docker="docker" --docker_kill_orphans="true"
--docker_registry="https://registry-1.docker.io" --docker_remove_delay="6hrs" --docker_socket="/var/run/docker.sock"
--docker_stop_timeout="0ns" --docker_store_dir="/tmp/mesos/store/docker" --docker_volume_checkpoint_dir="/var/run/mesos/isolators/docker/volume"
--enforce_container_disk_quota="false" --executor_registration_timeout="1mins" --executor_shutdown_grace_period="5secs"
--fetcher_cache_dir="/tmp/Endpoint_SlaveEndpointTest_UnauthorizedRequest_2_t2Q2Me/fetch" --fetcher_cache_size="2GB"
--frameworks_home="" --gc_delay="1weeks" --gc_disk_headroom="0.1" --hadoop_home="" --help="true"
--hostname_lookup="true" --http_authenticators="basic" --http_command_executor="false" --http_credentials="/tmp/Endpoint_SlaveEndpointTest_UnauthorizedRequest_2_t2Q2Me/http_credentials"
--image_provisioner_backend="copy" --initialize_driver_logging="true" --isolation="posix/cpu,posix/mem"
--launcher_dir="/mesos/mesos-1.0.0/_build/src" --logbufsecs="0" --logging_level="INFO" --oversubscribed_resources_interval="15secs"
--perf_duration="10secs" --perf_interval="1mins" --qos_correction_interval_min="0ns" --quiet="false"
--recover="reconnect" --recovery_timeout="15mins" --registration_backoff_factor="10ms" --resources="cpus:2;gpus:0;mem:1024;disk:1024;ports:[31000-32000]"
--revocable_cpu_low_priority="true" --sandbox_directory="/mnt/mesos/sandbox" --strict="true"
--switch_user="true" --systemd_enable_support="true" --systemd_runtime_directory="/run/systemd/system"
--version="false" --work_dir="/tmp/Endpoint_SlaveEndpointTest_UnauthorizedRequest_2_t2Q2Me"
I0704 21:11:43.391681 28195 credentials.hpp:86] Loading credential for authentication from
'/tmp/Endpoint_SlaveEndpointTest_UnauthorizedRequest_2_t2Q2Me/credential'
I0704 21:11:43.391880 28195 slave.cpp:341] Agent using credential for: test-principal
I0704 21:11:43.392061 28195 credentials.hpp:37] Loading credentials for authentication from
'/tmp/Endpoint_SlaveEndpointTest_UnauthorizedRequest_2_t2Q2Me/http_credentials'
I0704 21:11:43.392443 28195 slave.cpp:393] Using default 'basic' HTTP authenticator
I0704 21:11:43.392877 28195 resources.cpp:572] Parsing resources as JSON failed: cpus:2;gpus:0;mem:1024;disk:1024;ports:[31000-32000]
Trying semicolon-delimited string format instead
I0704 21:11:43.393254 28195 resources.cpp:572] Parsing resources as JSON failed: cpus:2;gpus:0;mem:1024;disk:1024;ports:[31000-32000]
Trying semicolon-delimited string format instead
I0704 21:11:43.393568 28195 slave.cpp:592] Agent resources: cpus(*):2; mem(*):1024; disk(*):1024;
ports(*):[31000-32000]
I0704 21:11:43.393621 28195 slave.cpp:600] Agent attributes: [  ]
I0704 21:11:43.393631 28195 slave.cpp:605] Agent hostname: 22296fbcbbc2
I0704 21:11:43.394692 28188 state.cpp:57] Recovering state from '/tmp/Endpoint_SlaveEndpointTest_UnauthorizedRequest_2_t2Q2Me/meta'
I0704 21:11:43.394716 28195 process.cpp:3322] Handling HTTP event for process 'slave(545)'
with path: '/slave(545)/containers'
I0704 21:11:43.395367 28186 status_update_manager.cpp:200] Recovering status update manager
I0704 21:11:43.395539 28186 containerizer.cpp:522] Recovering containerizer
I0704 21:11:43.395894 28188 http.cpp:765] Authorizing principal 'test-principal' to GET the
'/containers' endpoint
I0704 21:11:43.397114 28190 provisioner.cpp:253] Provisioner recovery complete
I0704 21:11:43.397641 28189 slave.cpp:4838] Finished recovery
I0704 21:11:43.398663 28189 slave.cpp:5010] Querying resource estimator for oversubscribable
resources
I0704 21:11:43.398897 28192 slave.cpp:5024] Received oversubscribable resources  from the
resource estimator
I0704 21:11:43.399001 28192 slave.cpp:839] Agent terminating
[       OK ] Endpoint/SlaveEndpointTest.UnauthorizedRequest/2 (21 ms)
[ RUN      ] Endpoint/SlaveEndpointTest.NoAuthorizer/0
I0704 21:11:43.406728 28165 containerizer.cpp:196] Using isolation: posix/cpu,posix/mem,filesystem/posix,network/cni
W0704 21:11:43.407318 28165 backend.cpp:75] Failed to create 'aufs' backend: AufsBackend requires
root privileges, but is running as user mesos
W0704 21:11:43.407449 28165 backend.cpp:75] Failed to create 'bind' backend: BindBackend requires
root privileges
I0704 21:11:43.408725 28165 cluster.cpp:432] Creating default 'local' authorizer
I0704 21:11:43.410240 28193 slave.cpp:203] Agent started on 546)@172.17.0.2:33880
I0704 21:11:43.410259 28193 slave.cpp:204] Flags at startup: --acls="" --appc_simple_discovery_uri_prefix="http://"
--appc_store_dir="/tmp/mesos/store/appc" --authenticate_http="true" --authenticatee="crammd5"
--authorizer="local" --cgroups_cpu_enable_pids_and_tids_count="false" --cgroups_enable_cfs="false"
--cgroups_hierarchy="/sys/fs/cgroup" --cgroups_limit_swap="false" --cgroups_root="mesos" --container_disk_watch_interval="15secs"
--containerizers="mesos" --credential="/tmp/Endpoint_SlaveEndpointTest_NoAuthorizer_0_mttl20/credential"
--default_role="*" --disk_watch_interval="1mins" --docker="docker" --docker_kill_orphans="true"
--docker_registry="https://registry-1.docker.io" --docker_remove_delay="6hrs" --docker_socket="/var/run/docker.sock"
--docker_stop_timeout="0ns" --docker_store_dir="/tmp/mesos/store/docker" --docker_volume_checkpoint_dir="/var/run/mesos/isolators/docker/volume"
--enforce_container_disk_quota="false" --executor_registration_timeout="1mins" --executor_shutdown_grace_period="5secs"
--fetcher_cache_dir="/tmp/Endpoint_SlaveEndpointTest_NoAuthorizer_0_mttl20/fetch" --fetcher_cache_size="2GB"
--frameworks_home="" --gc_delay="1weeks" --gc_disk_headroom="0.1" --hadoop_home="" --help="false"
--hostname_lookup="true" --http_authenticators="basic" --http_command_executor="false" --http_credentials="/tmp/Endpoint_SlaveEndpointTest_NoAuthorizer_0_mttl20/http_credentials"
--image_provisioner_backend="copy" --initialize_driver_logging="true" --isolation="posix/cpu,posix/mem"
--launcher_dir="/mesos/mesos-1.0.0/_build/src" --logbufsecs="0" --logging_level="INFO" --oversubscribed_resources_interval="15secs"
--perf_duration="10secs" --perf_interval="1mins" --qos_correction_interval_min="0ns" --quiet="false"
--recover="reconnect" --recovery_timeout="15mins" --registration_backoff_factor="10ms" --resources="cpus:2;gpus:0;mem:1024;disk:1024;ports:[31000-32000]"
--revocable_cpu_low_priority="true" --sandbox_directory="/mnt/mesos/sandbox" --strict="true"
--switch_user="true" --systemd_enable_support="true" --systemd_runtime_directory="/run/systemd/system"
--version="false" --work_dir="/tmp/Endpoint_SlaveEndpointTest_NoAuthorizer_0_mttl20"
I0704 21:11:43.410631 28193 credentials.hpp:86] Loading credential for authentication from
'/tmp/Endpoint_SlaveEndpointTest_NoAuthorizer_0_mttl20/credential'
I0704 21:11:43.410748 28193 slave.cpp:341] Agent using credential for: test-principal
I0704 21:11:43.410773 28193 credentials.hpp:37] Loading credentials for authentication from
'/tmp/Endpoint_SlaveEndpointTest_NoAuthorizer_0_mttl20/http_credentials'
I0704 21:11:43.410966 28193 slave.cpp:393] Using default 'basic' HTTP authenticator
I0704 21:11:43.411227 28193 resources.cpp:572] Parsing resources as JSON failed: cpus:2;gpus:0;mem:1024;disk:1024;ports:[31000-32000]
Trying semicolon-delimited string format instead
I0704 21:11:43.411449 28193 resources.cpp:572] Parsing resources as JSON failed: cpus:2;gpus:0;mem:1024;disk:1024;ports:[31000-32000]
Trying semicolon-delimited string format instead
I0704 21:11:43.411816 28193 slave.cpp:592] Agent resources: cpus(*):2; mem(*):1024; disk(*):1024;
ports(*):[31000-32000]
I0704 21:11:43.411869 28193 slave.cpp:600] Agent attributes: [  ]
I0704 21:11:43.411877 28193 slave.cpp:605] Agent hostname: 22296fbcbbc2
I0704 21:11:43.413318 28191 state.cpp:57] Recovering state from '/tmp/Endpoint_SlaveEndpointTest_NoAuthorizer_0_mttl20/meta'
I0704 21:11:43.413381 28193 process.cpp:3322] Handling HTTP event for process 'slave(546)'
with path: '/slave(546)/monitor/statistics'
I0704 21:11:43.413808 28199 status_update_manager.cpp:200] Recovering status update manager
I0704 21:11:43.413990 28193 containerizer.cpp:522] Recovering containerizer
I0704 21:11:43.414458 28194 http.cpp:765] Authorizing principal 'test-principal' to GET the
'/monitor/statistics' endpoint
I0704 21:11:43.415187 28190 provisioner.cpp:253] Provisioner recovery complete
I0704 21:11:43.415840 28199 slave.cpp:4838] Finished recovery
I0704 21:11:43.416290 28199 slave.cpp:5010] Querying resource estimator for oversubscribable
resources
I0704 21:11:43.416587 28194 slave.cpp:5024] Received oversubscribable resources  from the
resource estimator
I0704 21:11:43.417381 28199 slave.cpp:839] Agent terminating
[       OK ] Endpoint/SlaveEndpointTest.NoAuthorizer/0 (18 ms)
[ RUN      ] Endpoint/SlaveEndpointTest.NoAuthorizer/1
I0704 21:11:43.424988 28165 containerizer.cpp:196] Using isolation: posix/cpu,posix/mem,filesystem/posix,network/cni
W0704 21:11:43.425673 28165 backend.cpp:75] Failed to create 'aufs' backend: AufsBackend requires
root privileges, but is running as user mesos
W0704 21:11:43.425846 28165 backend.cpp:75] Failed to create 'bind' backend: BindBackend requires
root privileges
I0704 21:11:43.427322 28165 cluster.cpp:432] Creating default 'local' authorizer
I0704 21:11:43.429008 28192 slave.cpp:203] Agent started on 547)@172.17.0.2:33880
I0704 21:11:43.429031 28192 slave.cpp:204] Flags at startup: --acls="" --appc_simple_discovery_uri_prefix="http://"
--appc_store_dir="/tmp/mesos/store/appc" --authenticate_http="true" --authenticatee="crammd5"
--authorizer="local" --cgroups_cpu_enable_pids_and_tids_count="false" --cgroups_enable_cfs="false"
--cgroups_hierarchy="/sys/fs/cgroup" --cgroups_limit_swap="false" --cgroups_root="mesos" --container_disk_watch_interval="15secs"
--containerizers="mesos" --credential="/tmp/Endpoint_SlaveEndpointTest_NoAuthorizer_1_zSorqN/credential"
--default_role="*" --disk_watch_interval="1mins" --docker="docker" --docker_kill_orphans="true"
--docker_registry="https://registry-1.docker.io" --docker_remove_delay="6hrs" --docker_socket="/var/run/docker.sock"
--docker_stop_timeout="0ns" --docker_store_dir="/tmp/mesos/store/docker" --docker_volume_checkpoint_dir="/var/run/mesos/isolators/docker/volume"
--enforce_container_disk_quota="false" --executor_registration_timeout="1mins" --executor_shutdown_grace_period="5secs"
--fetcher_cache_dir="/tmp/Endpoint_SlaveEndpointTest_NoAuthorizer_1_zSorqN/fetch" --fetcher_cache_size="2GB"
--frameworks_home="" --gc_delay="1weeks" --gc_disk_headroom="0.1" --hadoop_home="" --help="false"
--hostname_lookup="true" --http_authenticators="basic" --http_command_executor="false" --http_credentials="/tmp/Endpoint_SlaveEndpointTest_NoAuthorizer_1_zSorqN/http_credentials"
--image_provisioner_backend="copy" --initialize_driver_logging="true" --isolation="posix/cpu,posix/mem"
--launcher_dir="/mesos/mesos-1.0.0/_build/src" --logbufsecs="0" --logging_level="INFO" --oversubscribed_resources_interval="15secs"
--perf_duration="10secs" --perf_interval="1mins" --qos_correction_interval_min="0ns" --quiet="false"
--recover="reconnect" --recovery_timeout="15mins" --registration_backoff_factor="10ms" --resources="cpus:2;gpus:0;mem:1024;disk:1024;ports:[31000-32000]"
--revocable_cpu_low_priority="true" --sandbox_directory="/mnt/mesos/sandbox" --strict="true"
--switch_user="true" --systemd_enable_support="true" --systemd_runtime_directory="/run/systemd/system"
--version="false" --work_dir="/tmp/Endpoint_SlaveEndpointTest_NoAuthorizer_1_zSorqN"
I0704 21:11:43.429625 28192 credentials.hpp:86] Loading credential for authentication from
'/tmp/Endpoint_SlaveEndpointTest_NoAuthorizer_1_zSorqN/credential'
I0704 21:11:43.429811 28192 slave.cpp:341] Agent using credential for: test-principal
I0704 21:11:43.429846 28192 credentials.hpp:37] Loading credentials for authentication from
'/tmp/Endpoint_SlaveEndpointTest_NoAuthorizer_1_zSorqN/http_credentials'
I0704 21:11:43.430130 28192 slave.cpp:393] Using default 'basic' HTTP authenticator
I0704 21:11:43.430586 28192 resources.cpp:572] Parsing resources as JSON failed: cpus:2;gpus:0;mem:1024;disk:1024;ports:[31000-32000]
Trying semicolon-delimited string format instead
I0704 21:11:43.431018 28192 resources.cpp:572] Parsing resources as JSON failed: cpus:2;gpus:0;mem:1024;disk:1024;ports:[31000-32000]
Trying semicolon-delimited string format instead
I0704 21:11:43.431612 28192 slave.cpp:592] Agent resources: cpus(*):2; mem(*):1024; disk(*):1024;
ports(*):[31000-32000]
I0704 21:11:43.431691 28192 slave.cpp:600] Agent attributes: [  ]
I0704 21:11:43.431705 28192 slave.cpp:605] Agent hostname: 22296fbcbbc2
I0704 21:11:43.433295 28197 state.cpp:57] Recovering state from '/tmp/Endpoint_SlaveEndpointTest_NoAuthorizer_1_zSorqN/meta'
I0704 21:11:43.433363 28192 process.cpp:3322] Handling HTTP event for process 'slave(547)'
with path: '/slave(547)/monitor/statistics.json'
I0704 21:11:43.433828 28193 status_update_manager.cpp:200] Recovering status update manager
I0704 21:11:43.433964 28188 containerizer.cpp:522] Recovering containerizer
I0704 21:11:43.434422 28192 http.cpp:765] Authorizing principal 'test-principal' to GET the
'/monitor/statistics.json' endpoint
I0704 21:11:43.435253 28190 provisioner.cpp:253] Provisioner recovery complete
I0704 21:11:43.435802 28194 slave.cpp:4838] Finished recovery
I0704 21:11:43.436368 28194 slave.cpp:5010] Querying resource estimator for oversubscribable
resources
I0704 21:11:43.436686 28198 slave.cpp:5024] Received oversubscribable resources  from the
resource estimator
I0704 21:11:43.437993 28186 slave.cpp:839] Agent terminating
[       OK ] Endpoint/SlaveEndpointTest.NoAuthorizer/1 (21 ms)
[ RUN      ] Endpoint/SlaveEndpointTest.NoAuthorizer/2
I0704 21:11:43.448179 28165 containerizer.cpp:196] Using isolation: posix/cpu,posix/mem,filesystem/posix,network/cni
W0704 21:11:43.449017 28165 backend.cpp:75] Failed to create 'aufs' backend: AufsBackend requires
root privileges, but is running as user mesos
W0704 21:11:43.449204 28165 backend.cpp:75] Failed to create 'bind' backend: BindBackend requires
root privileges
I0704 21:11:43.450961 28165 cluster.cpp:432] Creating default 'local' authorizer
I0704 21:11:43.453109 28192 slave.cpp:203] Agent started on 548)@172.17.0.2:33880
I0704 21:11:43.453132 28192 slave.cpp:204] Flags at startup: --acls="" --appc_simple_discovery_uri_prefix="http://"
--appc_store_dir="/tmp/mesos/store/appc" --authenticate_http="true" --authenticatee="crammd5"
--authorizer="local" --cgroups_cpu_enable_pids_and_tids_count="false" --cgroups_enable_cfs="false"
--cgroups_hierarchy="/sys/fs/cgroup" --cgroups_limit_swap="false" --cgroups_root="mesos" --container_disk_watch_interval="15secs"
--containerizers="mesos" --credential="/tmp/Endpoint_SlaveEndpointTest_NoAuthorizer_2_CyRXYz/credential"
--default_role="*" --disk_watch_interval="1mins" --docker="docker" --docker_kill_orphans="true"
--docker_registry="https://registry-1.docker.io" --docker_remove_delay="6hrs" --docker_socket="/var/run/docker.sock"
--docker_stop_timeout="0ns" --docker_store_dir="/tmp/mesos/store/docker" --docker_volume_checkpoint_dir="/var/run/mesos/isolators/docker/volume"
--enforce_container_disk_quota="false" --executor_registration_timeout="1mins" --executor_shutdown_grace_period="5secs"
--fetcher_cache_dir="/tmp/Endpoint_SlaveEndpointTest_NoAuthorizer_2_CyRXYz/fetch" --fetcher_cache_size="2GB"
--frameworks_home="" --gc_delay="1weeks" --gc_disk_headroom="0.1" --hadoop_home="" --help="false"
--hostname_lookup="true" --http_authenticators="basic" --http_command_executor="false" --http_credentials="/tmp/Endpoint_SlaveEndpointTest_NoAuthorizer_2_CyRXYz/http_credentials"
--image_provisioner_backend="copy" --initialize_driver_logging="true" --isolation="posix/cpu,posix/mem"
--launcher_dir="/mesos/mesos-1.0.0/_build/src" --logbufsecs="0" --logging_level="INFO" --oversubscribed_resources_interval="15secs"
--perf_duration="10secs" --perf_interval="1mins" --qos_correction_interval_min="0ns" --quiet="false"
--recover="reconnect" --recovery_timeout="15mins" --registration_backoff_factor="10ms" --resources="cpus:2;gpus:0;mem:1024;disk:1024;ports:[31000-32000]"
--revocable_cpu_low_priority="true" --sandbox_directory="/mnt/mesos/sandbox" --strict="true"
--switch_user="true" --systemd_enable_support="true" --systemd_runtime_directory="/run/systemd/system"
--version="false" --work_dir="/tmp/Endpoint_SlaveEndpointTest_NoAuthorizer_2_CyRXYz"
I0704 21:11:43.453783 28192 credentials.hpp:86] Loading credential for authentication from
'/tmp/Endpoint_SlaveEndpointTest_NoAuthorizer_2_CyRXYz/credential'
I0704 21:11:43.453999 28192 slave.cpp:341] Agent using credential for: test-principal
I0704 21:11:43.454033 28192 credentials.hpp:37] Loading credentials for authentication from
'/tmp/Endpoint_SlaveEndpointTest_NoAuthorizer_2_CyRXYz/http_credentials'
I0704 21:11:43.454306 28192 slave.cpp:393] Using default 'basic' HTTP authenticator
I0704 21:11:43.454711 28192 resources.cpp:572] Parsing resources as JSON failed: cpus:2;gpus:0;mem:1024;disk:1024;ports:[31000-32000]
Trying semicolon-delimited string format instead
I0704 21:11:43.455090 28192 resources.cpp:572] Parsing resources as JSON failed: cpus:2;gpus:0;mem:1024;disk:1024;ports:[31000-32000]
Trying semicolon-delimited string format instead
I0704 21:11:43.455621 28192 slave.cpp:592] Agent resources: cpus(*):2; mem(*):1024; disk(*):1024;
ports(*):[31000-32000]
I0704 21:11:43.455693 28192 slave.cpp:600] Agent attributes: [  ]
I0704 21:11:43.455706 28192 slave.cpp:605] Agent hostname: 22296fbcbbc2
I0704 21:11:43.456908 28193 state.cpp:57] Recovering state from '/tmp/Endpoint_SlaveEndpointTest_NoAuthorizer_2_CyRXYz/meta'
I0704 21:11:43.456975 28192 process.cpp:3322] Handling HTTP event for process 'slave(548)'
with path: '/slave(548)/containers'
I0704 21:11:43.457548 28189 status_update_manager.cpp:200] Recovering status update manager
I0704 21:11:43.457718 28199 containerizer.cpp:522] Recovering containerizer
I0704 21:11:43.457840 28185 http.cpp:765] Authorizing principal 'test-principal' to GET the
'/containers' endpoint
I0704 21:11:43.458734 28188 provisioner.cpp:253] Provisioner recovery complete
I0704 21:11:43.459027 28190 slave.cpp:4838] Finished recovery
I0704 21:11:43.459457 28190 slave.cpp:5010] Querying resource estimator for oversubscribable
resources
I0704 21:11:43.459722 28190 slave.cpp:5024] Received oversubscribable resources  from the
resource estimator
I0704 21:11:43.460618 28184 slave.cpp:839] Agent terminating
[       OK ] Endpoint/SlaveEndpointTest.NoAuthorizer/2 (21 ms)
[----------] 9 tests from Endpoint/SlaveEndpointTest (189 ms total)

[----------] Global test environment tear-down
[==========] 1219 tests from 139 test cases ran. (371747 ms total)
[  PASSED  ] 1218 tests.
[  FAILED  ] 1 test, listed below:
[  FAILED  ] DiskQuotaTest.SlaveRecovery

 1 FAILED TEST
  YOU HAVE 6 DISABLED TESTS

make[4]: *** [check-local] Error 1
make[4]: Leaving directory `/mesos/mesos-1.0.0/_build/src'
make[3]: *** [check-am] Error 2
make[3]: Leaving directory `/mesos/mesos-1.0.0/_build/src'
make[2]: *** [check] Error 2
make[2]: Leaving directory `/mesos/mesos-1.0.0/_build/src'
make[1]: *** [check-recursive] Error 1
make[1]: Leaving directory `/mesos/mesos-1.0.0/_build'
make: *** [distcheck] Error 1
+ docker rmi mesos-1467664650-32690
Untagged: mesos-1467664650-32690:latest
Deleted: 662c323a310aa173951ad8ae5affdc78eccb4fa91f6ed80327ee053824cc367b
Deleted: 7cb860aa47cda62c8c38c46b186d4526dd9b6d0ff2e5f563d582c4d9a8d386a2
Deleted: 6c020c0fa948221b5879dad3434358f3f807742bcffc9f9b443bc10c3b5d3a8c
Deleted: fdfbb791d8ce9cdef63ef2bac225efea1c61153f839ea5bad0c53083ec6e31b1
Deleted: d11c0bae9daa70f6cc2aba095d8c2afcaa9fe90370c6e8410a54da3b60e29a1d
Deleted: 714cfc168c9d5a7216ceb4b66f5f22afcd31c83b8cb98b38ad57b3ab84111123
Deleted: 7dc901faa38f7613a2e8a1b7ad9d38580de141eeb3baeca06a88f8caff1723ca
Deleted: 17794f2decbe8af67dc06e745e9dc072a5855a2e3936d4d93b7fe7b9b79380f7
Deleted: 565bc74697e3fca19a1aacc24b9f13a8309a5619df4675eab3bb30b1f4e4ea4b
Deleted: a4ec2cd38ce06a8e53664f03b2a92a55330f915387059837f4491bde3c3084c0
Deleted: e518f0c67f870322736ff85fc9ac329263549403c4da3ce9a330aa31795a640d
Deleted: c68cb924a9a8f56e67ee2147be151fdc84e8bc98caf008ab684b777d082908fe
Deleted: e2fd434b196032b032e691ee996c7bc09b0efcd5e1e589221a77188a082a44c7
Deleted: 10a3f6ed3c91ed5864db5f57fc1dd0d6bdd4e3bf44e3abb44668511e549bc611
Deleted: a573008238df06446cb1ecae14c154a6a303883b9302b56b975173de8cf85266
Build step 'Execute shell' marked build as failure

Mime
View raw message