mesos-builds mailing list archives

Site index · List index
Message view « Date » · « Thread »
Top « Date » · « Thread »
From Apache Jenkins Server <jenk...@builds.apache.org>
Subject Build failed in Jenkins: Mesos » autotools,gcc,--verbose,GLOG_v=1 MESOS_VERBOSE=1,centos:7,(docker||Hadoop)&&(!ubuntu-us1)&&(!ubuntu-6) #2471
Date Fri, 08 Jul 2016 01:56:16 GMT
See <https://builds.apache.org/job/Mesos/BUILDTOOL=autotools,COMPILER=gcc,CONFIGURATION=--verbose,ENVIRONMENT=GLOG_v=1%20MESOS_VERBOSE=1,OS=centos%3A7,label_exp=(docker%7C%7CHadoop)&&(!ubuntu-us1)&&(!ubuntu-6)/2471/changes>

Changes:

[vinodkone] Updated Mesos version to 1.1.0.

------------------------------------------
[...truncated 198790 lines...]
I0708 01:56:11.982781 29179 slave.cpp:607] Agent hostname: 2c6cdcb4ddc5
I0708 01:56:11.984109 29176 state.cpp:57] Recovering state from '/tmp/Endpoint_SlaveEndpointTest_AuthorizedRequest_1_sdcyaf/meta'
I0708 01:56:11.984180 29179 process.cpp:3322] Handling HTTP event for process 'slave(548)'
with path: '/slave(548)/monitor/statistics.json'
I0708 01:56:11.986227 29167 status_update_manager.cpp:200] Recovering status update manager
I0708 01:56:11.986479 29170 containerizer.cpp:522] Recovering containerizer
I0708 01:56:11.986657 29171 http.cpp:829] Authorizing principal 'test-principal' to GET the
'/monitor/statistics.json' endpoint
I0708 01:56:11.987807 29168 provisioner.cpp:253] Provisioner recovery complete
I0708 01:56:11.988411 29178 slave.cpp:4856] Finished recovery
I0708 01:56:11.996395 29178 slave.cpp:5028] Querying resource estimator for oversubscribable
resources
I0708 01:56:11.996574 29178 slave.cpp:841] Agent terminating
[       OK ] Endpoint/SlaveEndpointTest.AuthorizedRequest/1 (30 ms)
[ RUN      ] Endpoint/SlaveEndpointTest.AuthorizedRequest/2
I0708 01:56:12.009131 29145 containerizer.cpp:196] Using isolation: posix/cpu,posix/mem,filesystem/posix,network/cni
W0708 01:56:12.009832 29145 backend.cpp:75] Failed to create 'aufs' backend: AufsBackend requires
root privileges, but is running as user mesos
W0708 01:56:12.009987 29145 backend.cpp:75] Failed to create 'bind' backend: BindBackend requires
root privileges
I0708 01:56:12.012743 29170 slave.cpp:205] Agent started on 549)@172.17.0.3:53281
I0708 01:56:12.012769 29170 slave.cpp:206] Flags at startup: --acls="" --appc_simple_discovery_uri_prefix="http://"
--appc_store_dir="/tmp/mesos/store/appc" --authenticate_http="true" --authenticatee="crammd5"
--authentication_backoff_factor="1secs" --authorizer="local" --cgroups_cpu_enable_pids_and_tids_count="false"
--cgroups_enable_cfs="false" --cgroups_hierarchy="/sys/fs/cgroup" --cgroups_limit_swap="false"
--cgroups_root="mesos" --container_disk_watch_interval="15secs" --containerizers="mesos" --credential="/tmp/Endpoint_SlaveEndpointTest_AuthorizedRequest_2_HVgrAs/credential"
--default_role="*" --disk_watch_interval="1mins" --docker="docker" --docker_kill_orphans="true"
--docker_registry="https://registry-1.docker.io" --docker_remove_delay="6hrs" --docker_socket="/var/run/docker.sock"
--docker_stop_timeout="0ns" --docker_store_dir="/tmp/mesos/store/docker" --docker_volume_checkpoint_dir="/var/run/mesos/isolators/docker/volume"
--enforce_container_disk_quota="false" --executor_registration_timeout="1mins" --executor_shutdown_grace_period="5secs"
--fetcher_cache_dir="/tmp/Endpoint_SlaveEndpointTest_AuthorizedRequest_2_HVgrAs/fetch" --fetcher_cache_size="2GB"
--frameworks_home="" --gc_delay="1weeks" --gc_disk_headroom="0.1" --hadoop_home="" --help="true"
--hostname_lookup="true" --http_authenticators="basic" --http_command_executor="false" --http_credentials="/tmp/Endpoint_SlaveEndpointTest_AuthorizedRequest_2_HVgrAs/http_credentials"
--image_provisioner_backend="copy" --initialize_driver_logging="true" --isolation="posix/cpu,posix/mem"
--launcher_dir="/mesos/mesos-1.1.0/_build/src" --logbufsecs="0" --logging_level="INFO" --oversubscribed_resources_interval="15secs"
--perf_duration="10secs" --perf_interval="1mins" --qos_correction_interval_min="0ns" --quiet="false"
--recover="reconnect" --recovery_timeout="15mins" --registration_backoff_factor="10ms" --resources="cpus:2;gpus:0;mem:1024;disk:1024;ports:[31000-32000]"
--revocable_cpu_low_priority="true" --sandbox_directory="/mnt/mesos/sandbox" --strict="true"
--switch_user="true" --systemd_enable_support="true" --systemd_runtime_directory="/run/systemd/system"
--version="false" --work_dir="/tmp/Endpoint_SlaveEndpointTest_AuthorizedRequest_2_HVgrAs"
I0708 01:56:12.013319 29170 credentials.hpp:86] Loading credential for authentication from
'/tmp/Endpoint_SlaveEndpointTest_AuthorizedRequest_2_HVgrAs/credential'
I0708 01:56:12.013491 29170 slave.cpp:343] Agent using credential for: test-principal
I0708 01:56:12.013525 29170 credentials.hpp:37] Loading credentials for authentication from
'/tmp/Endpoint_SlaveEndpointTest_AuthorizedRequest_2_HVgrAs/http_credentials'
I0708 01:56:12.013779 29170 slave.cpp:395] Using default 'basic' HTTP authenticator
I0708 01:56:12.014168 29170 resources.cpp:572] Parsing resources as JSON failed: cpus:2;gpus:0;mem:1024;disk:1024;ports:[31000-32000]
Trying semicolon-delimited string format instead
I0708 01:56:12.014464 29170 resources.cpp:572] Parsing resources as JSON failed: cpus:2;gpus:0;mem:1024;disk:1024;ports:[31000-32000]
Trying semicolon-delimited string format instead
I0708 01:56:12.014821 29170 slave.cpp:594] Agent resources: cpus(*):2; mem(*):1024; disk(*):1024;
ports(*):[31000-32000]
I0708 01:56:12.014878 29170 slave.cpp:602] Agent attributes: [  ]
I0708 01:56:12.014889 29170 slave.cpp:607] Agent hostname: 2c6cdcb4ddc5
I0708 01:56:12.016350 29171 state.cpp:57] Recovering state from '/tmp/Endpoint_SlaveEndpointTest_AuthorizedRequest_2_HVgrAs/meta'
I0708 01:56:12.016401 29170 process.cpp:3322] Handling HTTP event for process 'slave(549)'
with path: '/slave(549)/containers'
I0708 01:56:12.016892 29172 status_update_manager.cpp:200] Recovering status update manager
I0708 01:56:12.017158 29172 containerizer.cpp:522] Recovering containerizer
I0708 01:56:12.017385 29164 http.cpp:829] Authorizing principal 'test-principal' to GET the
'/containers' endpoint
I0708 01:56:12.018483 29174 provisioner.cpp:253] Provisioner recovery complete
I0708 01:56:12.019073 29165 slave.cpp:4856] Finished recovery
I0708 01:56:12.020236 29165 slave.cpp:5028] Querying resource estimator for oversubscribable
resources
I0708 01:56:12.020623 29169 slave.cpp:5042] Received oversubscribable resources  from the
resource estimator
I0708 01:56:12.020845 29172 slave.cpp:841] Agent terminating
[       OK ] Endpoint/SlaveEndpointTest.AuthorizedRequest/2 (20 ms)
[ RUN      ] Endpoint/SlaveEndpointTest.UnauthorizedRequest/0
I0708 01:56:12.043463 29145 containerizer.cpp:196] Using isolation: posix/cpu,posix/mem,filesystem/posix,network/cni
W0708 01:56:12.044441 29145 backend.cpp:75] Failed to create 'aufs' backend: AufsBackend requires
root privileges, but is running as user mesos
W0708 01:56:12.044631 29145 backend.cpp:75] Failed to create 'bind' backend: BindBackend requires
root privileges
I0708 01:56:12.048321 29168 slave.cpp:205] Agent started on 550)@172.17.0.3:53281
I0708 01:56:12.048355 29168 slave.cpp:206] Flags at startup: --acls="" --appc_simple_discovery_uri_prefix="http://"
--appc_store_dir="/tmp/mesos/store/appc" --authenticate_http="true" --authenticatee="crammd5"
--authentication_backoff_factor="1secs" --authorizer="local" --cgroups_cpu_enable_pids_and_tids_count="false"
--cgroups_enable_cfs="false" --cgroups_hierarchy="/sys/fs/cgroup" --cgroups_limit_swap="false"
--cgroups_root="mesos" --container_disk_watch_interval="15secs" --containerizers="mesos" --credential="/tmp/Endpoint_SlaveEndpointTest_UnauthorizedRequest_0_ozVWeG/credential"
--default_role="*" --disk_watch_interval="1mins" --docker="docker" --docker_kill_orphans="true"
--docker_registry="https://registry-1.docker.io" --docker_remove_delay="6hrs" --docker_socket="/var/run/docker.sock"
--docker_stop_timeout="0ns" --docker_store_dir="/tmp/mesos/store/docker" --docker_volume_checkpoint_dir="/var/run/mesos/isolators/docker/volume"
--enforce_container_disk_quota="false" --executor_registration_timeout="1mins" --executor_shutdown_grace_period="5secs"
--fetcher_cache_dir="/tmp/Endpoint_SlaveEndpointTest_UnauthorizedRequest_0_ozVWeG/fetch" --fetcher_cache_size="2GB"
--frameworks_home="" --gc_delay="1weeks" --gc_disk_headroom="0.1" --hadoop_home="" --help="true"
--hostname_lookup="true" --http_authenticators="basic" --http_command_executor="false" --http_credentials="/tmp/Endpoint_SlaveEndpointTest_UnauthorizedRequest_0_ozVWeG/http_credentials"
--image_provisioner_backend="copy" --initialize_driver_logging="true" --isolation="posix/cpu,posix/mem"
--launcher_dir="/mesos/mesos-1.1.0/_build/src" --logbufsecs="0" --logging_level="INFO" --oversubscribed_resources_interval="15secs"
--perf_duration="10secs" --perf_interval="1mins" --qos_correction_interval_min="0ns" --quiet="false"
--recover="reconnect" --recovery_timeout="15mins" --registration_backoff_factor="10ms" --resources="cpus:2;gpus:0;mem:1024;disk:1024;ports:[31000-32000]"
--revocable_cpu_low_priority="true" --sandbox_directory="/mnt/mesos/sandbox" --strict="true"
--switch_user="true" --systemd_enable_support="true" --systemd_runtime_directory="/run/systemd/system"
--version="false" --work_dir="/tmp/Endpoint_SlaveEndpointTest_UnauthorizedRequest_0_ozVWeG"
I0708 01:56:12.049258 29168 credentials.hpp:86] Loading credential for authentication from
'/tmp/Endpoint_SlaveEndpointTest_UnauthorizedRequest_0_ozVWeG/credential'
I0708 01:56:12.049439 29168 slave.cpp:343] Agent using credential for: test-principal
I0708 01:56:12.049476 29168 credentials.hpp:37] Loading credentials for authentication from
'/tmp/Endpoint_SlaveEndpointTest_UnauthorizedRequest_0_ozVWeG/http_credentials'
I0708 01:56:12.049741 29168 slave.cpp:395] Using default 'basic' HTTP authenticator
I0708 01:56:12.050098 29168 resources.cpp:572] Parsing resources as JSON failed: cpus:2;gpus:0;mem:1024;disk:1024;ports:[31000-32000]
Trying semicolon-delimited string format instead
I0708 01:56:12.050448 29168 resources.cpp:572] Parsing resources as JSON failed: cpus:2;gpus:0;mem:1024;disk:1024;ports:[31000-32000]
Trying semicolon-delimited string format instead
I0708 01:56:12.050899 29168 slave.cpp:594] Agent resources: cpus(*):2; mem(*):1024; disk(*):1024;
ports(*):[31000-32000]
I0708 01:56:12.050997 29168 slave.cpp:602] Agent attributes: [  ]
I0708 01:56:12.051012 29168 slave.cpp:607] Agent hostname: 2c6cdcb4ddc5
I0708 01:56:12.052459 29175 state.cpp:57] Recovering state from '/tmp/Endpoint_SlaveEndpointTest_UnauthorizedRequest_0_ozVWeG/meta'
I0708 01:56:12.052541 29168 process.cpp:3322] Handling HTTP event for process 'slave(550)'
with path: '/slave(550)/monitor/statistics'
I0708 01:56:12.053069 29169 status_update_manager.cpp:200] Recovering status update manager
I0708 01:56:12.053256 29170 containerizer.cpp:522] Recovering containerizer
I0708 01:56:12.053576 29166 http.cpp:829] Authorizing principal 'test-principal' to GET the
'/monitor/statistics' endpoint
I0708 01:56:12.054385 29167 provisioner.cpp:253] Provisioner recovery complete
I0708 01:56:12.054895 29175 slave.cpp:4856] Finished recovery
I0708 01:56:12.055589 29175 slave.cpp:5028] Querying resource estimator for oversubscribable
resources
I0708 01:56:12.055836 29169 slave.cpp:5042] Received oversubscribable resources  from the
resource estimator
I0708 01:56:12.056056 29168 slave.cpp:841] Agent terminating
[       OK ] Endpoint/SlaveEndpointTest.UnauthorizedRequest/0 (42 ms)
[ RUN      ] Endpoint/SlaveEndpointTest.UnauthorizedRequest/1
I0708 01:56:12.085114 29145 containerizer.cpp:196] Using isolation: posix/cpu,posix/mem,filesystem/posix,network/cni
W0708 01:56:12.086076 29145 backend.cpp:75] Failed to create 'aufs' backend: AufsBackend requires
root privileges, but is running as user mesos
W0708 01:56:12.086249 29145 backend.cpp:75] Failed to create 'bind' backend: BindBackend requires
root privileges
I0708 01:56:12.089658 29172 slave.cpp:205] Agent started on 551)@172.17.0.3:53281
I0708 01:56:12.089694 29172 slave.cpp:206] Flags at startup: --acls="" --appc_simple_discovery_uri_prefix="http://"
--appc_store_dir="/tmp/mesos/store/appc" --authenticate_http="true" --authenticatee="crammd5"
--authentication_backoff_factor="1secs" --authorizer="local" --cgroups_cpu_enable_pids_and_tids_count="false"
--cgroups_enable_cfs="false" --cgroups_hierarchy="/sys/fs/cgroup" --cgroups_limit_swap="false"
--cgroups_root="mesos" --container_disk_watch_interval="15secs" --containerizers="mesos" --credential="/tmp/Endpoint_SlaveEndpointTest_UnauthorizedRequest_1_NkPVcU/credential"
--default_role="*" --disk_watch_interval="1mins" --docker="docker" --docker_kill_orphans="true"
--docker_registry="https://registry-1.docker.io" --docker_remove_delay="6hrs" --docker_socket="/var/run/docker.sock"
--docker_stop_timeout="0ns" --docker_store_dir="/tmp/mesos/store/docker" --docker_volume_checkpoint_dir="/var/run/mesos/isolators/docker/volume"
--enforce_container_disk_quota="false" --executor_registration_timeout="1mins" --executor_shutdown_grace_period="5secs"
--fetcher_cache_dir="/tmp/Endpoint_SlaveEndpointTest_UnauthorizedRequest_1_NkPVcU/fetch" --fetcher_cache_size="2GB"
--frameworks_home="" --gc_delay="1weeks" --gc_disk_headroom="0.1" --hadoop_home="" --help="true"
--hostname_lookup="true" --http_authenticators="basic" --http_command_executor="false" --http_credentials="/tmp/Endpoint_SlaveEndpointTest_UnauthorizedRequest_1_NkPVcU/http_credentials"
--image_provisioner_backend="copy" --initialize_driver_logging="true" --isolation="posix/cpu,posix/mem"
--launcher_dir="/mesos/mesos-1.1.0/_build/src" --logbufsecs="0" --logging_level="INFO" --oversubscribed_resources_interval="15secs"
--perf_duration="10secs" --perf_interval="1mins" --qos_correction_interval_min="0ns" --quiet="false"
--recover="reconnect" --recovery_timeout="15mins" --registration_backoff_factor="10ms" --resources="cpus:2;gpus:0;mem:1024;disk:1024;ports:[31000-32000]"
--revocable_cpu_low_priority="true" --sandbox_directory="/mnt/mesos/sandbox" --strict="true"
--switch_user="true" --systemd_enable_support="true" --systemd_runtime_directory="/run/systemd/system"
--version="false" --work_dir="/tmp/Endpoint_SlaveEndpointTest_UnauthorizedRequest_1_NkPVcU"
I0708 01:56:12.090572 29172 credentials.hpp:86] Loading credential for authentication from
'/tmp/Endpoint_SlaveEndpointTest_UnauthorizedRequest_1_NkPVcU/credential'
I0708 01:56:12.090756 29172 slave.cpp:343] Agent using credential for: test-principal
I0708 01:56:12.090806 29172 credentials.hpp:37] Loading credentials for authentication from
'/tmp/Endpoint_SlaveEndpointTest_UnauthorizedRequest_1_NkPVcU/http_credentials'
I0708 01:56:12.091150 29172 slave.cpp:395] Using default 'basic' HTTP authenticator
I0708 01:56:12.091589 29172 resources.cpp:572] Parsing resources as JSON failed: cpus:2;gpus:0;mem:1024;disk:1024;ports:[31000-32000]
Trying semicolon-delimited string format instead
I0708 01:56:12.091908 29172 resources.cpp:572] Parsing resources as JSON failed: cpus:2;gpus:0;mem:1024;disk:1024;ports:[31000-32000]
Trying semicolon-delimited string format instead
I0708 01:56:12.092423 29172 slave.cpp:594] Agent resources: cpus(*):2; mem(*):1024; disk(*):1024;
ports(*):[31000-32000]
I0708 01:56:12.092499 29172 slave.cpp:602] Agent attributes: [  ]
I0708 01:56:12.092512 29172 slave.cpp:607] Agent hostname: 2c6cdcb4ddc5
I0708 01:56:12.093972 29168 state.cpp:57] Recovering state from '/tmp/Endpoint_SlaveEndpointTest_UnauthorizedRequest_1_NkPVcU/meta'
I0708 01:56:12.094020 29172 process.cpp:3322] Handling HTTP event for process 'slave(551)'
with path: '/slave(551)/monitor/statistics.json'
I0708 01:56:12.094456 29165 status_update_manager.cpp:200] Recovering status update manager
I0708 01:56:12.094655 29174 containerizer.cpp:522] Recovering containerizer
I0708 01:56:12.095053 29167 http.cpp:829] Authorizing principal 'test-principal' to GET the
'/monitor/statistics.json' endpoint
I0708 01:56:12.096163 29174 provisioner.cpp:253] Provisioner recovery complete
I0708 01:56:12.096484 29175 slave.cpp:4856] Finished recovery
I0708 01:56:12.097194 29175 slave.cpp:5028] Querying resource estimator for oversubscribable
resources
I0708 01:56:12.097471 29178 slave.cpp:5042] Received oversubscribable resources  from the
resource estimator
I0708 01:56:12.097842 29177 slave.cpp:841] Agent terminating
[       OK ] Endpoint/SlaveEndpointTest.UnauthorizedRequest/1 (22 ms)
[ RUN      ] Endpoint/SlaveEndpointTest.UnauthorizedRequest/2
I0708 01:56:12.117566 29145 containerizer.cpp:196] Using isolation: posix/cpu,posix/mem,filesystem/posix,network/cni
W0708 01:56:12.118227 29145 backend.cpp:75] Failed to create 'aufs' backend: AufsBackend requires
root privileges, but is running as user mesos
W0708 01:56:12.118360 29145 backend.cpp:75] Failed to create 'bind' backend: BindBackend requires
root privileges
I0708 01:56:12.121219 29168 slave.cpp:205] Agent started on 552)@172.17.0.3:53281
I0708 01:56:12.121248 29168 slave.cpp:206] Flags at startup: --acls="" --appc_simple_discovery_uri_prefix="http://"
--appc_store_dir="/tmp/mesos/store/appc" --authenticate_http="true" --authenticatee="crammd5"
--authentication_backoff_factor="1secs" --authorizer="local" --cgroups_cpu_enable_pids_and_tids_count="false"
--cgroups_enable_cfs="false" --cgroups_hierarchy="/sys/fs/cgroup" --cgroups_limit_swap="false"
--cgroups_root="mesos" --container_disk_watch_interval="15secs" --containerizers="mesos" --credential="/tmp/Endpoint_SlaveEndpointTest_UnauthorizedRequest_2_Sptvs8/credential"
--default_role="*" --disk_watch_interval="1mins" --docker="docker" --docker_kill_orphans="true"
--docker_registry="https://registry-1.docker.io" --docker_remove_delay="6hrs" --docker_socket="/var/run/docker.sock"
--docker_stop_timeout="0ns" --docker_store_dir="/tmp/mesos/store/docker" --docker_volume_checkpoint_dir="/var/run/mesos/isolators/docker/volume"
--enforce_container_disk_quota="false" --executor_registration_timeout="1mins" --executor_shutdown_grace_period="5secs"
--fetcher_cache_dir="/tmp/Endpoint_SlaveEndpointTest_UnauthorizedRequest_2_Sptvs8/fetch" --fetcher_cache_size="2GB"
--frameworks_home="" --gc_delay="1weeks" --gc_disk_headroom="0.1" --hadoop_home="" --help="true"
--hostname_lookup="true" --http_authenticators="basic" --http_command_executor="false" --http_credentials="/tmp/Endpoint_SlaveEndpointTest_UnauthorizedRequest_2_Sptvs8/http_credentials"
--image_provisioner_backend="copy" --initialize_driver_logging="true" --isolation="posix/cpu,posix/mem"
--launcher_dir="/mesos/mesos-1.1.0/_build/src" --logbufsecs="0" --logging_level="INFO" --oversubscribed_resources_interval="15secs"
--perf_duration="10secs" --perf_interval="1mins" --qos_correction_interval_min="0ns" --quiet="false"
--recover="reconnect" --recovery_timeout="15mins" --registration_backoff_factor="10ms" --resources="cpus:2;gpus:0;mem:1024;disk:1024;ports:[31000-32000]"
--revocable_cpu_low_priority="true" --sandbox_directory="/mnt/mesos/sandbox" --strict="true"
--switch_user="true" --systemd_enable_support="true" --systemd_runtime_directory="/run/systemd/system"
--version="false" --work_dir="/tmp/Endpoint_SlaveEndpointTest_UnauthorizedRequest_2_Sptvs8"
I0708 01:56:12.121973 29168 credentials.hpp:86] Loading credential for authentication from
'/tmp/Endpoint_SlaveEndpointTest_UnauthorizedRequest_2_Sptvs8/credential'
I0708 01:56:12.122184 29168 slave.cpp:343] Agent using credential for: test-principal
I0708 01:56:12.122220 29168 credentials.hpp:37] Loading credentials for authentication from
'/tmp/Endpoint_SlaveEndpointTest_UnauthorizedRequest_2_Sptvs8/http_credentials'
I0708 01:56:12.122524 29168 slave.cpp:395] Using default 'basic' HTTP authenticator
I0708 01:56:12.123080 29168 resources.cpp:572] Parsing resources as JSON failed: cpus:2;gpus:0;mem:1024;disk:1024;ports:[31000-32000]
Trying semicolon-delimited string format instead
I0708 01:56:12.123481 29168 resources.cpp:572] Parsing resources as JSON failed: cpus:2;gpus:0;mem:1024;disk:1024;ports:[31000-32000]
Trying semicolon-delimited string format instead
I0708 01:56:12.123816 29168 slave.cpp:594] Agent resources: cpus(*):2; mem(*):1024; disk(*):1024;
ports(*):[31000-32000]
I0708 01:56:12.123872 29168 slave.cpp:602] Agent attributes: [  ]
I0708 01:56:12.123883 29168 slave.cpp:607] Agent hostname: 2c6cdcb4ddc5
I0708 01:56:12.125563 29172 state.cpp:57] Recovering state from '/tmp/Endpoint_SlaveEndpointTest_UnauthorizedRequest_2_Sptvs8/meta'
I0708 01:56:12.125627 29168 process.cpp:3322] Handling HTTP event for process 'slave(552)'
with path: '/slave(552)/containers'
I0708 01:56:12.126111 29171 status_update_manager.cpp:200] Recovering status update manager
I0708 01:56:12.126305 29176 containerizer.cpp:522] Recovering containerizer
I0708 01:56:12.126885 29167 http.cpp:829] Authorizing principal 'test-principal' to GET the
'/containers' endpoint
I0708 01:56:12.127754 29177 provisioner.cpp:253] Provisioner recovery complete
I0708 01:56:12.128222 29174 slave.cpp:4856] Finished recovery
I0708 01:56:12.128860 29174 slave.cpp:5028] Querying resource estimator for oversubscribable
resources
I0708 01:56:12.129389 29173 slave.cpp:841] Agent terminating
[       OK ] Endpoint/SlaveEndpointTest.UnauthorizedRequest/2 (25 ms)
[ RUN      ] Endpoint/SlaveEndpointTest.NoAuthorizer/0
I0708 01:56:12.143409 29145 containerizer.cpp:196] Using isolation: posix/cpu,posix/mem,filesystem/posix,network/cni
W0708 01:56:12.144047 29145 backend.cpp:75] Failed to create 'aufs' backend: AufsBackend requires
root privileges, but is running as user mesos
W0708 01:56:12.144203 29145 backend.cpp:75] Failed to create 'bind' backend: BindBackend requires
root privileges
I0708 01:56:12.145896 29145 cluster.cpp:432] Creating default 'local' authorizer
I0708 01:56:12.147847 29168 slave.cpp:205] Agent started on 553)@172.17.0.3:53281
I0708 01:56:12.147866 29168 slave.cpp:206] Flags at startup: --acls="" --appc_simple_discovery_uri_prefix="http://"
--appc_store_dir="/tmp/mesos/store/appc" --authenticate_http="true" --authenticatee="crammd5"
--authentication_backoff_factor="1secs" --authorizer="local" --cgroups_cpu_enable_pids_and_tids_count="false"
--cgroups_enable_cfs="false" --cgroups_hierarchy="/sys/fs/cgroup" --cgroups_limit_swap="false"
--cgroups_root="mesos" --container_disk_watch_interval="15secs" --containerizers="mesos" --credential="/tmp/Endpoint_SlaveEndpointTest_NoAuthorizer_0_HWmCVm/credential"
--default_role="*" --disk_watch_interval="1mins" --docker="docker" --docker_kill_orphans="true"
--docker_registry="https://registry-1.docker.io" --docker_remove_delay="6hrs" --docker_socket="/var/run/docker.sock"
--docker_stop_timeout="0ns" --docker_store_dir="/tmp/mesos/store/docker" --docker_volume_checkpoint_dir="/var/run/mesos/isolators/docker/volume"
--enforce_container_disk_quota="false" --executor_registration_timeout="1mins" --executor_shutdown_grace_period="5secs"
--fetcher_cache_dir="/tmp/Endpoint_SlaveEndpointTest_NoAuthorizer_0_HWmCVm/fetch" --fetcher_cache_size="2GB"
--frameworks_home="" --gc_delay="1weeks" --gc_disk_headroom="0.1" --hadoop_home="" --help="false"
--hostname_lookup="true" --http_authenticators="basic" --http_command_executor="false" --http_credentials="/tmp/Endpoint_SlaveEndpointTest_NoAuthorizer_0_HWmCVm/http_credentials"
--image_provisioner_backend="copy" --initialize_driver_logging="true" --isolation="posix/cpu,posix/mem"
--launcher_dir="/mesos/mesos-1.1.0/_build/src" --logbufsecs="0" --logging_level="INFO" --oversubscribed_resources_interval="15secs"
--perf_duration="10secs" --perf_interval="1mins" --qos_correction_interval_min="0ns" --quiet="false"
--recover="reconnect" --recovery_timeout="15mins" --registration_backoff_factor="10ms" --resources="cpus:2;gpus:0;mem:1024;disk:1024;ports:[31000-32000]"
--revocable_cpu_low_priority="true" --sandbox_directory="/mnt/mesos/sandbox" --strict="true"
--switch_user="true" --systemd_enable_support="true" --systemd_runtime_directory="/run/systemd/system"
--version="false" --work_dir="/tmp/Endpoint_SlaveEndpointTest_NoAuthorizer_0_HWmCVm"
I0708 01:56:12.148267 29168 credentials.hpp:86] Loading credential for authentication from
'/tmp/Endpoint_SlaveEndpointTest_NoAuthorizer_0_HWmCVm/credential'
I0708 01:56:12.148385 29168 slave.cpp:343] Agent using credential for: test-principal
I0708 01:56:12.148417 29168 credentials.hpp:37] Loading credentials for authentication from
'/tmp/Endpoint_SlaveEndpointTest_NoAuthorizer_0_HWmCVm/http_credentials'
I0708 01:56:12.148612 29168 slave.cpp:395] Using default 'basic' HTTP authenticator
I0708 01:56:12.149029 29168 resources.cpp:572] Parsing resources as JSON failed: cpus:2;gpus:0;mem:1024;disk:1024;ports:[31000-32000]
Trying semicolon-delimited string format instead
I0708 01:56:12.149395 29168 resources.cpp:572] Parsing resources as JSON failed: cpus:2;gpus:0;mem:1024;disk:1024;ports:[31000-32000]
Trying semicolon-delimited string format instead
I0708 01:56:12.149778 29168 slave.cpp:594] Agent resources: cpus(*):2; mem(*):1024; disk(*):1024;
ports(*):[31000-32000]
I0708 01:56:12.149838 29168 slave.cpp:602] Agent attributes: [  ]
I0708 01:56:12.149848 29168 slave.cpp:607] Agent hostname: 2c6cdcb4ddc5
I0708 01:56:12.150910 29179 state.cpp:57] Recovering state from '/tmp/Endpoint_SlaveEndpointTest_NoAuthorizer_0_HWmCVm/meta'
I0708 01:56:12.150976 29168 process.cpp:3322] Handling HTTP event for process 'slave(553)'
with path: '/slave(553)/monitor/statistics'
I0708 01:56:12.151327 29166 status_update_manager.cpp:200] Recovering status update manager
I0708 01:56:12.151460 29165 containerizer.cpp:522] Recovering containerizer
I0708 01:56:12.151824 29177 http.cpp:829] Authorizing principal 'test-principal' to GET the
'/monitor/statistics' endpoint
I0708 01:56:12.152627 29172 provisioner.cpp:253] Provisioner recovery complete
I0708 01:56:12.153302 29179 slave.cpp:4856] Finished recovery
I0708 01:56:12.153792 29179 slave.cpp:5028] Querying resource estimator for oversubscribable
resources
I0708 01:56:12.154038 29178 slave.cpp:5042] Received oversubscribable resources  from the
resource estimator
I0708 01:56:12.154834 29175 slave.cpp:841] Agent terminating
[       OK ] Endpoint/SlaveEndpointTest.NoAuthorizer/0 (19 ms)
[ RUN      ] Endpoint/SlaveEndpointTest.NoAuthorizer/1
I0708 01:56:12.162734 29145 containerizer.cpp:196] Using isolation: posix/cpu,posix/mem,filesystem/posix,network/cni
W0708 01:56:12.163355 29145 backend.cpp:75] Failed to create 'aufs' backend: AufsBackend requires
root privileges, but is running as user mesos
W0708 01:56:12.163480 29145 backend.cpp:75] Failed to create 'bind' backend: BindBackend requires
root privileges
I0708 01:56:12.164702 29145 cluster.cpp:432] Creating default 'local' authorizer
I0708 01:56:12.166605 29165 slave.cpp:205] Agent started on 554)@172.17.0.3:53281
I0708 01:56:12.166631 29165 slave.cpp:206] Flags at startup: --acls="" --appc_simple_discovery_uri_prefix="http://"
--appc_store_dir="/tmp/mesos/store/appc" --authenticate_http="true" --authenticatee="crammd5"
--authentication_backoff_factor="1secs" --authorizer="local" --cgroups_cpu_enable_pids_and_tids_count="false"
--cgroups_enable_cfs="false" --cgroups_hierarchy="/sys/fs/cgroup" --cgroups_limit_swap="false"
--cgroups_root="mesos" --container_disk_watch_interval="15secs" --containerizers="mesos" --credential="/tmp/Endpoint_SlaveEndpointTest_NoAuthorizer_1_8dA3yB/credential"
--default_role="*" --disk_watch_interval="1mins" --docker="docker" --docker_kill_orphans="true"
--docker_registry="https://registry-1.docker.io" --docker_remove_delay="6hrs" --docker_socket="/var/run/docker.sock"
--docker_stop_timeout="0ns" --docker_store_dir="/tmp/mesos/store/docker" --docker_volume_checkpoint_dir="/var/run/mesos/isolators/docker/volume"
--enforce_container_disk_quota="false" --executor_registration_timeout="1mins" --executor_shutdown_grace_period="5secs"
--fetcher_cache_dir="/tmp/Endpoint_SlaveEndpointTest_NoAuthorizer_1_8dA3yB/fetch" --fetcher_cache_size="2GB"
--frameworks_home="" --gc_delay="1weeks" --gc_disk_headroom="0.1" --hadoop_home="" --help="false"
--hostname_lookup="true" --http_authenticators="basic" --http_command_executor="false" --http_credentials="/tmp/Endpoint_SlaveEndpointTest_NoAuthorizer_1_8dA3yB/http_credentials"
--image_provisioner_backend="copy" --initialize_driver_logging="true" --isolation="posix/cpu,posix/mem"
--launcher_dir="/mesos/mesos-1.1.0/_build/src" --logbufsecs="0" --logging_level="INFO" --oversubscribed_resources_interval="15secs"
--perf_duration="10secs" --perf_interval="1mins" --qos_correction_interval_min="0ns" --quiet="false"
--recover="reconnect" --recovery_timeout="15mins" --registration_backoff_factor="10ms" --resources="cpus:2;gpus:0;mem:1024;disk:1024;ports:[31000-32000]"
--revocable_cpu_low_priority="true" --sandbox_directory="/mnt/mesos/sandbox" --strict="true"
--switch_user="true" --systemd_enable_support="true" --systemd_runtime_directory="/run/systemd/system"
--version="false" --work_dir="/tmp/Endpoint_SlaveEndpointTest_NoAuthorizer_1_8dA3yB"
I0708 01:56:12.167110 29165 credentials.hpp:86] Loading credential for authentication from
'/tmp/Endpoint_SlaveEndpointTest_NoAuthorizer_1_8dA3yB/credential'
I0708 01:56:12.167240 29165 slave.cpp:343] Agent using credential for: test-principal
I0708 01:56:12.167351 29165 credentials.hpp:37] Loading credentials for authentication from
'/tmp/Endpoint_SlaveEndpointTest_NoAuthorizer_1_8dA3yB/http_credentials'
I0708 01:56:12.167647 29165 slave.cpp:395] Using default 'basic' HTTP authenticator
I0708 01:56:12.168268 29165 resources.cpp:572] Parsing resources as JSON failed: cpus:2;gpus:0;mem:1024;disk:1024;ports:[31000-32000]
Trying semicolon-delimited string format instead
I0708 01:56:12.168647 29165 resources.cpp:572] Parsing resources as JSON failed: cpus:2;gpus:0;mem:1024;disk:1024;ports:[31000-32000]
Trying semicolon-delimited string format instead
I0708 01:56:12.169205 29165 slave.cpp:594] Agent resources: cpus(*):2; mem(*):1024; disk(*):1024;
ports(*):[31000-32000]
I0708 01:56:12.169286 29165 slave.cpp:602] Agent attributes: [  ]
I0708 01:56:12.169308 29165 slave.cpp:607] Agent hostname: 2c6cdcb4ddc5
I0708 01:56:12.170964 29169 state.cpp:57] Recovering state from '/tmp/Endpoint_SlaveEndpointTest_NoAuthorizer_1_8dA3yB/meta'
I0708 01:56:12.171068 29165 process.cpp:3322] Handling HTTP event for process 'slave(554)'
with path: '/slave(554)/monitor/statistics.json'
I0708 01:56:12.171706 29167 status_update_manager.cpp:200] Recovering status update manager
I0708 01:56:12.171993 29172 containerizer.cpp:522] Recovering containerizer
I0708 01:56:12.172372 29177 http.cpp:829] Authorizing principal 'test-principal' to GET the
'/monitor/statistics.json' endpoint
I0708 01:56:12.173640 29168 provisioner.cpp:253] Provisioner recovery complete
I0708 01:56:12.174232 29164 slave.cpp:4856] Finished recovery
I0708 01:56:12.174832 29164 slave.cpp:5028] Querying resource estimator for oversubscribable
resources
I0708 01:56:12.175048 29177 slave.cpp:5042] Received oversubscribable resources  from the
resource estimator
I0708 01:56:12.176210 29167 slave.cpp:841] Agent terminating
[       OK ] Endpoint/SlaveEndpointTest.NoAuthorizer/1 (23 ms)
[ RUN      ] Endpoint/SlaveEndpointTest.NoAuthorizer/2
I0708 01:56:12.187641 29145 containerizer.cpp:196] Using isolation: posix/cpu,posix/mem,filesystem/posix,network/cni
W0708 01:56:12.188493 29145 backend.cpp:75] Failed to create 'aufs' backend: AufsBackend requires
root privileges, but is running as user mesos
W0708 01:56:12.188645 29145 backend.cpp:75] Failed to create 'bind' backend: BindBackend requires
root privileges
I0708 01:56:12.190172 29145 cluster.cpp:432] Creating default 'local' authorizer
I0708 01:56:12.192095 29172 slave.cpp:205] Agent started on 555)@172.17.0.3:53281
I0708 01:56:12.192121 29172 slave.cpp:206] Flags at startup: --acls="" --appc_simple_discovery_uri_prefix="http://"
--appc_store_dir="/tmp/mesos/store/appc" --authenticate_http="true" --authenticatee="crammd5"
--authentication_backoff_factor="1secs" --authorizer="local" --cgroups_cpu_enable_pids_and_tids_count="false"
--cgroups_enable_cfs="false" --cgroups_hierarchy="/sys/fs/cgroup" --cgroups_limit_swap="false"
--cgroups_root="mesos" --container_disk_watch_interval="15secs" --containerizers="mesos" --credential="/tmp/Endpoint_SlaveEndpointTest_NoAuthorizer_2_tVcwnQ/credential"
--default_role="*" --disk_watch_interval="1mins" --docker="docker" --docker_kill_orphans="true"
--docker_registry="https://registry-1.docker.io" --docker_remove_delay="6hrs" --docker_socket="/var/run/docker.sock"
--docker_stop_timeout="0ns" --docker_store_dir="/tmp/mesos/store/docker" --docker_volume_checkpoint_dir="/var/run/mesos/isolators/docker/volume"
--enforce_container_disk_quota="false" --executor_registration_timeout="1mins" --executor_shutdown_grace_period="5secs"
--fetcher_cache_dir="/tmp/Endpoint_SlaveEndpointTest_NoAuthorizer_2_tVcwnQ/fetch" --fetcher_cache_size="2GB"
--frameworks_home="" --gc_delay="1weeks" --gc_disk_headroom="0.1" --hadoop_home="" --help="false"
--hostname_lookup="true" --http_authenticators="basic" --http_command_executor="false" --http_credentials="/tmp/Endpoint_SlaveEndpointTest_NoAuthorizer_2_tVcwnQ/http_credentials"
--image_provisioner_backend="copy" --initialize_driver_logging="true" --isolation="posix/cpu,posix/mem"
--launcher_dir="/mesos/mesos-1.1.0/_build/src" --logbufsecs="0" --logging_level="INFO" --oversubscribed_resources_interval="15secs"
--perf_duration="10secs" --perf_interval="1mins" --qos_correction_interval_min="0ns" --quiet="false"
--recover="reconnect" --recovery_timeout="15mins" --registration_backoff_factor="10ms" --resources="cpus:2;gpus:0;mem:1024;disk:1024;ports:[31000-32000]"
--revocable_cpu_low_priority="true" --sandbox_directory="/mnt/mesos/sandbox" --strict="true"
--switch_user="true" --systemd_enable_support="true" --systemd_runtime_directory="/run/systemd/system"
--version="false" --work_dir="/tmp/Endpoint_SlaveEndpointTest_NoAuthorizer_2_tVcwnQ"
I0708 01:56:12.192744 29172 credentials.hpp:86] Loading credential for authentication from
'/tmp/Endpoint_SlaveEndpointTest_NoAuthorizer_2_tVcwnQ/credential'
I0708 01:56:12.192916 29172 slave.cpp:343] Agent using credential for: test-principal
I0708 01:56:12.192980 29172 credentials.hpp:37] Loading credentials for authentication from
'/tmp/Endpoint_SlaveEndpointTest_NoAuthorizer_2_tVcwnQ/http_credentials'
I0708 01:56:12.193246 29172 slave.cpp:395] Using default 'basic' HTTP authenticator
I0708 01:56:12.193622 29172 resources.cpp:572] Parsing resources as JSON failed: cpus:2;gpus:0;mem:1024;disk:1024;ports:[31000-32000]
Trying semicolon-delimited string format instead
I0708 01:56:12.193989 29172 resources.cpp:572] Parsing resources as JSON failed: cpus:2;gpus:0;mem:1024;disk:1024;ports:[31000-32000]
Trying semicolon-delimited string format instead
I0708 01:56:12.194530 29172 slave.cpp:594] Agent resources: cpus(*):2; mem(*):1024; disk(*):1024;
ports(*):[31000-32000]
I0708 01:56:12.194605 29172 slave.cpp:602] Agent attributes: [  ]
I0708 01:56:12.194618 29172 slave.cpp:607] Agent hostname: 2c6cdcb4ddc5
I0708 01:56:12.196027 29165 state.cpp:57] Recovering state from '/tmp/Endpoint_SlaveEndpointTest_NoAuthorizer_2_tVcwnQ/meta'
I0708 01:56:12.196091 29172 process.cpp:3322] Handling HTTP event for process 'slave(555)'
with path: '/slave(555)/containers'
I0708 01:56:12.196724 29175 status_update_manager.cpp:200] Recovering status update manager
I0708 01:56:12.196902 29179 containerizer.cpp:522] Recovering containerizer
I0708 01:56:12.197273 29166 http.cpp:829] Authorizing principal 'test-principal' to GET the
'/containers' endpoint
I0708 01:56:12.198079 29178 provisioner.cpp:253] Provisioner recovery complete
I0708 01:56:12.198307 29167 slave.cpp:4856] Finished recovery
I0708 01:56:12.198849 29167 slave.cpp:5028] Querying resource estimator for oversubscribable
resources
I0708 01:56:12.199177 29166 slave.cpp:5042] Received oversubscribable resources  from the
resource estimator
I0708 01:56:12.200359 29171 slave.cpp:841] Agent terminating
[       OK ] Endpoint/SlaveEndpointTest.NoAuthorizer/2 (23 ms)
[----------] 9 tests from Endpoint/SlaveEndpointTest (272 ms total)

[----------] Global test environment tear-down
[==========] 1237 tests from 140 test cases ran. (938771 ms total)
[  PASSED  ] 1235 tests.
[  FAILED  ] 2 tests, listed below:
[  FAILED  ] ContentType/MasterAPITest.GetAgents/0, where GetParam() = application/x-protobuf
[  FAILED  ] ContentType/MasterAPITest.GetAgents/1, where GetParam() = application/json

 2 FAILED TESTS
  YOU HAVE 6 DISABLED TESTS

make[4]: *** [check-local] Error 1
make[4]: Leaving directory `/mesos/mesos-1.1.0/_build/src'
make[3]: *** [check-am] Error 2
make[3]: Leaving directory `/mesos/mesos-1.1.0/_build/src'
make[2]: *** [check] Error 2
make[2]: Leaving directory `/mesos/mesos-1.1.0/_build/src'
make[1]: *** [check-recursive] Error 1
make[1]: Leaving directory `/mesos/mesos-1.1.0/_build'
make: *** [distcheck] Error 1
+ docker rmi mesos-1467940147-32220
Untagged: mesos-1467940147-32220:latest
Deleted: 89ffe88760b791dec90463d2061affa812bd1a7fabbb0f62e2059883fece2f9a
Deleted: ae0f242d47b9ff332f31590dc7107935603af34cdb599916ba816efefb237cfc
Deleted: 6aeb90cbd5d5929ee4124af09ea85794d956dfcc9dadff89c2f900b89c9b4722
Deleted: ed7fa9ab1670ccbccc32c28c4c45b36599ec47bf19bb03c581d4369072ca8716
Deleted: 47436a46fe32cf6625c14303f3b0eed85d0c446e9c0d5c22176b79d9de305fc1
Deleted: 4744de584a5721a28bf93508542de095192188758bd0746dda33e1c0153e59ce
Deleted: 62efa69ea9d2a75530ef8a7e0ce0534eb895b49a9c0bd2780625299fbddb3e92
Deleted: a25d004e56fbaa94ada210bc683701dd39b638e0ed3fddfc34c3686cedef0f0a
Deleted: 32e1b0f196bd1479b33426676c5ef2164c65e51999496eefebbc5cb3facf73ab
Deleted: df0448ee2bc6a29c4abfa1d1a33de12cc227719f24868f100b365d4f5161d2cd
Deleted: 36401d6fd9fbcada8acbf1ed2b1ebbf098dfc6a331a6bf9ffee3245fd1bd5a12
Deleted: b0516485ae9121c84909da57f8a5c35848c6649c017702518bda9fdacd3dc98c
Deleted: d2d9b848f49d36da8f2c18562fb7f42bcd1a1fe04e4856572edb2b63a58a2f45
Deleted: 42c0212083587e12f3d2903da94c0e1706c3c138435424306abd9bb90b245686
Deleted: 619ec51f79a4a6bd9ee36cd9c83a074064723b1e6a20c6eb72b2a12498eda7e1
Deleted: 35a99e8757e00954021f892c326c356d7077c636b063a5f6aae944b1a3472f54
Build step 'Execute shell' marked build as failure

Mime
View raw message