mesos-builds mailing list archives

Site index · List index
Message view « Date » · « Thread »
Top « Date » · « Thread »
From Apache Jenkins Server <jenk...@builds.apache.org>
Subject Build failed in Jenkins: Mesos » autotools,gcc,--verbose --enable-libevent --enable-ssl,GLOG_v=1 MESOS_VERBOSE=1,ubuntu:14.04,(docker||Hadoop)&&(!ubuntu-us1)&&(!ubuntu-6) #2534
Date Wed, 20 Jul 2016 04:17:54 GMT
See <https://builds.apache.org/job/Mesos/BUILDTOOL=autotools,COMPILER=gcc,CONFIGURATION=--verbose%20--enable-libevent%20--enable-ssl,ENVIRONMENT=GLOG_v=1%20MESOS_VERBOSE=1,OS=ubuntu%3A14.04,label_exp=(docker%7C%7CHadoop)&&(!ubuntu-us1)&&(!ubuntu-6)/2534/changes>

Changes:

[alexr] Cleaned the arguments passed to health checker in docker executor.

[bmahler] Removed the `os::sleep` from `Clock::settle`.

[alexr] Updated the comment for `TaskHealthStatus`.

[vinodkone] Removed unnecessary await from test.

[vinodkone] Speed up reservation test by lowering allocation interval.

[vinodkone] Improved the speed of 'MasterAPITest.UnreserveResources'.

------------------------------------------
[...truncated 207955 lines...]
I0720 04:17:42.908766 29724 slave.cpp:205] Agent started on 561)@172.17.0.8:58903
I0720 04:17:42.908808 29724 slave.cpp:206] Flags at startup: --acls="" --appc_simple_discovery_uri_prefix="http://"
--appc_store_dir="/tmp/mesos/store/appc" --authenticate_http="true" --authenticatee="crammd5"
--authentication_backoff_factor="1secs" --authorizer="local" --cgroups_cpu_enable_pids_and_tids_count="false"
--cgroups_enable_cfs="false" --cgroups_hierarchy="/sys/fs/cgroup" --cgroups_limit_swap="false"
--cgroups_root="mesos" --container_disk_watch_interval="15secs" --containerizers="mesos" --credential="/tmp/Endpoint_SlaveEndpointTest_AuthorizedRequest_0_OAcfdj/credential"
--default_role="*" --disk_watch_interval="1mins" --docker="docker" --docker_kill_orphans="true"
--docker_registry="https://registry-1.docker.io" --docker_remove_delay="6hrs" --docker_socket="/var/run/docker.sock"
--docker_stop_timeout="0ns" --docker_store_dir="/tmp/mesos/store/docker" --docker_volume_checkpoint_dir="/var/run/mesos/isolators/docker/volume"
--enforce_container_disk_quota="false" --executor_registration_timeout="1mins" --executor_shutdown_grace_period="5secs"
--fetcher_cache_dir="/tmp/Endpoint_SlaveEndpointTest_AuthorizedRequest_0_OAcfdj/fetch" --fetcher_cache_size="2GB"
--frameworks_home="" --gc_delay="1weeks" --gc_disk_headroom="0.1" --hadoop_home="" --help="true"
--hostname_lookup="true" --http_authenticators="basic" --http_command_executor="false" --http_credentials="/tmp/Endpoint_SlaveEndpointTest_AuthorizedRequest_0_OAcfdj/http_credentials"
--image_provisioner_backend="copy" --initialize_driver_logging="true" --isolation="posix/cpu,posix/mem"
--launcher_dir="/mesos/mesos-1.1.0/_build/src" --logbufsecs="0" --logging_level="INFO" --oversubscribed_resources_interval="15secs"
--perf_duration="10secs" --perf_interval="1mins" --qos_correction_interval_min="0ns" --quiet="false"
--recover="reconnect" --recovery_timeout="15mins" --registration_backoff_factor="10ms" --resources="cpus:2;gpus:0;mem:1024;disk:1024;ports:[31000-32000]"
--revocable_cpu_low_priority="true" --sandbox_directory="/mnt/mesos/sandbox" --strict="true"
--switch_user="true" --systemd_enable_support="true" --systemd_runtime_directory="/run/systemd/system"
--version="false" --work_dir="/tmp/Endpoint_SlaveEndpointTest_AuthorizedRequest_0_OAcfdj"
I0720 04:17:42.909559 29724 credentials.hpp:86] Loading credential for authentication from
'/tmp/Endpoint_SlaveEndpointTest_AuthorizedRequest_0_OAcfdj/credential'
I0720 04:17:42.918517 29724 slave.cpp:343] Agent using credential for: test-principal
I0720 04:17:42.918643 29724 credentials.hpp:37] Loading credentials for authentication from
'/tmp/Endpoint_SlaveEndpointTest_AuthorizedRequest_0_OAcfdj/http_credentials'
I0720 04:17:42.919103 29724 slave.cpp:395] Using default 'basic' HTTP authenticator
I0720 04:17:42.920460 29724 slave.cpp:594] Agent resources: cpus(*):2; mem(*):1024; disk(*):1024;
ports(*):[31000-32000]
I0720 04:17:42.920604 29724 slave.cpp:602] Agent attributes: [  ]
I0720 04:17:42.920701 29724 slave.cpp:607] Agent hostname: 3409a664dc74
I0720 04:17:42.922798 29722 state.cpp:57] Recovering state from '/tmp/Endpoint_SlaveEndpointTest_AuthorizedRequest_0_OAcfdj/meta'
I0720 04:17:42.923125 29724 process.cpp:3340] Handling HTTP event for process 'slave(561)'
with path: '/slave(561)/monitor/statistics'
I0720 04:17:42.924129 29729 status_update_manager.cpp:200] Recovering status update manager
I0720 04:17:42.924883 29723 containerizer.cpp:522] Recovering containerizer
I0720 04:17:42.927696 29720 provisioner.cpp:253] Provisioner recovery complete
I0720 04:17:42.928165 29724 http.cpp:829] Authorizing principal 'test-principal' to GET the
'/monitor/statistics' endpoint
I0720 04:17:42.928938 29724 slave.cpp:4946] Finished recovery
I0720 04:17:42.929668 29724 slave.cpp:5118] Querying resource estimator for oversubscribable
resources
I0720 04:17:42.930771 29724 slave.cpp:5132] Received oversubscribable resources  from the
resource estimator
I0720 04:17:42.944994 29726 slave.cpp:841] Agent terminating
[       OK ] Endpoint/SlaveEndpointTest.AuthorizedRequest/0 (66 ms)
[ RUN      ] Endpoint/SlaveEndpointTest.AuthorizedRequest/1
I0720 04:17:42.972396 29697 containerizer.cpp:196] Using isolation: posix/cpu,posix/mem,filesystem/posix,network/cni
W0720 04:17:42.973449 29697 backend.cpp:75] Failed to create 'aufs' backend: AufsBackend requires
root privileges, but is running as user mesos
W0720 04:17:42.973707 29697 backend.cpp:75] Failed to create 'bind' backend: BindBackend requires
root privileges
I0720 04:17:42.985188 29723 slave.cpp:205] Agent started on 562)@172.17.0.8:58903
I0720 04:17:42.985229 29723 slave.cpp:206] Flags at startup: --acls="" --appc_simple_discovery_uri_prefix="http://"
--appc_store_dir="/tmp/mesos/store/appc" --authenticate_http="true" --authenticatee="crammd5"
--authentication_backoff_factor="1secs" --authorizer="local" --cgroups_cpu_enable_pids_and_tids_count="false"
--cgroups_enable_cfs="false" --cgroups_hierarchy="/sys/fs/cgroup" --cgroups_limit_swap="false"
--cgroups_root="mesos" --container_disk_watch_interval="15secs" --containerizers="mesos" --credential="/tmp/Endpoint_SlaveEndpointTest_AuthorizedRequest_1_v0S06k/credential"
--default_role="*" --disk_watch_interval="1mins" --docker="docker" --docker_kill_orphans="true"
--docker_registry="https://registry-1.docker.io" --docker_remove_delay="6hrs" --docker_socket="/var/run/docker.sock"
--docker_stop_timeout="0ns" --docker_store_dir="/tmp/mesos/store/docker" --docker_volume_checkpoint_dir="/var/run/mesos/isolators/docker/volume"
--enforce_container_disk_quota="false" --executor_registration_timeout="1mins" --executor_shutdown_grace_period="5secs"
--fetcher_cache_dir="/tmp/Endpoint_SlaveEndpointTest_AuthorizedRequest_1_v0S06k/fetch" --fetcher_cache_size="2GB"
--frameworks_home="" --gc_delay="1weeks" --gc_disk_headroom="0.1" --hadoop_home="" --help="false"
--hostname_lookup="true" --http_authenticators="basic" --http_command_executor="false" --http_credentials="/tmp/Endpoint_SlaveEndpointTest_AuthorizedRequest_1_v0S06k/http_credentials"
--image_provisioner_backend="copy" --initialize_driver_logging="true" --isolation="posix/cpu,posix/mem"
--launcher_dir="/mesos/mesos-1.1.0/_build/src" --logbufsecs="0" --logging_level="INFO" --oversubscribed_resources_interval="15secs"
--perf_duration="10secs" --perf_interval="1mins" --qos_correction_interval_min="0ns" --quiet="false"
--recover="reconnect" --recovery_timeout="15mins" --registration_backoff_factor="10ms" --resources="cpus:2;gpus:0;mem:1024;disk:1024;ports:[31000-32000]"
--revocable_cpu_low_priority="true" --sandbox_directory="/mnt/mesos/sandbox" --strict="true"
--switch_user="true" --systemd_enable_support="true" --systemd_runtime_directory="/run/systemd/system"
--version="false" --work_dir="/tmp/Endpoint_SlaveEndpointTest_AuthorizedRequest_1_v0S06k"
I0720 04:17:42.985972 29723 credentials.hpp:86] Loading credential for authentication from
'/tmp/Endpoint_SlaveEndpointTest_AuthorizedRequest_1_v0S06k/credential'
I0720 04:17:42.986209 29723 slave.cpp:343] Agent using credential for: test-principal
I0720 04:17:42.986248 29723 credentials.hpp:37] Loading credentials for authentication from
'/tmp/Endpoint_SlaveEndpointTest_AuthorizedRequest_1_v0S06k/http_credentials'
I0720 04:17:42.986567 29723 slave.cpp:395] Using default 'basic' HTTP authenticator
I0720 04:17:42.988054 29723 slave.cpp:594] Agent resources: cpus(*):2; mem(*):1024; disk(*):1024;
ports(*):[31000-32000]
I0720 04:17:42.988133 29723 slave.cpp:602] Agent attributes: [  ]
I0720 04:17:42.988153 29723 slave.cpp:607] Agent hostname: 3409a664dc74
I0720 04:17:42.990555 29719 state.cpp:57] Recovering state from '/tmp/Endpoint_SlaveEndpointTest_AuthorizedRequest_1_v0S06k/meta'
I0720 04:17:42.990947 29719 status_update_manager.cpp:200] Recovering status update manager
I0720 04:17:42.991107 29719 containerizer.cpp:522] Recovering containerizer
I0720 04:17:42.992987 29719 provisioner.cpp:253] Provisioner recovery complete
I0720 04:17:42.993489 29719 slave.cpp:4946] Finished recovery
I0720 04:17:43.003813 29719 slave.cpp:5118] Querying resource estimator for oversubscribable
resources
I0720 04:17:43.003984 29719 process.cpp:3340] Handling HTTP event for process 'slave(562)'
with path: '/slave(562)/monitor/statistics.json'
I0720 04:17:43.004940 29717 slave.cpp:5132] Received oversubscribable resources  from the
resource estimator
I0720 04:17:43.005807 29717 http.cpp:829] Authorizing principal 'test-principal' to GET the
'/monitor/statistics.json' endpoint
I0720 04:17:43.042886 29717 slave.cpp:841] Agent terminating
[       OK ] Endpoint/SlaveEndpointTest.AuthorizedRequest/1 (139 ms)
[ RUN      ] Endpoint/SlaveEndpointTest.AuthorizedRequest/2
I0720 04:17:43.111665 29697 containerizer.cpp:196] Using isolation: posix/cpu,posix/mem,filesystem/posix,network/cni
W0720 04:17:43.113137 29697 backend.cpp:75] Failed to create 'aufs' backend: AufsBackend requires
root privileges, but is running as user mesos
W0720 04:17:43.113518 29697 backend.cpp:75] Failed to create 'bind' backend: BindBackend requires
root privileges
I0720 04:17:43.118227 29716 slave.cpp:205] Agent started on 563)@172.17.0.8:58903
I0720 04:17:43.118258 29716 slave.cpp:206] Flags at startup: --acls="" --appc_simple_discovery_uri_prefix="http://"
--appc_store_dir="/tmp/mesos/store/appc" --authenticate_http="true" --authenticatee="crammd5"
--authentication_backoff_factor="1secs" --authorizer="local" --cgroups_cpu_enable_pids_and_tids_count="false"
--cgroups_enable_cfs="false" --cgroups_hierarchy="/sys/fs/cgroup" --cgroups_limit_swap="false"
--cgroups_root="mesos" --container_disk_watch_interval="15secs" --containerizers="mesos" --credential="/tmp/Endpoint_SlaveEndpointTest_AuthorizedRequest_2_w4sKUn/credential"
--default_role="*" --disk_watch_interval="1mins" --docker="docker" --docker_kill_orphans="true"
--docker_registry="https://registry-1.docker.io" --docker_remove_delay="6hrs" --docker_socket="/var/run/docker.sock"
--docker_stop_timeout="0ns" --docker_store_dir="/tmp/mesos/store/docker" --docker_volume_checkpoint_dir="/var/run/mesos/isolators/docker/volume"
--enforce_container_disk_quota="false" --executor_registration_timeout="1mins" --executor_shutdown_grace_period="5secs"
--fetcher_cache_dir="/tmp/Endpoint_SlaveEndpointTest_AuthorizedRequest_2_w4sKUn/fetch" --fetcher_cache_size="2GB"
--frameworks_home="" --gc_delay="1weeks" --gc_disk_headroom="0.1" --hadoop_home="" --help="true"
--hostname_lookup="true" --http_authenticators="basic" --http_command_executor="false" --http_credentials="/tmp/Endpoint_SlaveEndpointTest_AuthorizedRequest_2_w4sKUn/http_credentials"
--image_provisioner_backend="copy" --initialize_driver_logging="true" --isolation="posix/cpu,posix/mem"
--launcher_dir="/mesos/mesos-1.1.0/_build/src" --logbufsecs="0" --logging_level="INFO" --oversubscribed_resources_interval="15secs"
--perf_duration="10secs" --perf_interval="1mins" --qos_correction_interval_min="0ns" --quiet="false"
--recover="reconnect" --recovery_timeout="15mins" --registration_backoff_factor="10ms" --resources="cpus:2;gpus:0;mem:1024;disk:1024;ports:[31000-32000]"
--revocable_cpu_low_priority="true" --sandbox_directory="/mnt/mesos/sandbox" --strict="true"
--switch_user="true" --systemd_enable_support="true" --systemd_runtime_directory="/run/systemd/system"
--version="false" --work_dir="/tmp/Endpoint_SlaveEndpointTest_AuthorizedRequest_2_w4sKUn"
I0720 04:17:43.118865 29716 credentials.hpp:86] Loading credential for authentication from
'/tmp/Endpoint_SlaveEndpointTest_AuthorizedRequest_2_w4sKUn/credential'
I0720 04:17:43.119096 29716 slave.cpp:343] Agent using credential for: test-principal
I0720 04:17:43.119132 29716 credentials.hpp:37] Loading credentials for authentication from
'/tmp/Endpoint_SlaveEndpointTest_AuthorizedRequest_2_w4sKUn/http_credentials'
I0720 04:17:43.119443 29716 slave.cpp:395] Using default 'basic' HTTP authenticator
I0720 04:17:43.122532 29716 slave.cpp:594] Agent resources: cpus(*):2; mem(*):1024; disk(*):1024;
ports(*):[31000-32000]
I0720 04:17:43.122689 29716 slave.cpp:602] Agent attributes: [  ]
I0720 04:17:43.122797 29716 slave.cpp:607] Agent hostname: 3409a664dc74
I0720 04:17:43.125120 29724 state.cpp:57] Recovering state from '/tmp/Endpoint_SlaveEndpointTest_AuthorizedRequest_2_w4sKUn/meta'
I0720 04:17:43.125566 29716 process.cpp:3340] Handling HTTP event for process 'slave(563)'
with path: '/slave(563)/containers'
I0720 04:17:43.126799 29727 status_update_manager.cpp:200] Recovering status update manager
I0720 04:17:43.127029 29724 containerizer.cpp:522] Recovering containerizer
I0720 04:17:43.127395 29730 http.cpp:829] Authorizing principal 'test-principal' to GET the
'/containers' endpoint
I0720 04:17:43.132021 29720 provisioner.cpp:253] Provisioner recovery complete
I0720 04:17:43.132328 29722 slave.cpp:841] Agent terminating
[       OK ] Endpoint/SlaveEndpointTest.AuthorizedRequest/2 (66 ms)
[ RUN      ] Endpoint/SlaveEndpointTest.UnauthorizedRequest/0
I0720 04:17:43.178215 29697 containerizer.cpp:196] Using isolation: posix/cpu,posix/mem,filesystem/posix,network/cni
W0720 04:17:43.179282 29697 backend.cpp:75] Failed to create 'aufs' backend: AufsBackend requires
root privileges, but is running as user mesos
W0720 04:17:43.179615 29697 backend.cpp:75] Failed to create 'bind' backend: BindBackend requires
root privileges
I0720 04:17:43.183652 29722 slave.cpp:205] Agent started on 564)@172.17.0.8:58903
I0720 04:17:43.183805 29722 slave.cpp:206] Flags at startup: --acls="" --appc_simple_discovery_uri_prefix="http://"
--appc_store_dir="/tmp/mesos/store/appc" --authenticate_http="true" --authenticatee="crammd5"
--authentication_backoff_factor="1secs" --authorizer="local" --cgroups_cpu_enable_pids_and_tids_count="false"
--cgroups_enable_cfs="false" --cgroups_hierarchy="/sys/fs/cgroup" --cgroups_limit_swap="false"
--cgroups_root="mesos" --container_disk_watch_interval="15secs" --containerizers="mesos" --credential="/tmp/Endpoint_SlaveEndpointTest_UnauthorizedRequest_0_wrKzkq/credential"
--default_role="*" --disk_watch_interval="1mins" --docker="docker" --docker_kill_orphans="true"
--docker_registry="https://registry-1.docker.io" --docker_remove_delay="6hrs" --docker_socket="/var/run/docker.sock"
--docker_stop_timeout="0ns" --docker_store_dir="/tmp/mesos/store/docker" --docker_volume_checkpoint_dir="/var/run/mesos/isolators/docker/volume"
--enforce_container_disk_quota="false" --executor_registration_timeout="1mins" --executor_shutdown_grace_period="5secs"
--fetcher_cache_dir="/tmp/Endpoint_SlaveEndpointTest_UnauthorizedRequest_0_wrKzkq/fetch" --fetcher_cache_size="2GB"
--frameworks_home="" --gc_delay="1weeks" --gc_disk_headroom="0.1" --hadoop_home="" --help="false"
--hostname_lookup="true" --http_authenticators="basic" --http_command_executor="false" --http_credentials="/tmp/Endpoint_SlaveEndpointTest_UnauthorizedRequest_0_wrKzkq/http_credentials"
--image_provisioner_backend="copy" --initialize_driver_logging="true" --isolation="posix/cpu,posix/mem"
--launcher_dir="/mesos/mesos-1.1.0/_build/src" --logbufsecs="0" --logging_level="INFO" --oversubscribed_resources_interval="15secs"
--perf_duration="10secs" --perf_interval="1mins" --qos_correction_interval_min="0ns" --quiet="false"
--recover="reconnect" --recovery_timeout="15mins" --registration_backoff_factor="10ms" --resources="cpus:2;gpus:0;mem:1024;disk:1024;ports:[31000-32000]"
--revocable_cpu_low_priority="true" --sandbox_directory="/mnt/mesos/sandbox" --strict="true"
--switch_user="true" --systemd_enable_support="true" --systemd_runtime_directory="/run/systemd/system"
--version="false" --work_dir="/tmp/Endpoint_SlaveEndpointTest_UnauthorizedRequest_0_wrKzkq"
I0720 04:17:43.184566 29722 credentials.hpp:86] Loading credential for authentication from
'/tmp/Endpoint_SlaveEndpointTest_UnauthorizedRequest_0_wrKzkq/credential'
I0720 04:17:43.184823 29722 slave.cpp:343] Agent using credential for: test-principal
I0720 04:17:43.184918 29722 credentials.hpp:37] Loading credentials for authentication from
'/tmp/Endpoint_SlaveEndpointTest_UnauthorizedRequest_0_wrKzkq/http_credentials'
I0720 04:17:43.185287 29722 slave.cpp:395] Using default 'basic' HTTP authenticator
I0720 04:17:43.186815 29722 slave.cpp:594] Agent resources: cpus(*):2; mem(*):1024; disk(*):1024;
ports(*):[31000-32000]
I0720 04:17:43.187002 29722 slave.cpp:602] Agent attributes: [  ]
I0720 04:17:43.187070 29722 slave.cpp:607] Agent hostname: 3409a664dc74
I0720 04:17:43.189299 29722 state.cpp:57] Recovering state from '/tmp/Endpoint_SlaveEndpointTest_UnauthorizedRequest_0_wrKzkq/meta'
I0720 04:17:43.189911 29722 status_update_manager.cpp:200] Recovering status update manager
I0720 04:17:43.190121 29722 containerizer.cpp:522] Recovering containerizer
I0720 04:17:43.192553 29731 provisioner.cpp:253] Provisioner recovery complete
I0720 04:17:43.193069 29731 slave.cpp:4946] Finished recovery
I0720 04:17:43.202767 29731 slave.cpp:5118] Querying resource estimator for oversubscribable
resources
I0720 04:17:43.203205 29731 process.cpp:3340] Handling HTTP event for process 'slave(564)'
with path: '/slave(564)/monitor/statistics'
I0720 04:17:43.203889 29731 slave.cpp:5132] Received oversubscribable resources  from the
resource estimator
I0720 04:17:43.205188 29731 http.cpp:829] Authorizing principal 'test-principal' to GET the
'/monitor/statistics' endpoint
I0720 04:17:43.238128 29719 slave.cpp:841] Agent terminating
[       OK ] Endpoint/SlaveEndpointTest.UnauthorizedRequest/0 (189 ms)
[ RUN      ] Endpoint/SlaveEndpointTest.UnauthorizedRequest/1
I0720 04:17:43.370782 29697 containerizer.cpp:196] Using isolation: posix/cpu,posix/mem,filesystem/posix,network/cni
W0720 04:17:43.372095 29697 backend.cpp:75] Failed to create 'aufs' backend: AufsBackend requires
root privileges, but is running as user mesos
W0720 04:17:43.372350 29697 backend.cpp:75] Failed to create 'bind' backend: BindBackend requires
root privileges
I0720 04:17:43.384464 29722 slave.cpp:205] Agent started on 565)@172.17.0.8:58903
I0720 04:17:43.384511 29722 slave.cpp:206] Flags at startup: --acls="" --appc_simple_discovery_uri_prefix="http://"
--appc_store_dir="/tmp/mesos/store/appc" --authenticate_http="true" --authenticatee="crammd5"
--authentication_backoff_factor="1secs" --authorizer="local" --cgroups_cpu_enable_pids_and_tids_count="false"
--cgroups_enable_cfs="false" --cgroups_hierarchy="/sys/fs/cgroup" --cgroups_limit_swap="false"
--cgroups_root="mesos" --container_disk_watch_interval="15secs" --containerizers="mesos" --credential="/tmp/Endpoint_SlaveEndpointTest_UnauthorizedRequest_1_Tbat1u/credential"
--default_role="*" --disk_watch_interval="1mins" --docker="docker" --docker_kill_orphans="true"
--docker_registry="https://registry-1.docker.io" --docker_remove_delay="6hrs" --docker_socket="/var/run/docker.sock"
--docker_stop_timeout="0ns" --docker_store_dir="/tmp/mesos/store/docker" --docker_volume_checkpoint_dir="/var/run/mesos/isolators/docker/volume"
--enforce_container_disk_quota="false" --executor_registration_timeout="1mins" --executor_shutdown_grace_period="5secs"
--fetcher_cache_dir="/tmp/Endpoint_SlaveEndpointTest_UnauthorizedRequest_1_Tbat1u/fetch" --fetcher_cache_size="2GB"
--frameworks_home="" --gc_delay="1weeks" --gc_disk_headroom="0.1" --hadoop_home="" --help="false"
--hostname_lookup="true" --http_authenticators="basic" --http_command_executor="false" --http_credentials="/tmp/Endpoint_SlaveEndpointTest_UnauthorizedRequest_1_Tbat1u/http_credentials"
--image_provisioner_backend="copy" --initialize_driver_logging="true" --isolation="posix/cpu,posix/mem"
--launcher_dir="/mesos/mesos-1.1.0/_build/src" --logbufsecs="0" --logging_level="INFO" --oversubscribed_resources_interval="15secs"
--perf_duration="10secs" --perf_interval="1mins" --qos_correction_interval_min="0ns" --quiet="false"
--recover="reconnect" --recovery_timeout="15mins" --registration_backoff_factor="10ms" --resources="cpus:2;gpus:0;mem:1024;disk:1024;ports:[31000-32000]"
--revocable_cpu_low_priority="true" --sandbox_directory="/mnt/mesos/sandbox" --strict="true"
--switch_user="true" --systemd_enable_support="true" --systemd_runtime_directory="/run/systemd/system"
--version="false" --work_dir="/tmp/Endpoint_SlaveEndpointTest_UnauthorizedRequest_1_Tbat1u"
I0720 04:17:43.385203 29722 credentials.hpp:86] Loading credential for authentication from
'/tmp/Endpoint_SlaveEndpointTest_UnauthorizedRequest_1_Tbat1u/credential'
I0720 04:17:43.386548 29722 slave.cpp:343] Agent using credential for: test-principal
I0720 04:17:43.386589 29722 credentials.hpp:37] Loading credentials for authentication from
'/tmp/Endpoint_SlaveEndpointTest_UnauthorizedRequest_1_Tbat1u/http_credentials'
I0720 04:17:43.386883 29722 slave.cpp:395] Using default 'basic' HTTP authenticator
I0720 04:17:43.389830 29722 slave.cpp:594] Agent resources: cpus(*):2; mem(*):1024; disk(*):1024;
ports(*):[31000-32000]
I0720 04:17:43.389922 29722 slave.cpp:602] Agent attributes: [  ]
I0720 04:17:43.389937 29722 slave.cpp:607] Agent hostname: 3409a664dc74
I0720 04:17:43.391605 29720 state.cpp:57] Recovering state from '/tmp/Endpoint_SlaveEndpointTest_UnauthorizedRequest_1_Tbat1u/meta'
I0720 04:17:43.391649 29722 process.cpp:3340] Handling HTTP event for process 'slave(565)'
with path: '/slave(565)/monitor/statistics.json'
I0720 04:17:43.392609 29722 status_update_manager.cpp:200] Recovering status update manager
I0720 04:17:43.392771 29722 containerizer.cpp:522] Recovering containerizer
I0720 04:17:43.393668 29716 http.cpp:829] Authorizing principal 'test-principal' to GET the
'/monitor/statistics.json' endpoint
I0720 04:17:43.407943 29719 provisioner.cpp:253] Provisioner recovery complete
I0720 04:17:43.408819 29722 slave.cpp:4946] Finished recovery
I0720 04:17:43.409966 29722 slave.cpp:5118] Querying resource estimator for oversubscribable
resources
I0720 04:17:43.410111 29722 slave.cpp:841] Agent terminating
[       OK ] Endpoint/SlaveEndpointTest.UnauthorizedRequest/1 (64 ms)
[ RUN      ] Endpoint/SlaveEndpointTest.UnauthorizedRequest/2
I0720 04:17:43.437695 29697 containerizer.cpp:196] Using isolation: posix/cpu,posix/mem,filesystem/posix,network/cni
W0720 04:17:43.439251 29697 backend.cpp:75] Failed to create 'aufs' backend: AufsBackend requires
root privileges, but is running as user mesos
W0720 04:17:43.440608 29697 backend.cpp:75] Failed to create 'bind' backend: BindBackend requires
root privileges
I0720 04:17:43.452486 29724 slave.cpp:205] Agent started on 566)@172.17.0.8:58903
I0720 04:17:43.452528 29724 slave.cpp:206] Flags at startup: --acls="" --appc_simple_discovery_uri_prefix="http://"
--appc_store_dir="/tmp/mesos/store/appc" --authenticate_http="true" --authenticatee="crammd5"
--authentication_backoff_factor="1secs" --authorizer="local" --cgroups_cpu_enable_pids_and_tids_count="false"
--cgroups_enable_cfs="false" --cgroups_hierarchy="/sys/fs/cgroup" --cgroups_limit_swap="false"
--cgroups_root="mesos" --container_disk_watch_interval="15secs" --containerizers="mesos" --credential="/tmp/Endpoint_SlaveEndpointTest_UnauthorizedRequest_2_6w2aBA/credential"
--default_role="*" --disk_watch_interval="1mins" --docker="docker" --docker_kill_orphans="true"
--docker_registry="https://registry-1.docker.io" --docker_remove_delay="6hrs" --docker_socket="/var/run/docker.sock"
--docker_stop_timeout="0ns" --docker_store_dir="/tmp/mesos/store/docker" --docker_volume_checkpoint_dir="/var/run/mesos/isolators/docker/volume"
--enforce_container_disk_quota="false" --executor_registration_timeout="1mins" --executor_shutdown_grace_period="5secs"
--fetcher_cache_dir="/tmp/Endpoint_SlaveEndpointTest_UnauthorizedRequest_2_6w2aBA/fetch" --fetcher_cache_size="2GB"
--frameworks_home="" --gc_delay="1weeks" --gc_disk_headroom="0.1" --hadoop_home="" --help="true"
--hostname_lookup="true" --http_authenticators="basic" --http_command_executor="false" --http_credentials="/tmp/Endpoint_SlaveEndpointTest_UnauthorizedRequest_2_6w2aBA/http_credentials"
--image_provisioner_backend="copy" --initialize_driver_logging="true" --isolation="posix/cpu,posix/mem"
--launcher_dir="/mesos/mesos-1.1.0/_build/src" --logbufsecs="0" --logging_level="INFO" --oversubscribed_resources_interval="15secs"
--perf_duration="10secs" --perf_interval="1mins" --qos_correction_interval_min="0ns" --quiet="false"
--recover="reconnect" --recovery_timeout="15mins" --registration_backoff_factor="10ms" --resources="cpus:2;gpus:0;mem:1024;disk:1024;ports:[31000-32000]"
--revocable_cpu_low_priority="true" --sandbox_directory="/mnt/mesos/sandbox" --strict="true"
--switch_user="true" --systemd_enable_support="true" --systemd_runtime_directory="/run/systemd/system"
--version="false" --work_dir="/tmp/Endpoint_SlaveEndpointTest_UnauthorizedRequest_2_6w2aBA"
I0720 04:17:43.453212 29724 credentials.hpp:86] Loading credential for authentication from
'/tmp/Endpoint_SlaveEndpointTest_UnauthorizedRequest_2_6w2aBA/credential'
I0720 04:17:43.453531 29724 slave.cpp:343] Agent using credential for: test-principal
I0720 04:17:43.453568 29724 credentials.hpp:37] Loading credentials for authentication from
'/tmp/Endpoint_SlaveEndpointTest_UnauthorizedRequest_2_6w2aBA/http_credentials'
I0720 04:17:43.453868 29724 slave.cpp:395] Using default 'basic' HTTP authenticator
I0720 04:17:43.455180 29724 slave.cpp:594] Agent resources: cpus(*):2; mem(*):1024; disk(*):1024;
ports(*):[31000-32000]
I0720 04:17:43.455260 29724 slave.cpp:602] Agent attributes: [  ]
I0720 04:17:43.455276 29724 slave.cpp:607] Agent hostname: 3409a664dc74
I0720 04:17:43.461655 29725 state.cpp:57] Recovering state from '/tmp/Endpoint_SlaveEndpointTest_UnauthorizedRequest_2_6w2aBA/meta'
I0720 04:17:43.462914 29724 process.cpp:3340] Handling HTTP event for process 'slave(566)'
with path: '/slave(566)/containers'
I0720 04:17:43.465078 29719 status_update_manager.cpp:200] Recovering status update manager
I0720 04:17:43.465358 29729 containerizer.cpp:522] Recovering containerizer
I0720 04:17:43.467298 29730 provisioner.cpp:253] Provisioner recovery complete
I0720 04:17:43.467550 29724 http.cpp:829] Authorizing principal 'test-principal' to GET the
'/containers' endpoint
I0720 04:17:43.468737 29724 slave.cpp:4946] Finished recovery
I0720 04:17:43.469317 29724 slave.cpp:5118] Querying resource estimator for oversubscribable
resources
I0720 04:17:43.470484 29724 slave.cpp:5132] Received oversubscribable resources  from the
resource estimator
I0720 04:17:43.500500 29719 slave.cpp:841] Agent terminating
[       OK ] Endpoint/SlaveEndpointTest.UnauthorizedRequest/2 (108 ms)
[ RUN      ] Endpoint/SlaveEndpointTest.NoAuthorizer/0
I0720 04:17:43.547955 29697 containerizer.cpp:196] Using isolation: posix/cpu,posix/mem,filesystem/posix,network/cni
W0720 04:17:43.548946 29697 backend.cpp:75] Failed to create 'aufs' backend: AufsBackend requires
root privileges, but is running as user mesos
W0720 04:17:43.549165 29697 backend.cpp:75] Failed to create 'bind' backend: BindBackend requires
root privileges
I0720 04:17:43.551004 29697 cluster.cpp:432] Creating default 'local' authorizer
I0720 04:17:43.553681 29727 slave.cpp:205] Agent started on 567)@172.17.0.8:58903
I0720 04:17:43.553709 29727 slave.cpp:206] Flags at startup: --acls="" --appc_simple_discovery_uri_prefix="http://"
--appc_store_dir="/tmp/mesos/store/appc" --authenticate_http="true" --authenticatee="crammd5"
--authentication_backoff_factor="1secs" --authorizer="local" --cgroups_cpu_enable_pids_and_tids_count="false"
--cgroups_enable_cfs="false" --cgroups_hierarchy="/sys/fs/cgroup" --cgroups_limit_swap="false"
--cgroups_root="mesos" --container_disk_watch_interval="15secs" --containerizers="mesos" --credential="/tmp/Endpoint_SlaveEndpointTest_NoAuthorizer_0_8wXuUG/credential"
--default_role="*" --disk_watch_interval="1mins" --docker="docker" --docker_kill_orphans="true"
--docker_registry="https://registry-1.docker.io" --docker_remove_delay="6hrs" --docker_socket="/var/run/docker.sock"
--docker_stop_timeout="0ns" --docker_store_dir="/tmp/mesos/store/docker" --docker_volume_checkpoint_dir="/var/run/mesos/isolators/docker/volume"
--enforce_container_disk_quota="false" --executor_registration_timeout="1mins" --executor_shutdown_grace_period="5secs"
--fetcher_cache_dir="/tmp/Endpoint_SlaveEndpointTest_NoAuthorizer_0_8wXuUG/fetch" --fetcher_cache_size="2GB"
--frameworks_home="" --gc_delay="1weeks" --gc_disk_headroom="0.1" --hadoop_home="" --help="false"
--hostname_lookup="true" --http_authenticators="basic" --http_command_executor="false" --http_credentials="/tmp/Endpoint_SlaveEndpointTest_NoAuthorizer_0_8wXuUG/http_credentials"
--image_provisioner_backend="copy" --initialize_driver_logging="true" --isolation="posix/cpu,posix/mem"
--launcher_dir="/mesos/mesos-1.1.0/_build/src" --logbufsecs="0" --logging_level="INFO" --oversubscribed_resources_interval="15secs"
--perf_duration="10secs" --perf_interval="1mins" --qos_correction_interval_min="0ns" --quiet="false"
--recover="reconnect" --recovery_timeout="15mins" --registration_backoff_factor="10ms" --resources="cpus:2;gpus:0;mem:1024;disk:1024;ports:[31000-32000]"
--revocable_cpu_low_priority="true" --sandbox_directory="/mnt/mesos/sandbox" --strict="true"
--switch_user="true" --systemd_enable_support="true" --systemd_runtime_directory="/run/systemd/system"
--version="false" --work_dir="/tmp/Endpoint_SlaveEndpointTest_NoAuthorizer_0_8wXuUG"
I0720 04:17:43.554448 29727 credentials.hpp:86] Loading credential for authentication from
'/tmp/Endpoint_SlaveEndpointTest_NoAuthorizer_0_8wXuUG/credential'
I0720 04:17:43.554661 29727 slave.cpp:343] Agent using credential for: test-principal
I0720 04:17:43.554805 29727 credentials.hpp:37] Loading credentials for authentication from
'/tmp/Endpoint_SlaveEndpointTest_NoAuthorizer_0_8wXuUG/http_credentials'
I0720 04:17:43.555203 29727 slave.cpp:395] Using default 'basic' HTTP authenticator
I0720 04:17:43.558065 29727 slave.cpp:594] Agent resources: cpus(*):2; mem(*):1024; disk(*):1024;
ports(*):[31000-32000]
I0720 04:17:43.558145 29727 slave.cpp:602] Agent attributes: [  ]
I0720 04:17:43.558159 29727 slave.cpp:607] Agent hostname: 3409a664dc74
I0720 04:17:43.560557 29720 state.cpp:57] Recovering state from '/tmp/Endpoint_SlaveEndpointTest_NoAuthorizer_0_8wXuUG/meta'
I0720 04:17:43.560645 29727 process.cpp:3340] Handling HTTP event for process 'slave(567)'
with path: '/slave(567)/monitor/statistics'
I0720 04:17:43.561072 29727 status_update_manager.cpp:200] Recovering status update manager
I0720 04:17:43.561208 29727 containerizer.cpp:522] Recovering containerizer
I0720 04:17:43.562217 29727 http.cpp:829] Authorizing principal 'test-principal' to GET the
'/monitor/statistics' endpoint
I0720 04:17:43.566051 29720 provisioner.cpp:253] Provisioner recovery complete
I0720 04:17:43.566480 29719 slave.cpp:4946] Finished recovery
I0720 04:17:43.575753 29719 slave.cpp:5118] Querying resource estimator for oversubscribable
resources
I0720 04:17:43.576161 29719 slave.cpp:5132] Received oversubscribable resources  from the
resource estimator
I0720 04:17:43.576428 29731 slave.cpp:841] Agent terminating
[       OK ] Endpoint/SlaveEndpointTest.NoAuthorizer/0 (121 ms)
[ RUN      ] Endpoint/SlaveEndpointTest.NoAuthorizer/1
I0720 04:17:43.664695 29697 containerizer.cpp:196] Using isolation: posix/cpu,posix/mem,filesystem/posix,network/cni
W0720 04:17:43.665797 29697 backend.cpp:75] Failed to create 'aufs' backend: AufsBackend requires
root privileges, but is running as user mesos
W0720 04:17:43.666129 29697 backend.cpp:75] Failed to create 'bind' backend: BindBackend requires
root privileges
I0720 04:17:43.668651 29697 cluster.cpp:432] Creating default 'local' authorizer
I0720 04:17:43.676934 29721 slave.cpp:205] Agent started on 568)@172.17.0.8:58903
I0720 04:17:43.677078 29721 slave.cpp:206] Flags at startup: --acls="" --appc_simple_discovery_uri_prefix="http://"
--appc_store_dir="/tmp/mesos/store/appc" --authenticate_http="true" --authenticatee="crammd5"
--authentication_backoff_factor="1secs" --authorizer="local" --cgroups_cpu_enable_pids_and_tids_count="false"
--cgroups_enable_cfs="false" --cgroups_hierarchy="/sys/fs/cgroup" --cgroups_limit_swap="false"
--cgroups_root="mesos" --container_disk_watch_interval="15secs" --containerizers="mesos" --credential="/tmp/Endpoint_SlaveEndpointTest_NoAuthorizer_1_6B2A7N/credential"
--default_role="*" --disk_watch_interval="1mins" --docker="docker" --docker_kill_orphans="true"
--docker_registry="https://registry-1.docker.io" --docker_remove_delay="6hrs" --docker_socket="/var/run/docker.sock"
--docker_stop_timeout="0ns" --docker_store_dir="/tmp/mesos/store/docker" --docker_volume_checkpoint_dir="/var/run/mesos/isolators/docker/volume"
--enforce_container_disk_quota="false" --executor_registration_timeout="1mins" --executor_shutdown_grace_period="5secs"
--fetcher_cache_dir="/tmp/Endpoint_SlaveEndpointTest_NoAuthorizer_1_6B2A7N/fetch" --fetcher_cache_size="2GB"
--frameworks_home="" --gc_delay="1weeks" --gc_disk_headroom="0.1" --hadoop_home="" --help="false"
--hostname_lookup="true" --http_authenticators="basic" --http_command_executor="false" --http_credentials="/tmp/Endpoint_SlaveEndpointTest_NoAuthorizer_1_6B2A7N/http_credentials"
--image_provisioner_backend="copy" --initialize_driver_logging="true" --isolation="posix/cpu,posix/mem"
--launcher_dir="/mesos/mesos-1.1.0/_build/src" --logbufsecs="0" --logging_level="INFO" --oversubscribed_resources_interval="15secs"
--perf_duration="10secs" --perf_interval="1mins" --qos_correction_interval_min="0ns" --quiet="false"
--recover="reconnect" --recovery_timeout="15mins" --registration_backoff_factor="10ms" --resources="cpus:2;gpus:0;mem:1024;disk:1024;ports:[31000-32000]"
--revocable_cpu_low_priority="true" --sandbox_directory="/mnt/mesos/sandbox" --strict="true"
--switch_user="true" --systemd_enable_support="true" --systemd_runtime_directory="/run/systemd/system"
--version="false" --work_dir="/tmp/Endpoint_SlaveEndpointTest_NoAuthorizer_1_6B2A7N"
I0720 04:17:43.677989 29721 credentials.hpp:86] Loading credential for authentication from
'/tmp/Endpoint_SlaveEndpointTest_NoAuthorizer_1_6B2A7N/credential'
I0720 04:17:43.678270 29721 slave.cpp:343] Agent using credential for: test-principal
I0720 04:17:43.678372 29721 credentials.hpp:37] Loading credentials for authentication from
'/tmp/Endpoint_SlaveEndpointTest_NoAuthorizer_1_6B2A7N/http_credentials'
I0720 04:17:43.678740 29721 slave.cpp:395] Using default 'basic' HTTP authenticator
I0720 04:17:43.680177 29721 slave.cpp:594] Agent resources: cpus(*):2; mem(*):1024; disk(*):1024;
ports(*):[31000-32000]
I0720 04:17:43.680318 29721 slave.cpp:602] Agent attributes: [  ]
I0720 04:17:43.680438 29721 slave.cpp:607] Agent hostname: 3409a664dc74
I0720 04:17:43.682651 29721 state.cpp:57] Recovering state from '/tmp/Endpoint_SlaveEndpointTest_NoAuthorizer_1_6B2A7N/meta'
I0720 04:17:43.683280 29721 status_update_manager.cpp:200] Recovering status update manager
I0720 04:17:43.683586 29721 containerizer.cpp:522] Recovering containerizer
I0720 04:17:43.685925 29723 provisioner.cpp:253] Provisioner recovery complete
I0720 04:17:43.686801 29724 slave.cpp:4946] Finished recovery
I0720 04:17:43.687350 29724 slave.cpp:5118] Querying resource estimator for oversubscribable
resources
I0720 04:17:43.687969 29724 slave.cpp:5132] Received oversubscribable resources  from the
resource estimator
I0720 04:17:43.691970 29722 process.cpp:3340] Handling HTTP event for process 'slave(568)'
with path: '/slave(568)/monitor/statistics.json'
I0720 04:17:43.693753 29722 http.cpp:829] Authorizing principal 'test-principal' to GET the
'/monitor/statistics.json' endpoint
I0720 04:17:43.712998 29731 slave.cpp:841] Agent terminating
[       OK ] Endpoint/SlaveEndpointTest.NoAuthorizer/1 (63 ms)
[ RUN      ] Endpoint/SlaveEndpointTest.NoAuthorizer/2
I0720 04:17:43.727282 29697 containerizer.cpp:196] Using isolation: posix/cpu,posix/mem,filesystem/posix,network/cni
W0720 04:17:43.728307 29697 backend.cpp:75] Failed to create 'aufs' backend: AufsBackend requires
root privileges, but is running as user mesos
W0720 04:17:43.728627 29697 backend.cpp:75] Failed to create 'bind' backend: BindBackend requires
root privileges
I0720 04:17:43.730362 29697 cluster.cpp:432] Creating default 'local' authorizer
I0720 04:17:43.732605 29729 slave.cpp:205] Agent started on 569)@172.17.0.8:58903
I0720 04:17:43.732630 29729 slave.cpp:206] Flags at startup: --acls="" --appc_simple_discovery_uri_prefix="http://"
--appc_store_dir="/tmp/mesos/store/appc" --authenticate_http="true" --authenticatee="crammd5"
--authentication_backoff_factor="1secs" --authorizer="local" --cgroups_cpu_enable_pids_and_tids_count="false"
--cgroups_enable_cfs="false" --cgroups_hierarchy="/sys/fs/cgroup" --cgroups_limit_swap="false"
--cgroups_root="mesos" --container_disk_watch_interval="15secs" --containerizers="mesos" --credential="/tmp/Endpoint_SlaveEndpointTest_NoAuthorizer_2_b8KTXV/credential"
--default_role="*" --disk_watch_interval="1mins" --docker="docker" --docker_kill_orphans="true"
--docker_registry="https://registry-1.docker.io" --docker_remove_delay="6hrs" --docker_socket="/var/run/docker.sock"
--docker_stop_timeout="0ns" --docker_store_dir="/tmp/mesos/store/docker" --docker_volume_checkpoint_dir="/var/run/mesos/isolators/docker/volume"
--enforce_container_disk_quota="false" --executor_registration_timeout="1mins" --executor_shutdown_grace_period="5secs"
--fetcher_cache_dir="/tmp/Endpoint_SlaveEndpointTest_NoAuthorizer_2_b8KTXV/fetch" --fetcher_cache_size="2GB"
--frameworks_home="" --gc_delay="1weeks" --gc_disk_headroom="0.1" --hadoop_home="" --help="false"
--hostname_lookup="true" --http_authenticators="basic" --http_command_executor="false" --http_credentials="/tmp/Endpoint_SlaveEndpointTest_NoAuthorizer_2_b8KTXV/http_credentials"
--image_provisioner_backend="copy" --initialize_driver_logging="true" --isolation="posix/cpu,posix/mem"
--launcher_dir="/mesos/mesos-1.1.0/_build/src" --logbufsecs="0" --logging_level="INFO" --oversubscribed_resources_interval="15secs"
--perf_duration="10secs" --perf_interval="1mins" --qos_correction_interval_min="0ns" --quiet="false"
--recover="reconnect" --recovery_timeout="15mins" --registration_backoff_factor="10ms" --resources="cpus:2;gpus:0;mem:1024;disk:1024;ports:[31000-32000]"
--revocable_cpu_low_priority="true" --sandbox_directory="/mnt/mesos/sandbox" --strict="true"
--switch_user="true" --systemd_enable_support="true" --systemd_runtime_directory="/run/systemd/system"
--version="false" --work_dir="/tmp/Endpoint_SlaveEndpointTest_NoAuthorizer_2_b8KTXV"
I0720 04:17:43.733338 29729 credentials.hpp:86] Loading credential for authentication from
'/tmp/Endpoint_SlaveEndpointTest_NoAuthorizer_2_b8KTXV/credential'
I0720 04:17:43.733554 29729 slave.cpp:343] Agent using credential for: test-principal
I0720 04:17:43.733657 29729 credentials.hpp:37] Loading credentials for authentication from
'/tmp/Endpoint_SlaveEndpointTest_NoAuthorizer_2_b8KTXV/http_credentials'
I0720 04:17:43.734045 29729 slave.cpp:395] Using default 'basic' HTTP authenticator
I0720 04:17:43.735258 29729 slave.cpp:594] Agent resources: cpus(*):2; mem(*):1024; disk(*):1024;
ports(*):[31000-32000]
I0720 04:17:43.735357 29729 slave.cpp:602] Agent attributes: [  ]
I0720 04:17:43.735380 29729 slave.cpp:607] Agent hostname: 3409a664dc74
I0720 04:17:43.737540 29716 state.cpp:57] Recovering state from '/tmp/Endpoint_SlaveEndpointTest_NoAuthorizer_2_b8KTXV/meta'
I0720 04:17:43.737877 29728 status_update_manager.cpp:200] Recovering status update manager
I0720 04:17:43.738196 29731 containerizer.cpp:522] Recovering containerizer
I0720 04:17:43.740067 29731 provisioner.cpp:253] Provisioner recovery complete
I0720 04:17:43.740550 29722 slave.cpp:4946] Finished recovery
I0720 04:17:43.747843 29722 slave.cpp:5118] Querying resource estimator for oversubscribable
resources
I0720 04:17:43.747999 29722 process.cpp:3340] Handling HTTP event for process 'slave(569)'
with path: '/slave(569)/containers'
I0720 04:17:43.749037 29722 slave.cpp:5132] Received oversubscribable resources  from the
resource estimator
I0720 04:17:43.749863 29722 http.cpp:829] Authorizing principal 'test-principal' to GET the
'/containers' endpoint
I0720 04:17:43.775279 29697 slave.cpp:841] Agent terminating
[       OK ] Endpoint/SlaveEndpointTest.NoAuthorizer/2 (64 ms)
[----------] 9 tests from Endpoint/SlaveEndpointTest (888 ms total)

[----------] Global test environment tear-down
[==========] 1256 tests from 139 test cases ran. (1130232 ms total)
[  PASSED  ] 1255 tests.
[  FAILED  ] 1 test, listed below:
[  FAILED  ] HealthCheckTest.HealthStatusChange

 1 FAILED TEST
  YOU HAVE 6 DISABLED TESTS

make[4]: *** [check-local] Error 1
make[4]: Leaving directory `/mesos/mesos-1.1.0/_build/src'
make[3]: *** [check-am] Error 2
make[3]: Leaving directory `/mesos/mesos-1.1.0/_build/src'
make[2]: *** [check] Error 2
make[2]: Leaving directory `/mesos/mesos-1.1.0/_build/src'
make[1]: *** [check-recursive] Error 1
make[1]: Leaving directory `/mesos/mesos-1.1.0/_build'
make: *** [distcheck] Error 1
+ docker rmi mesos-1468983037-29169
Untagged: mesos-1468983037-29169:latest
Deleted: c498445fd1d1cc18ab10144a724ae82a859a588768ddb69e6abf0ad8e48b282a
Deleted: 9db352b8d464f1b6d70d86eb3215ee584a9cf7a769af8ab80c5fc962bc4924ad
Deleted: f737ea023a5786a954db9220d0845e52f45c25af1cc48c9d0cff6dd763b3a335
Deleted: 63adbd7779203f98ea6d6bf33bbeb4f336b1eb6e292c480bb389f165ba8272a6
Deleted: af9d430d9761633a700e93002ebd080f7ab6ad504a2e637dedbb0442d8019863
Deleted: 996d8255192c8a930a9382f6e43301d35e74c290d640179f6f8b4f7d4b5b9d7a
Deleted: 0e31c2567dcaf0cebbb567d823279c0abc43d7831e713f9ea1525f8f7ff6e0b6
Deleted: 199e12cd3662e84c28049283630ea53000e3e76a2667298402da397fce4df66f
Deleted: 634edfbfe6aa4299e434a31e96a7b2f3f75d8c6f2ad0ac6ca0b5ab42c8f61858
Deleted: d15b1955908f80e01ad706d231f7fe036182b1a74a7eaf8361901e0990500765
Deleted: 3061c76d437abbd2817448431d478a83f93f564b48c6bd0e6d3d4caaad3aacda
Deleted: 30a6cc7c5bb65c970980106abea1a2a908e363232835a2ff683805f9e4b7be1f
Deleted: d8af4ade38580e688570fdd2c0225a357aab1faad57775f29159c35a73bec89b
Deleted: 1b2fed206c7fc3001ac1fb57ea0f0d0e1bc0b5520435dc52e4edb25327a45932
Deleted: 0202f247a270614b15703f46dee7d2efd87a9bef34cda744d6defda4a6357e28
Build step 'Execute shell' marked build as failure

Mime
View raw message