mesos-builds mailing list archives

Site index · List index
Message view « Date » · « Thread »
Top « Date » · « Thread »
From Apache Jenkins Server <jenk...@builds.apache.org>
Subject Build failed in Jenkins: Mesos » autotools,gcc,--verbose,GLOG_v=1 MESOS_VERBOSE=1,centos:7,(docker||Hadoop)&&(!ubuntu-us1)&&(!ubuntu-6) #2438
Date Tue, 05 Jul 2016 13:17:50 GMT
See <https://builds.apache.org/job/Mesos/BUILDTOOL=autotools,COMPILER=gcc,CONFIGURATION=--verbose,ENVIRONMENT=GLOG_v=1%20MESOS_VERBOSE=1,OS=centos%3A7,label_exp=(docker%7C%7CHadoop)&&(!ubuntu-us1)&&(!ubuntu-6)/2438/changes>

Changes:

[mpark] Changed Aurora URL since it's not an incubator anymore.

------------------------------------------
[...truncated 192601 lines...]
I0705 13:17:48.226043 29155 state.cpp:57] Recovering state from '/tmp/Endpoint_SlaveEndpointTest_AuthorizedRequest_1_lhY676/meta'
I0705 13:17:48.226110 29157 process.cpp:3322] Handling HTTP event for process 'slave(539)'
with path: '/slave(539)/monitor/statistics.json'
I0705 13:17:48.226688 29164 status_update_manager.cpp:200] Recovering status update manager
I0705 13:17:48.226886 29161 containerizer.cpp:522] Recovering containerizer
I0705 13:17:48.227185 29153 http.cpp:765] Authorizing principal 'test-principal' to GET the
'/monitor/statistics.json' endpoint
I0705 13:17:48.228322 29156 provisioner.cpp:253] Provisioner recovery complete
I0705 13:17:48.228770 29162 slave.cpp:4838] Finished recovery
I0705 13:17:48.229217 29162 slave.cpp:5010] Querying resource estimator for oversubscribable
resources
I0705 13:17:48.229482 29155 slave.cpp:5024] Received oversubscribable resources  from the
resource estimator
I0705 13:17:48.230254 29160 slave.cpp:839] Agent terminating
[       OK ] Endpoint/SlaveEndpointTest.AuthorizedRequest/1 (21 ms)
[ RUN      ] Endpoint/SlaveEndpointTest.AuthorizedRequest/2
I0705 13:17:48.238375 29133 containerizer.cpp:196] Using isolation: posix/cpu,posix/mem,filesystem/posix,network/cni
W0705 13:17:48.239140 29133 backend.cpp:75] Failed to create 'aufs' backend: AufsBackend requires
root privileges, but is running as user mesos
W0705 13:17:48.239318 29133 backend.cpp:75] Failed to create 'bind' backend: BindBackend requires
root privileges
I0705 13:17:48.242676 29159 slave.cpp:203] Agent started on 540)@172.17.0.2:33947
I0705 13:17:48.242702 29159 slave.cpp:204] Flags at startup: --acls="" --appc_simple_discovery_uri_prefix="http://"
--appc_store_dir="/tmp/mesos/store/appc" --authenticate_http="true" --authenticatee="crammd5"
--authorizer="local" --cgroups_cpu_enable_pids_and_tids_count="false" --cgroups_enable_cfs="false"
--cgroups_hierarchy="/sys/fs/cgroup" --cgroups_limit_swap="false" --cgroups_root="mesos" --container_disk_watch_interval="15secs"
--containerizers="mesos" --credential="/tmp/Endpoint_SlaveEndpointTest_AuthorizedRequest_2_SjfhEx/credential"
--default_role="*" --disk_watch_interval="1mins" --docker="docker" --docker_kill_orphans="true"
--docker_registry="https://registry-1.docker.io" --docker_remove_delay="6hrs" --docker_socket="/var/run/docker.sock"
--docker_stop_timeout="0ns" --docker_store_dir="/tmp/mesos/store/docker" --docker_volume_checkpoint_dir="/var/run/mesos/isolators/docker/volume"
--enforce_container_disk_quota="false" --executor_registration_timeout="1mins" --executor_shutdown_grace_period="5secs"
--fetcher_cache_dir="/tmp/Endpoint_SlaveEndpointTest_AuthorizedRequest_2_SjfhEx/fetch" --fetcher_cache_size="2GB"
--frameworks_home="" --gc_delay="1weeks" --gc_disk_headroom="0.1" --hadoop_home="" --help="true"
--hostname_lookup="true" --http_authenticators="basic" --http_command_executor="false" --http_credentials="/tmp/Endpoint_SlaveEndpointTest_AuthorizedRequest_2_SjfhEx/http_credentials"
--image_provisioner_backend="copy" --initialize_driver_logging="true" --isolation="posix/cpu,posix/mem"
--launcher_dir="/mesos/mesos-1.0.0/_build/src" --logbufsecs="0" --logging_level="INFO" --oversubscribed_resources_interval="15secs"
--perf_duration="10secs" --perf_interval="1mins" --qos_correction_interval_min="0ns" --quiet="false"
--recover="reconnect" --recovery_timeout="15mins" --registration_backoff_factor="10ms" --resources="cpus:2;gpus:0;mem:1024;disk:1024;ports:[31000-32000]"
--revocable_cpu_low_priority="true" --sandbox_directory="/mnt/mesos/sandbox" --strict="true"
--switch_user="true" --systemd_enable_support="true" --systemd_runtime_directory="/run/systemd/system"
--version="false" --work_dir="/tmp/Endpoint_SlaveEndpointTest_AuthorizedRequest_2_SjfhEx"
I0705 13:17:48.243305 29159 credentials.hpp:86] Loading credential for authentication from
'/tmp/Endpoint_SlaveEndpointTest_AuthorizedRequest_2_SjfhEx/credential'
I0705 13:17:48.243502 29159 slave.cpp:341] Agent using credential for: test-principal
I0705 13:17:48.243546 29159 credentials.hpp:37] Loading credentials for authentication from
'/tmp/Endpoint_SlaveEndpointTest_AuthorizedRequest_2_SjfhEx/http_credentials'
I0705 13:17:48.243831 29159 slave.cpp:393] Using default 'basic' HTTP authenticator
I0705 13:17:48.244185 29159 resources.cpp:572] Parsing resources as JSON failed: cpus:2;gpus:0;mem:1024;disk:1024;ports:[31000-32000]
Trying semicolon-delimited string format instead
I0705 13:17:48.244585 29159 resources.cpp:572] Parsing resources as JSON failed: cpus:2;gpus:0;mem:1024;disk:1024;ports:[31000-32000]
Trying semicolon-delimited string format instead
I0705 13:17:48.245054 29159 slave.cpp:592] Agent resources: cpus(*):2; mem(*):1024; disk(*):1024;
ports(*):[31000-32000]
I0705 13:17:48.245126 29159 slave.cpp:600] Agent attributes: [  ]
I0705 13:17:48.245144 29159 slave.cpp:605] Agent hostname: 35b73c0e686a
I0705 13:17:48.246289 29157 state.cpp:57] Recovering state from '/tmp/Endpoint_SlaveEndpointTest_AuthorizedRequest_2_SjfhEx/meta'
I0705 13:17:48.246309 29159 process.cpp:3322] Handling HTTP event for process 'slave(540)'
with path: '/slave(540)/containers'
I0705 13:17:48.246798 29161 status_update_manager.cpp:200] Recovering status update manager
I0705 13:17:48.247011 29166 containerizer.cpp:522] Recovering containerizer
I0705 13:17:48.247308 29155 http.cpp:765] Authorizing principal 'test-principal' to GET the
'/containers' endpoint
I0705 13:17:48.248335 29153 provisioner.cpp:253] Provisioner recovery complete
I0705 13:17:48.248634 29154 slave.cpp:4838] Finished recovery
I0705 13:17:48.249168 29154 slave.cpp:5010] Querying resource estimator for oversubscribable
resources
I0705 13:17:48.249395 29158 slave.cpp:5024] Received oversubscribable resources  from the
resource estimator
I0705 13:17:48.250432 29160 slave.cpp:839] Agent terminating
[       OK ] Endpoint/SlaveEndpointTest.AuthorizedRequest/2 (20 ms)
[ RUN      ] Endpoint/SlaveEndpointTest.UnauthorizedRequest/0
I0705 13:17:48.258718 29133 containerizer.cpp:196] Using isolation: posix/cpu,posix/mem,filesystem/posix,network/cni
W0705 13:17:48.259587 29133 backend.cpp:75] Failed to create 'aufs' backend: AufsBackend requires
root privileges, but is running as user mesos
W0705 13:17:48.259753 29133 backend.cpp:75] Failed to create 'bind' backend: BindBackend requires
root privileges
I0705 13:17:48.263692 29160 slave.cpp:203] Agent started on 541)@172.17.0.2:33947
I0705 13:17:48.263722 29160 slave.cpp:204] Flags at startup: --acls="" --appc_simple_discovery_uri_prefix="http://"
--appc_store_dir="/tmp/mesos/store/appc" --authenticate_http="true" --authenticatee="crammd5"
--authorizer="local" --cgroups_cpu_enable_pids_and_tids_count="false" --cgroups_enable_cfs="false"
--cgroups_hierarchy="/sys/fs/cgroup" --cgroups_limit_swap="false" --cgroups_root="mesos" --container_disk_watch_interval="15secs"
--containerizers="mesos" --credential="/tmp/Endpoint_SlaveEndpointTest_UnauthorizedRequest_0_jwxqkY/credential"
--default_role="*" --disk_watch_interval="1mins" --docker="docker" --docker_kill_orphans="true"
--docker_registry="https://registry-1.docker.io" --docker_remove_delay="6hrs" --docker_socket="/var/run/docker.sock"
--docker_stop_timeout="0ns" --docker_store_dir="/tmp/mesos/store/docker" --docker_volume_checkpoint_dir="/var/run/mesos/isolators/docker/volume"
--enforce_container_disk_quota="false" --executor_registration_timeout="1mins" --executor_shutdown_grace_period="5secs"
--fetcher_cache_dir="/tmp/Endpoint_SlaveEndpointTest_UnauthorizedRequest_0_jwxqkY/fetch" --fetcher_cache_size="2GB"
--frameworks_home="" --gc_delay="1weeks" --gc_disk_headroom="0.1" --hadoop_home="" --help="true"
--hostname_lookup="true" --http_authenticators="basic" --http_command_executor="false" --http_credentials="/tmp/Endpoint_SlaveEndpointTest_UnauthorizedRequest_0_jwxqkY/http_credentials"
--image_provisioner_backend="copy" --initialize_driver_logging="true" --isolation="posix/cpu,posix/mem"
--launcher_dir="/mesos/mesos-1.0.0/_build/src" --logbufsecs="0" --logging_level="INFO" --oversubscribed_resources_interval="15secs"
--perf_duration="10secs" --perf_interval="1mins" --qos_correction_interval_min="0ns" --quiet="false"
--recover="reconnect" --recovery_timeout="15mins" --registration_backoff_factor="10ms" --resources="cpus:2;gpus:0;mem:1024;disk:1024;ports:[31000-32000]"
--revocable_cpu_low_priority="true" --sandbox_directory="/mnt/mesos/sandbox" --strict="true"
--switch_user="true" --systemd_enable_support="true" --systemd_runtime_directory="/run/systemd/system"
--version="false" --work_dir="/tmp/Endpoint_SlaveEndpointTest_UnauthorizedRequest_0_jwxqkY"
I0705 13:17:48.264227 29160 credentials.hpp:86] Loading credential for authentication from
'/tmp/Endpoint_SlaveEndpointTest_UnauthorizedRequest_0_jwxqkY/credential'
I0705 13:17:48.264442 29160 slave.cpp:341] Agent using credential for: test-principal
I0705 13:17:48.264487 29160 credentials.hpp:37] Loading credentials for authentication from
'/tmp/Endpoint_SlaveEndpointTest_UnauthorizedRequest_0_jwxqkY/http_credentials'
I0705 13:17:48.264765 29160 slave.cpp:393] Using default 'basic' HTTP authenticator
I0705 13:17:48.265409 29160 resources.cpp:572] Parsing resources as JSON failed: cpus:2;gpus:0;mem:1024;disk:1024;ports:[31000-32000]
Trying semicolon-delimited string format instead
I0705 13:17:48.265812 29160 resources.cpp:572] Parsing resources as JSON failed: cpus:2;gpus:0;mem:1024;disk:1024;ports:[31000-32000]
Trying semicolon-delimited string format instead
I0705 13:17:48.266294 29160 slave.cpp:592] Agent resources: cpus(*):2; mem(*):1024; disk(*):1024;
ports(*):[31000-32000]
I0705 13:17:48.266369 29160 slave.cpp:600] Agent attributes: [  ]
I0705 13:17:48.266383 29160 slave.cpp:605] Agent hostname: 35b73c0e686a
I0705 13:17:48.268074 29156 state.cpp:57] Recovering state from '/tmp/Endpoint_SlaveEndpointTest_UnauthorizedRequest_0_jwxqkY/meta'
I0705 13:17:48.268151 29160 process.cpp:3322] Handling HTTP event for process 'slave(541)'
with path: '/slave(541)/monitor/statistics'
I0705 13:17:48.268714 29164 status_update_manager.cpp:200] Recovering status update manager
I0705 13:17:48.269026 29156 containerizer.cpp:522] Recovering containerizer
I0705 13:17:48.269162 29158 http.cpp:765] Authorizing principal 'test-principal' to GET the
'/monitor/statistics' endpoint
I0705 13:17:48.270505 29165 provisioner.cpp:253] Provisioner recovery complete
I0705 13:17:48.270916 29157 slave.cpp:4838] Finished recovery
I0705 13:17:48.271577 29157 slave.cpp:5010] Querying resource estimator for oversubscribable
resources
I0705 13:17:48.271940 29158 slave.cpp:5024] Received oversubscribable resources  from the
resource estimator
I0705 13:17:48.272408 29164 slave.cpp:839] Agent terminating
[       OK ] Endpoint/SlaveEndpointTest.UnauthorizedRequest/0 (21 ms)
[ RUN      ] Endpoint/SlaveEndpointTest.UnauthorizedRequest/1
I0705 13:17:48.281666 29133 containerizer.cpp:196] Using isolation: posix/cpu,posix/mem,filesystem/posix,network/cni
W0705 13:17:48.282539 29133 backend.cpp:75] Failed to create 'aufs' backend: AufsBackend requires
root privileges, but is running as user mesos
W0705 13:17:48.282721 29133 backend.cpp:75] Failed to create 'bind' backend: BindBackend requires
root privileges
I0705 13:17:48.285825 29161 slave.cpp:203] Agent started on 542)@172.17.0.2:33947
I0705 13:17:48.285846 29161 slave.cpp:204] Flags at startup: --acls="" --appc_simple_discovery_uri_prefix="http://"
--appc_store_dir="/tmp/mesos/store/appc" --authenticate_http="true" --authenticatee="crammd5"
--authorizer="local" --cgroups_cpu_enable_pids_and_tids_count="false" --cgroups_enable_cfs="false"
--cgroups_hierarchy="/sys/fs/cgroup" --cgroups_limit_swap="false" --cgroups_root="mesos" --container_disk_watch_interval="15secs"
--containerizers="mesos" --credential="/tmp/Endpoint_SlaveEndpointTest_UnauthorizedRequest_1_8QCpbp/credential"
--default_role="*" --disk_watch_interval="1mins" --docker="docker" --docker_kill_orphans="true"
--docker_registry="https://registry-1.docker.io" --docker_remove_delay="6hrs" --docker_socket="/var/run/docker.sock"
--docker_stop_timeout="0ns" --docker_store_dir="/tmp/mesos/store/docker" --docker_volume_checkpoint_dir="/var/run/mesos/isolators/docker/volume"
--enforce_container_disk_quota="false" --executor_registration_timeout="1mins" --executor_shutdown_grace_period="5secs"
--fetcher_cache_dir="/tmp/Endpoint_SlaveEndpointTest_UnauthorizedRequest_1_8QCpbp/fetch" --fetcher_cache_size="2GB"
--frameworks_home="" --gc_delay="1weeks" --gc_disk_headroom="0.1" --hadoop_home="" --help="true"
--hostname_lookup="true" --http_authenticators="basic" --http_command_executor="false" --http_credentials="/tmp/Endpoint_SlaveEndpointTest_UnauthorizedRequest_1_8QCpbp/http_credentials"
--image_provisioner_backend="copy" --initialize_driver_logging="true" --isolation="posix/cpu,posix/mem"
--launcher_dir="/mesos/mesos-1.0.0/_build/src" --logbufsecs="0" --logging_level="INFO" --oversubscribed_resources_interval="15secs"
--perf_duration="10secs" --perf_interval="1mins" --qos_correction_interval_min="0ns" --quiet="false"
--recover="reconnect" --recovery_timeout="15mins" --registration_backoff_factor="10ms" --resources="cpus:2;gpus:0;mem:1024;disk:1024;ports:[31000-32000]"
--revocable_cpu_low_priority="true" --sandbox_directory="/mnt/mesos/sandbox" --strict="true"
--switch_user="true" --systemd_enable_support="true" --systemd_runtime_directory="/run/systemd/system"
--version="false" --work_dir="/tmp/Endpoint_SlaveEndpointTest_UnauthorizedRequest_1_8QCpbp"
I0705 13:17:48.286208 29161 credentials.hpp:86] Loading credential for authentication from
'/tmp/Endpoint_SlaveEndpointTest_UnauthorizedRequest_1_8QCpbp/credential'
I0705 13:17:48.286422 29161 slave.cpp:341] Agent using credential for: test-principal
I0705 13:17:48.286460 29161 credentials.hpp:37] Loading credentials for authentication from
'/tmp/Endpoint_SlaveEndpointTest_UnauthorizedRequest_1_8QCpbp/http_credentials'
I0705 13:17:48.286818 29161 slave.cpp:393] Using default 'basic' HTTP authenticator
I0705 13:17:48.287395 29161 resources.cpp:572] Parsing resources as JSON failed: cpus:2;gpus:0;mem:1024;disk:1024;ports:[31000-32000]
Trying semicolon-delimited string format instead
I0705 13:17:48.287780 29161 resources.cpp:572] Parsing resources as JSON failed: cpus:2;gpus:0;mem:1024;disk:1024;ports:[31000-32000]
Trying semicolon-delimited string format instead
I0705 13:17:48.288282 29161 slave.cpp:592] Agent resources: cpus(*):2; mem(*):1024; disk(*):1024;
ports(*):[31000-32000]
I0705 13:17:48.288359 29161 slave.cpp:600] Agent attributes: [  ]
I0705 13:17:48.288373 29161 slave.cpp:605] Agent hostname: 35b73c0e686a
I0705 13:17:48.289912 29152 state.cpp:57] Recovering state from '/tmp/Endpoint_SlaveEndpointTest_UnauthorizedRequest_1_8QCpbp/meta'
I0705 13:17:48.289963 29161 process.cpp:3322] Handling HTTP event for process 'slave(542)'
with path: '/slave(542)/monitor/statistics.json'
I0705 13:17:48.290627 29160 status_update_manager.cpp:200] Recovering status update manager
I0705 13:17:48.290817 29154 containerizer.cpp:522] Recovering containerizer
I0705 13:17:48.291147 29157 http.cpp:765] Authorizing principal 'test-principal' to GET the
'/monitor/statistics.json' endpoint
I0705 13:17:48.292161 29155 provisioner.cpp:253] Provisioner recovery complete
I0705 13:17:48.292464 29160 slave.cpp:4838] Finished recovery
I0705 13:17:48.293123 29160 slave.cpp:5010] Querying resource estimator for oversubscribable
resources
I0705 13:17:48.293603 29152 slave.cpp:5024] Received oversubscribable resources  from the
resource estimator
I0705 13:17:48.293699 29152 slave.cpp:839] Agent terminating
[       OK ] Endpoint/SlaveEndpointTest.UnauthorizedRequest/1 (22 ms)
[ RUN      ] Endpoint/SlaveEndpointTest.UnauthorizedRequest/2
I0705 13:17:48.303889 29133 containerizer.cpp:196] Using isolation: posix/cpu,posix/mem,filesystem/posix,network/cni
W0705 13:17:48.304597 29133 backend.cpp:75] Failed to create 'aufs' backend: AufsBackend requires
root privileges, but is running as user mesos
W0705 13:17:48.304745 29133 backend.cpp:75] Failed to create 'bind' backend: BindBackend requires
root privileges
I0705 13:17:48.307271 29160 slave.cpp:203] Agent started on 543)@172.17.0.2:33947
I0705 13:17:48.307294 29160 slave.cpp:204] Flags at startup: --acls="" --appc_simple_discovery_uri_prefix="http://"
--appc_store_dir="/tmp/mesos/store/appc" --authenticate_http="true" --authenticatee="crammd5"
--authorizer="local" --cgroups_cpu_enable_pids_and_tids_count="false" --cgroups_enable_cfs="false"
--cgroups_hierarchy="/sys/fs/cgroup" --cgroups_limit_swap="false" --cgroups_root="mesos" --container_disk_watch_interval="15secs"
--containerizers="mesos" --credential="/tmp/Endpoint_SlaveEndpointTest_UnauthorizedRequest_2_hbyadQ/credential"
--default_role="*" --disk_watch_interval="1mins" --docker="docker" --docker_kill_orphans="true"
--docker_registry="https://registry-1.docker.io" --docker_remove_delay="6hrs" --docker_socket="/var/run/docker.sock"
--docker_stop_timeout="0ns" --docker_store_dir="/tmp/mesos/store/docker" --docker_volume_checkpoint_dir="/var/run/mesos/isolators/docker/volume"
--enforce_container_disk_quota="false" --executor_registration_timeout="1mins" --executor_shutdown_grace_period="5secs"
--fetcher_cache_dir="/tmp/Endpoint_SlaveEndpointTest_UnauthorizedRequest_2_hbyadQ/fetch" --fetcher_cache_size="2GB"
--frameworks_home="" --gc_delay="1weeks" --gc_disk_headroom="0.1" --hadoop_home="" --help="true"
--hostname_lookup="true" --http_authenticators="basic" --http_command_executor="false" --http_credentials="/tmp/Endpoint_SlaveEndpointTest_UnauthorizedRequest_2_hbyadQ/http_credentials"
--image_provisioner_backend="copy" --initialize_driver_logging="true" --isolation="posix/cpu,posix/mem"
--launcher_dir="/mesos/mesos-1.0.0/_build/src" --logbufsecs="0" --logging_level="INFO" --oversubscribed_resources_interval="15secs"
--perf_duration="10secs" --perf_interval="1mins" --qos_correction_interval_min="0ns" --quiet="false"
--recover="reconnect" --recovery_timeout="15mins" --registration_backoff_factor="10ms" --resources="cpus:2;gpus:0;mem:1024;disk:1024;ports:[31000-32000]"
--revocable_cpu_low_priority="true" --sandbox_directory="/mnt/mesos/sandbox" --strict="true"
--switch_user="true" --systemd_enable_support="true" --systemd_runtime_directory="/run/systemd/system"
--version="false" --work_dir="/tmp/Endpoint_SlaveEndpointTest_UnauthorizedRequest_2_hbyadQ"
I0705 13:17:48.307654 29160 credentials.hpp:86] Loading credential for authentication from
'/tmp/Endpoint_SlaveEndpointTest_UnauthorizedRequest_2_hbyadQ/credential'
I0705 13:17:48.307838 29160 slave.cpp:341] Agent using credential for: test-principal
I0705 13:17:48.307886 29160 credentials.hpp:37] Loading credentials for authentication from
'/tmp/Endpoint_SlaveEndpointTest_UnauthorizedRequest_2_hbyadQ/http_credentials'
I0705 13:17:48.308193 29160 slave.cpp:393] Using default 'basic' HTTP authenticator
I0705 13:17:48.308557 29160 resources.cpp:572] Parsing resources as JSON failed: cpus:2;gpus:0;mem:1024;disk:1024;ports:[31000-32000]
Trying semicolon-delimited string format instead
I0705 13:17:48.308917 29160 resources.cpp:572] Parsing resources as JSON failed: cpus:2;gpus:0;mem:1024;disk:1024;ports:[31000-32000]
Trying semicolon-delimited string format instead
I0705 13:17:48.309517 29160 slave.cpp:592] Agent resources: cpus(*):2; mem(*):1024; disk(*):1024;
ports(*):[31000-32000]
I0705 13:17:48.309592 29160 slave.cpp:600] Agent attributes: [  ]
I0705 13:17:48.309604 29160 slave.cpp:605] Agent hostname: 35b73c0e686a
I0705 13:17:48.311192 29167 state.cpp:57] Recovering state from '/tmp/Endpoint_SlaveEndpointTest_UnauthorizedRequest_2_hbyadQ/meta'
I0705 13:17:48.311210 29160 process.cpp:3322] Handling HTTP event for process 'slave(543)'
with path: '/slave(543)/containers'
I0705 13:17:48.311754 29152 status_update_manager.cpp:200] Recovering status update manager
I0705 13:17:48.312080 29153 containerizer.cpp:522] Recovering containerizer
I0705 13:17:48.312227 29167 http.cpp:765] Authorizing principal 'test-principal' to GET the
'/containers' endpoint
I0705 13:17:48.313540 29163 provisioner.cpp:253] Provisioner recovery complete
I0705 13:17:48.313807 29162 slave.cpp:4838] Finished recovery
I0705 13:17:48.314404 29162 slave.cpp:5010] Querying resource estimator for oversubscribable
resources
I0705 13:17:48.314894 29158 slave.cpp:5024] Received oversubscribable resources  from the
resource estimator
I0705 13:17:48.314992 29158 slave.cpp:839] Agent terminating
[       OK ] Endpoint/SlaveEndpointTest.UnauthorizedRequest/2 (21 ms)
[ RUN      ] Endpoint/SlaveEndpointTest.NoAuthorizer/0
I0705 13:17:48.324934 29133 containerizer.cpp:196] Using isolation: posix/cpu,posix/mem,filesystem/posix,network/cni
W0705 13:17:48.325656 29133 backend.cpp:75] Failed to create 'aufs' backend: AufsBackend requires
root privileges, but is running as user mesos
W0705 13:17:48.325857 29133 backend.cpp:75] Failed to create 'bind' backend: BindBackend requires
root privileges
I0705 13:17:48.327316 29133 cluster.cpp:432] Creating default 'local' authorizer
I0705 13:17:48.328996 29159 slave.cpp:203] Agent started on 544)@172.17.0.2:33947
I0705 13:17:48.329023 29159 slave.cpp:204] Flags at startup: --acls="" --appc_simple_discovery_uri_prefix="http://"
--appc_store_dir="/tmp/mesos/store/appc" --authenticate_http="true" --authenticatee="crammd5"
--authorizer="local" --cgroups_cpu_enable_pids_and_tids_count="false" --cgroups_enable_cfs="false"
--cgroups_hierarchy="/sys/fs/cgroup" --cgroups_limit_swap="false" --cgroups_root="mesos" --container_disk_watch_interval="15secs"
--containerizers="mesos" --credential="/tmp/Endpoint_SlaveEndpointTest_NoAuthorizer_0_iL7aph/credential"
--default_role="*" --disk_watch_interval="1mins" --docker="docker" --docker_kill_orphans="true"
--docker_registry="https://registry-1.docker.io" --docker_remove_delay="6hrs" --docker_socket="/var/run/docker.sock"
--docker_stop_timeout="0ns" --docker_store_dir="/tmp/mesos/store/docker" --docker_volume_checkpoint_dir="/var/run/mesos/isolators/docker/volume"
--enforce_container_disk_quota="false" --executor_registration_timeout="1mins" --executor_shutdown_grace_period="5secs"
--fetcher_cache_dir="/tmp/Endpoint_SlaveEndpointTest_NoAuthorizer_0_iL7aph/fetch" --fetcher_cache_size="2GB"
--frameworks_home="" --gc_delay="1weeks" --gc_disk_headroom="0.1" --hadoop_home="" --help="false"
--hostname_lookup="true" --http_authenticators="basic" --http_command_executor="false" --http_credentials="/tmp/Endpoint_SlaveEndpointTest_NoAuthorizer_0_iL7aph/http_credentials"
--image_provisioner_backend="copy" --initialize_driver_logging="true" --isolation="posix/cpu,posix/mem"
--launcher_dir="/mesos/mesos-1.0.0/_build/src" --logbufsecs="0" --logging_level="INFO" --oversubscribed_resources_interval="15secs"
--perf_duration="10secs" --perf_interval="1mins" --qos_correction_interval_min="0ns" --quiet="false"
--recover="reconnect" --recovery_timeout="15mins" --registration_backoff_factor="10ms" --resources="cpus:2;gpus:0;mem:1024;disk:1024;ports:[31000-32000]"
--revocable_cpu_low_priority="true" --sandbox_directory="/mnt/mesos/sandbox" --strict="true"
--switch_user="true" --systemd_enable_support="true" --systemd_runtime_directory="/run/systemd/system"
--version="false" --work_dir="/tmp/Endpoint_SlaveEndpointTest_NoAuthorizer_0_iL7aph"
I0705 13:17:48.329499 29159 credentials.hpp:86] Loading credential for authentication from
'/tmp/Endpoint_SlaveEndpointTest_NoAuthorizer_0_iL7aph/credential'
I0705 13:17:48.329679 29159 slave.cpp:341] Agent using credential for: test-principal
I0705 13:17:48.329708 29159 credentials.hpp:37] Loading credentials for authentication from
'/tmp/Endpoint_SlaveEndpointTest_NoAuthorizer_0_iL7aph/http_credentials'
I0705 13:17:48.329998 29159 slave.cpp:393] Using default 'basic' HTTP authenticator
I0705 13:17:48.330343 29159 resources.cpp:572] Parsing resources as JSON failed: cpus:2;gpus:0;mem:1024;disk:1024;ports:[31000-32000]
Trying semicolon-delimited string format instead
I0705 13:17:48.330662 29159 resources.cpp:572] Parsing resources as JSON failed: cpus:2;gpus:0;mem:1024;disk:1024;ports:[31000-32000]
Trying semicolon-delimited string format instead
I0705 13:17:48.331064 29159 slave.cpp:592] Agent resources: cpus(*):2; mem(*):1024; disk(*):1024;
ports(*):[31000-32000]
I0705 13:17:48.331126 29159 slave.cpp:600] Agent attributes: [  ]
I0705 13:17:48.331137 29159 slave.cpp:605] Agent hostname: 35b73c0e686a
I0705 13:17:48.332489 29156 state.cpp:57] Recovering state from '/tmp/Endpoint_SlaveEndpointTest_NoAuthorizer_0_iL7aph/meta'
I0705 13:17:48.332547 29159 process.cpp:3322] Handling HTTP event for process 'slave(544)'
with path: '/slave(544)/monitor/statistics'
I0705 13:17:48.332996 29152 status_update_manager.cpp:200] Recovering status update manager
I0705 13:17:48.333281 29162 containerizer.cpp:522] Recovering containerizer
I0705 13:17:48.333430 29160 http.cpp:765] Authorizing principal 'test-principal' to GET the
'/monitor/statistics' endpoint
I0705 13:17:48.334425 29152 provisioner.cpp:253] Provisioner recovery complete
I0705 13:17:48.334987 29156 slave.cpp:4838] Finished recovery
I0705 13:17:48.335530 29156 slave.cpp:5010] Querying resource estimator for oversubscribable
resources
I0705 13:17:48.335767 29162 slave.cpp:5024] Received oversubscribable resources  from the
resource estimator
I0705 13:17:48.336989 29167 slave.cpp:839] Agent terminating
[       OK ] Endpoint/SlaveEndpointTest.NoAuthorizer/0 (23 ms)
[ RUN      ] Endpoint/SlaveEndpointTest.NoAuthorizer/1
I0705 13:17:48.348283 29133 containerizer.cpp:196] Using isolation: posix/cpu,posix/mem,filesystem/posix,network/cni
W0705 13:17:48.349140 29133 backend.cpp:75] Failed to create 'aufs' backend: AufsBackend requires
root privileges, but is running as user mesos
W0705 13:17:48.349335 29133 backend.cpp:75] Failed to create 'bind' backend: BindBackend requires
root privileges
I0705 13:17:48.350993 29133 cluster.cpp:432] Creating default 'local' authorizer
I0705 13:17:48.353081 29159 slave.cpp:203] Agent started on 545)@172.17.0.2:33947
I0705 13:17:48.353104 29159 slave.cpp:204] Flags at startup: --acls="" --appc_simple_discovery_uri_prefix="http://"
--appc_store_dir="/tmp/mesos/store/appc" --authenticate_http="true" --authenticatee="crammd5"
--authorizer="local" --cgroups_cpu_enable_pids_and_tids_count="false" --cgroups_enable_cfs="false"
--cgroups_hierarchy="/sys/fs/cgroup" --cgroups_limit_swap="false" --cgroups_root="mesos" --container_disk_watch_interval="15secs"
--containerizers="mesos" --credential="/tmp/Endpoint_SlaveEndpointTest_NoAuthorizer_1_Vmj7LI/credential"
--default_role="*" --disk_watch_interval="1mins" --docker="docker" --docker_kill_orphans="true"
--docker_registry="https://registry-1.docker.io" --docker_remove_delay="6hrs" --docker_socket="/var/run/docker.sock"
--docker_stop_timeout="0ns" --docker_store_dir="/tmp/mesos/store/docker" --docker_volume_checkpoint_dir="/var/run/mesos/isolators/docker/volume"
--enforce_container_disk_quota="false" --executor_registration_timeout="1mins" --executor_shutdown_grace_period="5secs"
--fetcher_cache_dir="/tmp/Endpoint_SlaveEndpointTest_NoAuthorizer_1_Vmj7LI/fetch" --fetcher_cache_size="2GB"
--frameworks_home="" --gc_delay="1weeks" --gc_disk_headroom="0.1" --hadoop_home="" --help="false"
--hostname_lookup="true" --http_authenticators="basic" --http_command_executor="false" --http_credentials="/tmp/Endpoint_SlaveEndpointTest_NoAuthorizer_1_Vmj7LI/http_credentials"
--image_provisioner_backend="copy" --initialize_driver_logging="true" --isolation="posix/cpu,posix/mem"
--launcher_dir="/mesos/mesos-1.0.0/_build/src" --logbufsecs="0" --logging_level="INFO" --oversubscribed_resources_interval="15secs"
--perf_duration="10secs" --perf_interval="1mins" --qos_correction_interval_min="0ns" --quiet="false"
--recover="reconnect" --recovery_timeout="15mins" --registration_backoff_factor="10ms" --resources="cpus:2;gpus:0;mem:1024;disk:1024;ports:[31000-32000]"
--revocable_cpu_low_priority="true" --sandbox_directory="/mnt/mesos/sandbox" --strict="true"
--switch_user="true" --systemd_enable_support="true" --systemd_runtime_directory="/run/systemd/system"
--version="false" --work_dir="/tmp/Endpoint_SlaveEndpointTest_NoAuthorizer_1_Vmj7LI"
I0705 13:17:48.353603 29159 credentials.hpp:86] Loading credential for authentication from
'/tmp/Endpoint_SlaveEndpointTest_NoAuthorizer_1_Vmj7LI/credential'
I0705 13:17:48.353747 29159 slave.cpp:341] Agent using credential for: test-principal
I0705 13:17:48.353785 29159 credentials.hpp:37] Loading credentials for authentication from
'/tmp/Endpoint_SlaveEndpointTest_NoAuthorizer_1_Vmj7LI/http_credentials'
I0705 13:17:48.354035 29159 slave.cpp:393] Using default 'basic' HTTP authenticator
I0705 13:17:48.354406 29159 resources.cpp:572] Parsing resources as JSON failed: cpus:2;gpus:0;mem:1024;disk:1024;ports:[31000-32000]
Trying semicolon-delimited string format instead
I0705 13:17:48.354735 29159 resources.cpp:572] Parsing resources as JSON failed: cpus:2;gpus:0;mem:1024;disk:1024;ports:[31000-32000]
Trying semicolon-delimited string format instead
I0705 13:17:48.355263 29159 slave.cpp:592] Agent resources: cpus(*):2; mem(*):1024; disk(*):1024;
ports(*):[31000-32000]
I0705 13:17:48.355340 29159 slave.cpp:600] Agent attributes: [  ]
I0705 13:17:48.355355 29159 slave.cpp:605] Agent hostname: 35b73c0e686a
I0705 13:17:48.356777 29161 state.cpp:57] Recovering state from '/tmp/Endpoint_SlaveEndpointTest_NoAuthorizer_1_Vmj7LI/meta'
I0705 13:17:48.356838 29159 process.cpp:3322] Handling HTTP event for process 'slave(545)'
with path: '/slave(545)/monitor/statistics.json'
I0705 13:17:48.357404 29163 status_update_manager.cpp:200] Recovering status update manager
I0705 13:17:48.357601 29163 containerizer.cpp:522] Recovering containerizer
I0705 13:17:48.357987 29164 http.cpp:765] Authorizing principal 'test-principal' to GET the
'/monitor/statistics.json' endpoint
I0705 13:17:48.358860 29160 provisioner.cpp:253] Provisioner recovery complete
I0705 13:17:48.359724 29161 slave.cpp:4838] Finished recovery
I0705 13:17:48.360433 29161 slave.cpp:5010] Querying resource estimator for oversubscribable
resources
I0705 13:17:48.360687 29164 slave.cpp:5024] Received oversubscribable resources  from the
resource estimator
I0705 13:17:48.361884 29167 slave.cpp:839] Agent terminating
[       OK ] Endpoint/SlaveEndpointTest.NoAuthorizer/1 (23 ms)
[ RUN      ] Endpoint/SlaveEndpointTest.NoAuthorizer/2
I0705 13:17:48.371827 29133 containerizer.cpp:196] Using isolation: posix/cpu,posix/mem,filesystem/posix,network/cni
W0705 13:17:48.372697 29133 backend.cpp:75] Failed to create 'aufs' backend: AufsBackend requires
root privileges, but is running as user mesos
W0705 13:17:48.372885 29133 backend.cpp:75] Failed to create 'bind' backend: BindBackend requires
root privileges
I0705 13:17:48.374656 29133 cluster.cpp:432] Creating default 'local' authorizer
I0705 13:17:48.376663 29160 slave.cpp:203] Agent started on 546)@172.17.0.2:33947
I0705 13:17:48.376698 29160 slave.cpp:204] Flags at startup: --acls="" --appc_simple_discovery_uri_prefix="http://"
--appc_store_dir="/tmp/mesos/store/appc" --authenticate_http="true" --authenticatee="crammd5"
--authorizer="local" --cgroups_cpu_enable_pids_and_tids_count="false" --cgroups_enable_cfs="false"
--cgroups_hierarchy="/sys/fs/cgroup" --cgroups_limit_swap="false" --cgroups_root="mesos" --container_disk_watch_interval="15secs"
--containerizers="mesos" --credential="/tmp/Endpoint_SlaveEndpointTest_NoAuthorizer_2_xVbIka/credential"
--default_role="*" --disk_watch_interval="1mins" --docker="docker" --docker_kill_orphans="true"
--docker_registry="https://registry-1.docker.io" --docker_remove_delay="6hrs" --docker_socket="/var/run/docker.sock"
--docker_stop_timeout="0ns" --docker_store_dir="/tmp/mesos/store/docker" --docker_volume_checkpoint_dir="/var/run/mesos/isolators/docker/volume"
--enforce_container_disk_quota="false" --executor_registration_timeout="1mins" --executor_shutdown_grace_period="5secs"
--fetcher_cache_dir="/tmp/Endpoint_SlaveEndpointTest_NoAuthorizer_2_xVbIka/fetch" --fetcher_cache_size="2GB"
--frameworks_home="" --gc_delay="1weeks" --gc_disk_headroom="0.1" --hadoop_home="" --help="false"
--hostname_lookup="true" --http_authenticators="basic" --http_command_executor="false" --http_credentials="/tmp/Endpoint_SlaveEndpointTest_NoAuthorizer_2_xVbIka/http_credentials"
--image_provisioner_backend="copy" --initialize_driver_logging="true" --isolation="posix/cpu,posix/mem"
--launcher_dir="/mesos/mesos-1.0.0/_build/src" --logbufsecs="0" --logging_level="INFO" --oversubscribed_resources_interval="15secs"
--perf_duration="10secs" --perf_interval="1mins" --qos_correction_interval_min="0ns" --quiet="false"
--recover="reconnect" --recovery_timeout="15mins" --registration_backoff_factor="10ms" --resources="cpus:2;gpus:0;mem:1024;disk:1024;ports:[31000-32000]"
--revocable_cpu_low_priority="true" --sandbox_directory="/mnt/mesos/sandbox" --strict="true"
--switch_user="true" --systemd_enable_support="true" --systemd_runtime_directory="/run/systemd/system"
--version="false" --work_dir="/tmp/Endpoint_SlaveEndpointTest_NoAuthorizer_2_xVbIka"
I0705 13:17:48.377291 29160 credentials.hpp:86] Loading credential for authentication from
'/tmp/Endpoint_SlaveEndpointTest_NoAuthorizer_2_xVbIka/credential'
I0705 13:17:48.377485 29160 slave.cpp:341] Agent using credential for: test-principal
I0705 13:17:48.377533 29160 credentials.hpp:37] Loading credentials for authentication from
'/tmp/Endpoint_SlaveEndpointTest_NoAuthorizer_2_xVbIka/http_credentials'
I0705 13:17:48.377857 29160 slave.cpp:393] Using default 'basic' HTTP authenticator
I0705 13:17:48.378216 29160 resources.cpp:572] Parsing resources as JSON failed: cpus:2;gpus:0;mem:1024;disk:1024;ports:[31000-32000]
Trying semicolon-delimited string format instead
I0705 13:17:48.378666 29160 resources.cpp:572] Parsing resources as JSON failed: cpus:2;gpus:0;mem:1024;disk:1024;ports:[31000-32000]
Trying semicolon-delimited string format instead
I0705 13:17:48.379178 29160 slave.cpp:592] Agent resources: cpus(*):2; mem(*):1024; disk(*):1024;
ports(*):[31000-32000]
I0705 13:17:48.379323 29160 slave.cpp:600] Agent attributes: [  ]
I0705 13:17:48.379348 29160 slave.cpp:605] Agent hostname: 35b73c0e686a
I0705 13:17:48.380955 29161 state.cpp:57] Recovering state from '/tmp/Endpoint_SlaveEndpointTest_NoAuthorizer_2_xVbIka/meta'
I0705 13:17:48.381016 29160 process.cpp:3322] Handling HTTP event for process 'slave(546)'
with path: '/slave(546)/containers'
I0705 13:17:48.381564 29164 status_update_manager.cpp:200] Recovering status update manager
I0705 13:17:48.381737 29167 containerizer.cpp:522] Recovering containerizer
I0705 13:17:48.382210 29160 http.cpp:765] Authorizing principal 'test-principal' to GET the
'/containers' endpoint
I0705 13:17:48.383191 29167 provisioner.cpp:253] Provisioner recovery complete
I0705 13:17:48.383741 29157 slave.cpp:4838] Finished recovery
I0705 13:17:48.384403 29157 slave.cpp:5010] Querying resource estimator for oversubscribable
resources
I0705 13:17:48.384601 29154 slave.cpp:5024] Received oversubscribable resources  from the
resource estimator
I0705 13:17:48.386607 29154 slave.cpp:839] Agent terminating
[       OK ] Endpoint/SlaveEndpointTest.NoAuthorizer/2 (25 ms)
[----------] 9 tests from Endpoint/SlaveEndpointTest (206 ms total)

[----------] Global test environment tear-down
[==========] 1224 tests from 140 test cases ran. (371358 ms total)
[  PASSED  ] 1223 tests.
[  FAILED  ] 1 test, listed below:
[  FAILED  ] DiskQuotaTest.SlaveRecovery

 1 FAILED TEST
  YOU HAVE 6 DISABLED TESTS

make[4]: *** [check-local] Error 1
make[4]: Leaving directory `/mesos/mesos-1.0.0/_build/src'
make[3]: *** [check-am] Error 2
make[3]: Leaving directory `/mesos/mesos-1.0.0/_build/src'
make[2]: *** [check] Error 2
make[2]: Leaving directory `/mesos/mesos-1.0.0/_build/src'
make[1]: *** [check-recursive] Error 1
make[1]: Leaving directory `/mesos/mesos-1.0.0/_build'
make: *** [distcheck] Error 1
+ docker rmi mesos-1467722805-28219
Untagged: mesos-1467722805-28219:latest
Deleted: 7b6149a5c5cd6e12c00dc1bf61a788634ffdd120d3b7eac3821e3987b948c21f
Deleted: 0f93f46648d46c945f5b00afc2d3cc5609cc643cf446dbbc7a15342bf156b794
Deleted: 7f2859c46fd926fd03aa0c89db00a454067f6fb45f06c7542e9c81ff8a737ce6
Deleted: cd8eb5923fb45993107459581436ec4c4ea3e9e799af969892fddc537c732eaf
Deleted: 44d5cf76238bce974974dad8c8cbe6ebe5ac67241a7d8eed21f9aa646ef8ed40
Deleted: 75fceefca3bc782823d6622dc7f754c625c0f0d42cd28215281c55c8a3d5e40b
Deleted: 7e51b10fa386043622f872e18dd47fd837ea08c0d5989858e27f3b830659a2c4
Deleted: 81843532f91870dabcd72479ca79cf1f88e44c3c2b39bb366e788495e2b471fe
Deleted: 25615f56ee0a0cdabc911537e127828a6b7331dae252d39ce945e005973e26c3
Deleted: a80ad84401a32f489df0e34f07e77aad6f4a1739144c140da727d4160aae6781
Deleted: 8e018e9278091d50e88247045ad1d135c4acbfe1e9c4788913b7e71c5bc5d825
Deleted: bcf370bd9d433bde98a0cc7982e46ee5bc070ea104a0a224d573539b922620f3
Deleted: d667dfe655cfcaf3e80dd47e6f13fb6ca65db61ffc80a416d499eb86109c7014
Deleted: 5c259d286fd2eb030d33e607a78a007e4859ddc909bd60b6636197c1579ee2dc
Deleted: f676a78c4e8d06fab27e945d1388f345a5adbce9c4c41cf6ed44ccc9128cf2cd
Deleted: 9a8260c65c8b67e27df16e3b4c692aa1ccb810c462b9797fffd340c30ed3fc20
Build step 'Execute shell' marked build as failure

Mime
View raw message