mesos-builds mailing list archives

Site index · List index
Message view « Date » · « Thread »
Top « Date » · « Thread »
From Apache Jenkins Server <jenk...@builds.apache.org>
Subject Build failed in Jenkins: Mesos » autotools,gcc,--verbose --enable-libevent --enable-ssl,GLOG_v=1 MESOS_VERBOSE=1,ubuntu:14.04,(docker||Hadoop)&&(!ubuntu-us1)&&(!ubuntu-6) #2452
Date Wed, 06 Jul 2016 06:14:13 GMT
See <https://builds.apache.org/job/Mesos/BUILDTOOL=autotools,COMPILER=gcc,CONFIGURATION=--verbose%20--enable-libevent%20--enable-ssl,ENVIRONMENT=GLOG_v=1%20MESOS_VERBOSE=1,OS=ubuntu%3A14.04,label_exp=(docker%7C%7CHadoop)&&(!ubuntu-us1)&&(!ubuntu-6)/2452/changes>

Changes:

[anand] Refactored 'Master::Http::getTasks()' into helper function.

[anand] Refactored 'Master::Http::getAgents()' into helper function.

[anand] Refactored 'master::Http::getFrameworks()' to helper function.

[anand] Revised protobuf definition of 'GetState' response.

[anand] Refactored 'Master::Http::getExecutors()' into helper function.

[anand] Implemented 'GetState' call in v1 master API.

[anand] Implemented 'Subscribed' event for v1 master event stream.

------------------------------------------
[...truncated 11453 lines...]
[       OK ] SystemsTests.Sysname (0 ms)
[ RUN      ] SystemsTests.Release
[       OK ] SystemsTests.Release (0 ms)
[----------] 3 tests from SystemsTests (0 ms total)

[----------] 6 tests from PathTest
[ RUN      ] PathTest.Basename
[       OK ] PathTest.Basename (0 ms)
[ RUN      ] PathTest.Dirname
[       OK ] PathTest.Dirname (0 ms)
[ RUN      ] PathTest.Extension
[       OK ] PathTest.Extension (0 ms)
[ RUN      ] PathTest.Join
[       OK ] PathTest.Join (0 ms)
[ RUN      ] PathTest.Absolute
[       OK ] PathTest.Absolute (0 ms)
[ RUN      ] PathTest.Comparison
[       OK ] PathTest.Comparison (0 ms)
[----------] 6 tests from PathTest (0 ms total)

[----------] 1 test from PathFileTest
[ RUN      ] PathFileTest.ImplicitConversion
[       OK ] PathFileTest.ImplicitConversion (0 ms)
[----------] 1 test from PathFileTest (1 ms total)

[----------] 10 tests from ProtobufTest
[ RUN      ] ProtobufTest.JSON
[       OK ] ProtobufTest.JSON (1 ms)
[ RUN      ] ProtobufTest.JSONArray
[       OK ] ProtobufTest.JSONArray (0 ms)
[ RUN      ] ProtobufTest.JsonLargeIntegers
[       OK ] ProtobufTest.JsonLargeIntegers (0 ms)
[ RUN      ] ProtobufTest.SimpleMessageEquals
[       OK ] ProtobufTest.SimpleMessageEquals (0 ms)
[ RUN      ] ProtobufTest.ParseJSONArray
[       OK ] ProtobufTest.ParseJSONArray (0 ms)
[ RUN      ] ProtobufTest.ParseJSONNull
[       OK ] ProtobufTest.ParseJSONNull (0 ms)
[ RUN      ] ProtobufTest.ParseJSONNestedError
[       OK ] ProtobufTest.ParseJSONNestedError (0 ms)
[ RUN      ] ProtobufTest.Jsonify
[       OK ] ProtobufTest.Jsonify (1 ms)
[ RUN      ] ProtobufTest.JsonifyArray
[       OK ] ProtobufTest.JsonifyArray (0 ms)
[ RUN      ] ProtobufTest.JsonifyLargeIntegers
[       OK ] ProtobufTest.JsonifyLargeIntegers (0 ms)
[----------] 10 tests from ProtobufTest (3 ms total)

[----------] 2 tests from RecordIOTest
[ RUN      ] RecordIOTest.Encoder
[       OK ] RecordIOTest.Encoder (0 ms)
[ RUN      ] RecordIOTest.Decoder
[       OK ] RecordIOTest.Decoder (0 ms)
[----------] 2 tests from RecordIOTest (0 ms total)

[----------] 2 tests from ResultTest
[ RUN      ] ResultTest.TryToResultConversion
[       OK ] ResultTest.TryToResultConversion (0 ms)
[ RUN      ] ResultTest.ArrowOperator
[       OK ] ResultTest.ArrowOperator (0 ms)
[----------] 2 tests from ResultTest (0 ms total)

[----------] 1 test from SetTest
[ RUN      ] SetTest.Set
[       OK ] SetTest.Set (0 ms)
[----------] 1 test from SetTest (0 ms total)

[----------] 1 test from SomeTest
[ RUN      ] SomeTest.Some
[       OK ] SomeTest.Some (0 ms)
[----------] 1 test from SomeTest (0 ms total)

[----------] 39 tests from StringsTest
[ RUN      ] StringsTest.Format
[       OK ] StringsTest.Format (0 ms)
[ RUN      ] StringsTest.Remove
[       OK ] StringsTest.Remove (0 ms)
[ RUN      ] StringsTest.Replace
[       OK ] StringsTest.Replace (0 ms)
[ RUN      ] StringsTest.Trim
[       OK ] StringsTest.Trim (0 ms)
[ RUN      ] StringsTest.Tokenize
[       OK ] StringsTest.Tokenize (0 ms)
[ RUN      ] StringsTest.TokenizeStringWithDelimsAtStart
[       OK ] StringsTest.TokenizeStringWithDelimsAtStart (0 ms)
[ RUN      ] StringsTest.TokenizeStringWithDelimsAtEnd
[       OK ] StringsTest.TokenizeStringWithDelimsAtEnd (0 ms)
[ RUN      ] StringsTest.TokenizeStringWithDelimsAtStartAndEnd
[       OK ] StringsTest.TokenizeStringWithDelimsAtStartAndEnd (0 ms)
[ RUN      ] StringsTest.TokenizeWithMultipleDelims
[       OK ] StringsTest.TokenizeWithMultipleDelims (0 ms)
[ RUN      ] StringsTest.TokenizeEmptyString
[       OK ] StringsTest.TokenizeEmptyString (0 ms)
[ RUN      ] StringsTest.TokenizeDelimOnlyString
[       OK ] StringsTest.TokenizeDelimOnlyString (0 ms)
[ RUN      ] StringsTest.TokenizeNullByteDelim
[       OK ] StringsTest.TokenizeNullByteDelim (0 ms)
[ RUN      ] StringsTest.TokenizeNZero
[       OK ] StringsTest.TokenizeNZero (0 ms)
[ RUN      ] StringsTest.TokenizeNOne
[       OK ] StringsTest.TokenizeNOne (0 ms)
[ RUN      ] StringsTest.TokenizeNDelimOnlyString
[       OK ] StringsTest.TokenizeNDelimOnlyString (0 ms)
[ RUN      ] StringsTest.TokenizeN
[       OK ] StringsTest.TokenizeN (0 ms)
[ RUN      ] StringsTest.TokenizeNStringWithDelimsAtStart
[       OK ] StringsTest.TokenizeNStringWithDelimsAtStart (0 ms)
[ RUN      ] StringsTest.TokenizeNStringWithDelimsAtEnd
[       OK ] StringsTest.TokenizeNStringWithDelimsAtEnd (0 ms)
[ RUN      ] StringsTest.TokenizeNStringWithDelimsAtStartAndEnd
[       OK ] StringsTest.TokenizeNStringWithDelimsAtStartAndEnd (0 ms)
[ RUN      ] StringsTest.TokenizeNWithMultipleDelims
[       OK ] StringsTest.TokenizeNWithMultipleDelims (0 ms)
[ RUN      ] StringsTest.SplitEmptyString
[       OK ] StringsTest.SplitEmptyString (0 ms)
[ RUN      ] StringsTest.SplitDelimOnlyString
[       OK ] StringsTest.SplitDelimOnlyString (0 ms)
[ RUN      ] StringsTest.Split
[       OK ] StringsTest.Split (0 ms)
[ RUN      ] StringsTest.SplitStringWithDelimsAtStart
[       OK ] StringsTest.SplitStringWithDelimsAtStart (0 ms)
[ RUN      ] StringsTest.SplitStringWithDelimsAtEnd
[       OK ] StringsTest.SplitStringWithDelimsAtEnd (0 ms)
[ RUN      ] StringsTest.SplitStringWithDelimsAtStartAndEnd
[       OK ] StringsTest.SplitStringWithDelimsAtStartAndEnd (0 ms)
[ RUN      ] StringsTest.SplitWithMultipleDelims
[       OK ] StringsTest.SplitWithMultipleDelims (0 ms)
[ RUN      ] StringsTest.SplitNZero
[       OK ] StringsTest.SplitNZero (0 ms)
[ RUN      ] StringsTest.SplitNOne
[       OK ] StringsTest.SplitNOne (0 ms)
[ RUN      ] StringsTest.SplitNDelimOnlyString
[       OK ] StringsTest.SplitNDelimOnlyString (0 ms)
[ RUN      ] StringsTest.SplitN
[       OK ] StringsTest.SplitN (0 ms)
[ RUN      ] StringsTest.SplitNStringWithDelimsAtStart
[       OK ] StringsTest.SplitNStringWithDelimsAtStart (0 ms)
[ RUN      ] StringsTest.SplitNStringWithDelimsAtEnd
[       OK ] StringsTest.SplitNStringWithDelimsAtEnd (0 ms)
[ RUN      ] StringsTest.SplitNStringWithDelimsAtStartAndEnd
[       OK ] StringsTest.SplitNStringWithDelimsAtStartAndEnd (0 ms)
[ RUN      ] StringsTest.SplitNWithMultipleDelims
[       OK ] StringsTest.SplitNWithMultipleDelims (0 ms)
[ RUN      ] StringsTest.Pairs
[       OK ] StringsTest.Pairs (0 ms)
[ RUN      ] StringsTest.Join
[       OK ] StringsTest.Join (0 ms)
[ RUN      ] StringsTest.StartsWith
[       OK ] StringsTest.StartsWith (0 ms)
[ RUN      ] StringsTest.Contains
[       OK ] StringsTest.Contains (0 ms)
[----------] 39 tests from StringsTest (0 ms total)

[----------] 2 tests from SubcommandTest
[ RUN      ] SubcommandTest.Flags
[       OK ] SubcommandTest.Flags (1 ms)
[ RUN      ] SubcommandTest.Dispatch
Subcommand 'subcommand' is not available
Usage: command <subcommand> [OPTIONS]

Available subcommands:
    help
    subcommand2

Multiple subcommands have name 'subcommand'
[       OK ] SubcommandTest.Dispatch (0 ms)
[----------] 2 tests from SubcommandTest (1 ms total)

[----------] 2 tests from SVNTest
[ RUN      ] SVNTest.DiffPatch
[       OK ] SVNTest.DiffPatch (40 ms)
[ RUN      ] SVNTest.EmptyDiffPatch
[       OK ] SVNTest.EmptyDiffPatch (38 ms)
[----------] 2 tests from SVNTest (78 ms total)

[----------] 1 test from TryTest
[ RUN      ] TryTest.ArrowOperator
[       OK ] TryTest.ArrowOperator (0 ms)
[----------] 1 test from TryTest (0 ms total)

[----------] 2 tests from UUIDTest
[ RUN      ] UUIDTest.Test
[       OK ] UUIDTest.Test (0 ms)
[ RUN      ] UUIDTest.MalformedUUID
[       OK ] UUIDTest.MalformedUUID (0 ms)
[----------] 2 tests from UUIDTest (0 ms total)

[----------] 2 tests from VersionTest
[ RUN      ] VersionTest.Comparison
[       OK ] VersionTest.Comparison (0 ms)
[ RUN      ] VersionTest.Parse
[       OK ] VersionTest.Parse (0 ms)
[----------] 2 tests from VersionTest (0 ms total)

[----------] 6 tests from ProcTest
[ RUN      ] ProcTest.Pids
[       OK ] ProcTest.Pids (1 ms)
[ RUN      ] ProcTest.Cpus
[       OK ] ProcTest.Cpus (1 ms)
[ RUN      ] ProcTest.SystemStatus
[       OK ] ProcTest.SystemStatus (0 ms)
[ RUN      ] ProcTest.ProcessStatus
[       OK ] ProcTest.ProcessStatus (0 ms)
[ RUN      ] ProcTest.SingleThread
[       OK ] ProcTest.SingleThread (0 ms)
[ RUN      ] ProcTest.MultipleThreads
[       OK ] ProcTest.MultipleThreads (1 ms)
[----------] 6 tests from ProcTest (3 ms total)

[----------] Global test environment tear-down
[==========] 269 tests from 47 test cases ran. (369 ms total)
[  PASSED  ] 268 tests.
[  FAILED  ] 1 test, listed below:
[  FAILED  ] JsonTest.Find

 1 FAILED TEST
make[7]: *** [check-local] Error 1
make[7]: Leaving directory `/mesos/mesos-1.0.0/_build/3rdparty/stout'
make[6]: *** [check-am] Error 2
make[6]: Leaving directory `/mesos/mesos-1.0.0/_build/3rdparty/stout'
make[5]: *** [check-recursive] Error 1
make[5]: Leaving directory `/mesos/mesos-1.0.0/_build/3rdparty/stout'
make[4]: *** [check] Error 2
make[4]: Leaving directory `/mesos/mesos-1.0.0/_build/3rdparty/stout'
make[3]: Leaving directory `/mesos/mesos-1.0.0/_build/3rdparty'
make[2]: Leaving directory `/mesos/mesos-1.0.0/_build/3rdparty'
make[3]: *** [check-recursive] Error 1
make[2]: *** [check] Error 2
make[1]: *** [check-recursive] Error 1
make[1]: Leaving directory `/mesos/mesos-1.0.0/_build'
make: *** [distcheck] Error 1
+ docker rmi mesos-1467784627-27342
Untagged: mesos-1467784627-27342:latest
Deleted: 7be156811efc5df1aaeb73c48baaea7aefff146342cfc1fc164478c793a0d8c0
Deleted: 4f88a33ea4f351506975bfab134949f8c29a928b4e19fe956517011b6f89d23c
Deleted: 502412e3c30ec6b1690f7505e0227a67f2dc3f12737557141c6f81be273f8786
Deleted: 5f1f90a093feceb0835a0874cdcb25b823507c4d8dec58f5a709157800122b99
Deleted: 010ce641f1abcfc6549e67747c52a69cb465a7f6230d7028dd14359bd1fc3af1
Deleted: 62178709d8caa570cd585753587112acf7d07d5950a27e5d890a3e5febe46125
Deleted: 61d0eafa7e5ece6fb4a7183f68612fde92d45b54666593d2b674291b877ddd78
Deleted: ea2647369dbb564747990532b9a6bd7a6ed9b2790769830fe2ace9c739c57e95
Deleted: 97a065486d4c39a3616e91f45d818c3cabc17008d60aacb50d77d8bf4beda434
Deleted: 50136c4c30ba1931ffe5fde3ce35f6a76bc6b3e38a39b0dde9dc273ad41f11f0
Deleted: 961b2e26bd68c649e62537b96c47b8e7518f0692dae69e501e40815e5b1a72a6
Deleted: d2115a288e8c65a88b6ca81a4baa4af5f1e15d996d5ca4034bbd2f55ce5a52bc
Deleted: a9a45b9e59a8d8a5677c7776ac0c2e780ce85647e51006193fd063c75a3c5643
Deleted: 33c7dfa2482153a63a9d31f68a2827626984d4998eb941407afe5ccd97ea3c76
Deleted: 45079208a6de5406bd383e4f55349a00efa7b75320ab63f87cbc0fc5909db4e1
Build step 'Execute shell' marked build as failure

Mime
View raw message