mesos-builds mailing list archives

Site index · List index
Message view « Date » · « Thread »
Top « Date » · « Thread »
From Apache Jenkins Server <jenk...@builds.apache.org>
Subject Build failed in Jenkins: Mesos » autotools,gcc,--verbose --enable-libevent --enable-ssl,GLOG_v=1 MESOS_VERBOSE=1,ubuntu:14.04,(docker||Hadoop)&&(!ubuntu-us1)&&(!ubuntu-6) #2456
Date Wed, 06 Jul 2016 19:02:27 GMT
See <https://builds.apache.org/job/Mesos/BUILDTOOL=autotools,COMPILER=gcc,CONFIGURATION=--verbose%20--enable-libevent%20--enable-ssl,ENVIRONMENT=GLOG_v=1%20MESOS_VERBOSE=1,OS=ubuntu%3A14.04,label_exp=(docker%7C%7CHadoop)&&(!ubuntu-us1)&&(!ubuntu-6)/2456/changes>

Changes:

[kapil] Updated docs to reflect contender and detector modules.

[vinodkone] Removed CHECK from orphan_task filtering.

[vinodkone] Renamed incorrect variable name in authorization tests.

[vinodkone] Changed name of authorization test.

[vinodkone] Added test to check orphaned tasks are filtered.

------------------------------------------
[...truncated 195750 lines...]
I0706 19:02:27.880400 29441 slave.cpp:600] Agent attributes: [  ]
I0706 19:02:27.880411 29441 slave.cpp:605] Agent hostname: 1de645f4e05d
I0706 19:02:27.881603 29450 state.cpp:57] Recovering state from '/tmp/Endpoint_SlaveEndpointTest_AuthorizedRequest_1_8UjSd6/meta'
I0706 19:02:27.881644 29441 process.cpp:3322] Handling HTTP event for process 'slave(546)'
with path: '/slave(546)/monitor/statistics.json'
I0706 19:02:27.882153 29448 status_update_manager.cpp:200] Recovering status update manager
I0706 19:02:27.882405 29441 containerizer.cpp:522] Recovering containerizer
I0706 19:02:27.882758 29440 http.cpp:765] Authorizing principal 'test-principal' to GET the
'/monitor/statistics.json' endpoint
I0706 19:02:27.883641 29439 provisioner.cpp:253] Provisioner recovery complete
I0706 19:02:27.884258 29440 slave.cpp:4839] Finished recovery
I0706 19:02:27.884779 29440 slave.cpp:5011] Querying resource estimator for oversubscribable
resources
I0706 19:02:27.885030 29440 slave.cpp:5025] Received oversubscribable resources  from the
resource estimator
I0706 19:02:27.886026 29442 slave.cpp:839] Agent terminating
[       OK ] Endpoint/SlaveEndpointTest.AuthorizedRequest/1 (18 ms)
[ RUN      ] Endpoint/SlaveEndpointTest.AuthorizedRequest/2
I0706 19:02:27.894706 29420 containerizer.cpp:196] Using isolation: posix/cpu,posix/mem,filesystem/posix,network/cni
W0706 19:02:27.895556 29420 backend.cpp:75] Failed to create 'aufs' backend: AufsBackend requires
root privileges, but is running as user mesos
W0706 19:02:27.895732 29420 backend.cpp:75] Failed to create 'bind' backend: BindBackend requires
root privileges
I0706 19:02:27.898775 29439 slave.cpp:203] Agent started on 547)@172.17.0.2:51937
I0706 19:02:27.898798 29439 slave.cpp:204] Flags at startup: --acls="" --appc_simple_discovery_uri_prefix="http://"
--appc_store_dir="/tmp/mesos/store/appc" --authenticate_http="true" --authenticatee="crammd5"
--authorizer="local" --cgroups_cpu_enable_pids_and_tids_count="false" --cgroups_enable_cfs="false"
--cgroups_hierarchy="/sys/fs/cgroup" --cgroups_limit_swap="false" --cgroups_root="mesos" --container_disk_watch_interval="15secs"
--containerizers="mesos" --credential="/tmp/Endpoint_SlaveEndpointTest_AuthorizedRequest_2_YwihTZ/credential"
--default_role="*" --disk_watch_interval="1mins" --docker="docker" --docker_kill_orphans="true"
--docker_registry="https://registry-1.docker.io" --docker_remove_delay="6hrs" --docker_socket="/var/run/docker.sock"
--docker_stop_timeout="0ns" --docker_store_dir="/tmp/mesos/store/docker" --docker_volume_checkpoint_dir="/var/run/mesos/isolators/docker/volume"
--enforce_container_disk_quota="false" --executor_registration_timeout="1mins" --executor_shutdown_grace_period="5secs"
--fetcher_cache_dir="/tmp/Endpoint_SlaveEndpointTest_AuthorizedRequest_2_YwihTZ/fetch" --fetcher_cache_size="2GB"
--frameworks_home="" --gc_delay="1weeks" --gc_disk_headroom="0.1" --hadoop_home="" --help="true"
--hostname_lookup="true" --http_authenticators="basic" --http_command_executor="false" --http_credentials="/tmp/Endpoint_SlaveEndpointTest_AuthorizedRequest_2_YwihTZ/http_credentials"
--image_provisioner_backend="copy" --initialize_driver_logging="true" --isolation="posix/cpu,posix/mem"
--launcher_dir="/mesos/mesos-1.0.0/_build/src" --logbufsecs="0" --logging_level="INFO" --oversubscribed_resources_interval="15secs"
--perf_duration="10secs" --perf_interval="1mins" --qos_correction_interval_min="0ns" --quiet="false"
--recover="reconnect" --recovery_timeout="15mins" --registration_backoff_factor="10ms" --resources="cpus:2;gpus:0;mem:1024;disk:1024;ports:[31000-32000]"
--revocable_cpu_low_priority="true" --sandbox_directory="/mnt/mesos/sandbox" --strict="true"
--switch_user="true" --systemd_enable_support="true" --systemd_runtime_directory="/run/systemd/system"
--version="false" --work_dir="/tmp/Endpoint_SlaveEndpointTest_AuthorizedRequest_2_YwihTZ"
I0706 19:02:27.899349 29439 credentials.hpp:86] Loading credential for authentication from
'/tmp/Endpoint_SlaveEndpointTest_AuthorizedRequest_2_YwihTZ/credential'
I0706 19:02:27.899557 29439 slave.cpp:341] Agent using credential for: test-principal
I0706 19:02:27.899605 29439 credentials.hpp:37] Loading credentials for authentication from
'/tmp/Endpoint_SlaveEndpointTest_AuthorizedRequest_2_YwihTZ/http_credentials'
I0706 19:02:27.899920 29439 slave.cpp:393] Using default 'basic' HTTP authenticator
I0706 19:02:27.900308 29439 resources.cpp:572] Parsing resources as JSON failed: cpus:2;gpus:0;mem:1024;disk:1024;ports:[31000-32000]
Trying semicolon-delimited string format instead
I0706 19:02:27.900662 29439 resources.cpp:572] Parsing resources as JSON failed: cpus:2;gpus:0;mem:1024;disk:1024;ports:[31000-32000]
Trying semicolon-delimited string format instead
I0706 19:02:27.901167 29439 slave.cpp:592] Agent resources: cpus(*):2; mem(*):1024; disk(*):1024;
ports(*):[31000-32000]
I0706 19:02:27.901247 29439 slave.cpp:600] Agent attributes: [  ]
I0706 19:02:27.901269 29439 slave.cpp:605] Agent hostname: 1de645f4e05d
I0706 19:02:27.902760 29441 state.cpp:57] Recovering state from '/tmp/Endpoint_SlaveEndpointTest_AuthorizedRequest_2_YwihTZ/meta'
I0706 19:02:27.902786 29439 process.cpp:3322] Handling HTTP event for process 'slave(547)'
with path: '/slave(547)/containers'
I0706 19:02:27.903383 29454 status_update_manager.cpp:200] Recovering status update manager
I0706 19:02:27.903619 29442 containerizer.cpp:522] Recovering containerizer
I0706 19:02:27.903756 29451 http.cpp:765] Authorizing principal 'test-principal' to GET the
'/containers' endpoint
I0706 19:02:27.905294 29448 provisioner.cpp:253] Provisioner recovery complete
I0706 19:02:27.905664 29451 slave.cpp:4839] Finished recovery
I0706 19:02:27.906154 29451 slave.cpp:5011] Querying resource estimator for oversubscribable
resources
I0706 19:02:27.906535 29446 slave.cpp:5025] Received oversubscribable resources  from the
resource estimator
I0706 19:02:27.906597 29446 slave.cpp:839] Agent terminating
[       OK ] Endpoint/SlaveEndpointTest.AuthorizedRequest/2 (21 ms)
[ RUN      ] Endpoint/SlaveEndpointTest.UnauthorizedRequest/0
I0706 19:02:27.916574 29420 containerizer.cpp:196] Using isolation: posix/cpu,posix/mem,filesystem/posix,network/cni
W0706 19:02:27.917362 29420 backend.cpp:75] Failed to create 'aufs' backend: AufsBackend requires
root privileges, but is running as user mesos
W0706 19:02:27.917518 29420 backend.cpp:75] Failed to create 'bind' backend: BindBackend requires
root privileges
I0706 19:02:27.920755 29454 slave.cpp:203] Agent started on 548)@172.17.0.2:51937
I0706 19:02:27.920778 29454 slave.cpp:204] Flags at startup: --acls="" --appc_simple_discovery_uri_prefix="http://"
--appc_store_dir="/tmp/mesos/store/appc" --authenticate_http="true" --authenticatee="crammd5"
--authorizer="local" --cgroups_cpu_enable_pids_and_tids_count="false" --cgroups_enable_cfs="false"
--cgroups_hierarchy="/sys/fs/cgroup" --cgroups_limit_swap="false" --cgroups_root="mesos" --container_disk_watch_interval="15secs"
--containerizers="mesos" --credential="/tmp/Endpoint_SlaveEndpointTest_UnauthorizedRequest_0_SOOiJT/credential"
--default_role="*" --disk_watch_interval="1mins" --docker="docker" --docker_kill_orphans="true"
--docker_registry="https://registry-1.docker.io" --docker_remove_delay="6hrs" --docker_socket="/var/run/docker.sock"
--docker_stop_timeout="0ns" --docker_store_dir="/tmp/mesos/store/docker" --docker_volume_checkpoint_dir="/var/run/mesos/isolators/docker/volume"
--enforce_container_disk_quota="false" --executor_registration_timeout="1mins" --executor_shutdown_grace_period="5secs"
--fetcher_cache_dir="/tmp/Endpoint_SlaveEndpointTest_UnauthorizedRequest_0_SOOiJT/fetch" --fetcher_cache_size="2GB"
--frameworks_home="" --gc_delay="1weeks" --gc_disk_headroom="0.1" --hadoop_home="" --help="true"
--hostname_lookup="true" --http_authenticators="basic" --http_command_executor="false" --http_credentials="/tmp/Endpoint_SlaveEndpointTest_UnauthorizedRequest_0_SOOiJT/http_credentials"
--image_provisioner_backend="copy" --initialize_driver_logging="true" --isolation="posix/cpu,posix/mem"
--launcher_dir="/mesos/mesos-1.0.0/_build/src" --logbufsecs="0" --logging_level="INFO" --oversubscribed_resources_interval="15secs"
--perf_duration="10secs" --perf_interval="1mins" --qos_correction_interval_min="0ns" --quiet="false"
--recover="reconnect" --recovery_timeout="15mins" --registration_backoff_factor="10ms" --resources="cpus:2;gpus:0;mem:1024;disk:1024;ports:[31000-32000]"
--revocable_cpu_low_priority="true" --sandbox_directory="/mnt/mesos/sandbox" --strict="true"
--switch_user="true" --systemd_enable_support="true" --systemd_runtime_directory="/run/systemd/system"
--version="false" --work_dir="/tmp/Endpoint_SlaveEndpointTest_UnauthorizedRequest_0_SOOiJT"
I0706 19:02:27.921283 29454 credentials.hpp:86] Loading credential for authentication from
'/tmp/Endpoint_SlaveEndpointTest_UnauthorizedRequest_0_SOOiJT/credential'
I0706 19:02:27.921540 29454 slave.cpp:341] Agent using credential for: test-principal
I0706 19:02:27.921582 29454 credentials.hpp:37] Loading credentials for authentication from
'/tmp/Endpoint_SlaveEndpointTest_UnauthorizedRequest_0_SOOiJT/http_credentials'
I0706 19:02:27.921836 29454 slave.cpp:393] Using default 'basic' HTTP authenticator
I0706 19:02:27.922276 29454 resources.cpp:572] Parsing resources as JSON failed: cpus:2;gpus:0;mem:1024;disk:1024;ports:[31000-32000]
Trying semicolon-delimited string format instead
I0706 19:02:27.922829 29454 resources.cpp:572] Parsing resources as JSON failed: cpus:2;gpus:0;mem:1024;disk:1024;ports:[31000-32000]
Trying semicolon-delimited string format instead
I0706 19:02:27.923311 29454 slave.cpp:592] Agent resources: cpus(*):2; mem(*):1024; disk(*):1024;
ports(*):[31000-32000]
I0706 19:02:27.923387 29454 slave.cpp:600] Agent attributes: [  ]
I0706 19:02:27.923400 29454 slave.cpp:605] Agent hostname: 1de645f4e05d
I0706 19:02:27.925017 29444 state.cpp:57] Recovering state from '/tmp/Endpoint_SlaveEndpointTest_UnauthorizedRequest_0_SOOiJT/meta'
I0706 19:02:27.925096 29454 process.cpp:3322] Handling HTTP event for process 'slave(548)'
with path: '/slave(548)/monitor/statistics'
I0706 19:02:27.925617 29445 status_update_manager.cpp:200] Recovering status update manager
I0706 19:02:27.925763 29448 containerizer.cpp:522] Recovering containerizer
I0706 19:02:27.926085 29446 http.cpp:765] Authorizing principal 'test-principal' to GET the
'/monitor/statistics' endpoint
I0706 19:02:27.927013 29439 provisioner.cpp:253] Provisioner recovery complete
I0706 19:02:27.927341 29445 slave.cpp:4839] Finished recovery
I0706 19:02:27.928200 29445 slave.cpp:5011] Querying resource estimator for oversubscribable
resources
I0706 19:02:27.928445 29453 slave.cpp:5025] Received oversubscribable resources  from the
resource estimator
I0706 19:02:27.928622 29453 slave.cpp:839] Agent terminating
[       OK ] Endpoint/SlaveEndpointTest.UnauthorizedRequest/0 (20 ms)
[ RUN      ] Endpoint/SlaveEndpointTest.UnauthorizedRequest/1
I0706 19:02:27.936164 29420 containerizer.cpp:196] Using isolation: posix/cpu,posix/mem,filesystem/posix,network/cni
W0706 19:02:27.936821 29420 backend.cpp:75] Failed to create 'aufs' backend: AufsBackend requires
root privileges, but is running as user mesos
W0706 19:02:27.936970 29420 backend.cpp:75] Failed to create 'bind' backend: BindBackend requires
root privileges
I0706 19:02:27.939826 29446 slave.cpp:203] Agent started on 549)@172.17.0.2:51937
I0706 19:02:27.939851 29446 slave.cpp:204] Flags at startup: --acls="" --appc_simple_discovery_uri_prefix="http://"
--appc_store_dir="/tmp/mesos/store/appc" --authenticate_http="true" --authenticatee="crammd5"
--authorizer="local" --cgroups_cpu_enable_pids_and_tids_count="false" --cgroups_enable_cfs="false"
--cgroups_hierarchy="/sys/fs/cgroup" --cgroups_limit_swap="false" --cgroups_root="mesos" --container_disk_watch_interval="15secs"
--containerizers="mesos" --credential="/tmp/Endpoint_SlaveEndpointTest_UnauthorizedRequest_1_aSJvJN/credential"
--default_role="*" --disk_watch_interval="1mins" --docker="docker" --docker_kill_orphans="true"
--docker_registry="https://registry-1.docker.io" --docker_remove_delay="6hrs" --docker_socket="/var/run/docker.sock"
--docker_stop_timeout="0ns" --docker_store_dir="/tmp/mesos/store/docker" --docker_volume_checkpoint_dir="/var/run/mesos/isolators/docker/volume"
--enforce_container_disk_quota="false" --executor_registration_timeout="1mins" --executor_shutdown_grace_period="5secs"
--fetcher_cache_dir="/tmp/Endpoint_SlaveEndpointTest_UnauthorizedRequest_1_aSJvJN/fetch" --fetcher_cache_size="2GB"
--frameworks_home="" --gc_delay="1weeks" --gc_disk_headroom="0.1" --hadoop_home="" --help="true"
--hostname_lookup="true" --http_authenticators="basic" --http_command_executor="false" --http_credentials="/tmp/Endpoint_SlaveEndpointTest_UnauthorizedRequest_1_aSJvJN/http_credentials"
--image_provisioner_backend="copy" --initialize_driver_logging="true" --isolation="posix/cpu,posix/mem"
--launcher_dir="/mesos/mesos-1.0.0/_build/src" --logbufsecs="0" --logging_level="INFO" --oversubscribed_resources_interval="15secs"
--perf_duration="10secs" --perf_interval="1mins" --qos_correction_interval_min="0ns" --quiet="false"
--recover="reconnect" --recovery_timeout="15mins" --registration_backoff_factor="10ms" --resources="cpus:2;gpus:0;mem:1024;disk:1024;ports:[31000-32000]"
--revocable_cpu_low_priority="true" --sandbox_directory="/mnt/mesos/sandbox" --strict="true"
--switch_user="true" --systemd_enable_support="true" --systemd_runtime_directory="/run/systemd/system"
--version="false" --work_dir="/tmp/Endpoint_SlaveEndpointTest_UnauthorizedRequest_1_aSJvJN"
I0706 19:02:27.940451 29446 credentials.hpp:86] Loading credential for authentication from
'/tmp/Endpoint_SlaveEndpointTest_UnauthorizedRequest_1_aSJvJN/credential'
I0706 19:02:27.940618 29446 slave.cpp:341] Agent using credential for: test-principal
I0706 19:02:27.940685 29446 credentials.hpp:37] Loading credentials for authentication from
'/tmp/Endpoint_SlaveEndpointTest_UnauthorizedRequest_1_aSJvJN/http_credentials'
I0706 19:02:27.940973 29446 slave.cpp:393] Using default 'basic' HTTP authenticator
I0706 19:02:27.941275 29446 resources.cpp:572] Parsing resources as JSON failed: cpus:2;gpus:0;mem:1024;disk:1024;ports:[31000-32000]
Trying semicolon-delimited string format instead
I0706 19:02:27.941630 29446 resources.cpp:572] Parsing resources as JSON failed: cpus:2;gpus:0;mem:1024;disk:1024;ports:[31000-32000]
Trying semicolon-delimited string format instead
I0706 19:02:27.942209 29446 slave.cpp:592] Agent resources: cpus(*):2; mem(*):1024; disk(*):1024;
ports(*):[31000-32000]
I0706 19:02:27.942282 29446 slave.cpp:600] Agent attributes: [  ]
I0706 19:02:27.942296 29446 slave.cpp:605] Agent hostname: 1de645f4e05d
I0706 19:02:27.943868 29450 state.cpp:57] Recovering state from '/tmp/Endpoint_SlaveEndpointTest_UnauthorizedRequest_1_aSJvJN/meta'
I0706 19:02:27.943944 29446 process.cpp:3322] Handling HTTP event for process 'slave(549)'
with path: '/slave(549)/monitor/statistics.json'
I0706 19:02:27.944530 29450 status_update_manager.cpp:200] Recovering status update manager
I0706 19:02:27.944864 29442 containerizer.cpp:522] Recovering containerizer
I0706 19:02:27.944999 29452 http.cpp:765] Authorizing principal 'test-principal' to GET the
'/monitor/statistics.json' endpoint
I0706 19:02:27.946359 29450 provisioner.cpp:253] Provisioner recovery complete
I0706 19:02:27.946811 29452 slave.cpp:4839] Finished recovery
I0706 19:02:27.947352 29452 slave.cpp:5011] Querying resource estimator for oversubscribable
resources
I0706 19:02:27.947556 29451 slave.cpp:5025] Received oversubscribable resources  from the
resource estimator
I0706 19:02:27.947919 29441 slave.cpp:839] Agent terminating
[       OK ] Endpoint/SlaveEndpointTest.UnauthorizedRequest/1 (19 ms)
[ RUN      ] Endpoint/SlaveEndpointTest.UnauthorizedRequest/2
I0706 19:02:27.955271 29420 containerizer.cpp:196] Using isolation: posix/cpu,posix/mem,filesystem/posix,network/cni
W0706 19:02:27.955889 29420 backend.cpp:75] Failed to create 'aufs' backend: AufsBackend requires
root privileges, but is running as user mesos
W0706 19:02:27.956024 29420 backend.cpp:75] Failed to create 'bind' backend: BindBackend requires
root privileges
I0706 19:02:27.958783 29445 slave.cpp:203] Agent started on 550)@172.17.0.2:51937
I0706 19:02:27.958806 29445 slave.cpp:204] Flags at startup: --acls="" --appc_simple_discovery_uri_prefix="http://"
--appc_store_dir="/tmp/mesos/store/appc" --authenticate_http="true" --authenticatee="crammd5"
--authorizer="local" --cgroups_cpu_enable_pids_and_tids_count="false" --cgroups_enable_cfs="false"
--cgroups_hierarchy="/sys/fs/cgroup" --cgroups_limit_swap="false" --cgroups_root="mesos" --container_disk_watch_interval="15secs"
--containerizers="mesos" --credential="/tmp/Endpoint_SlaveEndpointTest_UnauthorizedRequest_2_aiT5SH/credential"
--default_role="*" --disk_watch_interval="1mins" --docker="docker" --docker_kill_orphans="true"
--docker_registry="https://registry-1.docker.io" --docker_remove_delay="6hrs" --docker_socket="/var/run/docker.sock"
--docker_stop_timeout="0ns" --docker_store_dir="/tmp/mesos/store/docker" --docker_volume_checkpoint_dir="/var/run/mesos/isolators/docker/volume"
--enforce_container_disk_quota="false" --executor_registration_timeout="1mins" --executor_shutdown_grace_period="5secs"
--fetcher_cache_dir="/tmp/Endpoint_SlaveEndpointTest_UnauthorizedRequest_2_aiT5SH/fetch" --fetcher_cache_size="2GB"
--frameworks_home="" --gc_delay="1weeks" --gc_disk_headroom="0.1" --hadoop_home="" --help="true"
--hostname_lookup="true" --http_authenticators="basic" --http_command_executor="false" --http_credentials="/tmp/Endpoint_SlaveEndpointTest_UnauthorizedRequest_2_aiT5SH/http_credentials"
--image_provisioner_backend="copy" --initialize_driver_logging="true" --isolation="posix/cpu,posix/mem"
--launcher_dir="/mesos/mesos-1.0.0/_build/src" --logbufsecs="0" --logging_level="INFO" --oversubscribed_resources_interval="15secs"
--perf_duration="10secs" --perf_interval="1mins" --qos_correction_interval_min="0ns" --quiet="false"
--recover="reconnect" --recovery_timeout="15mins" --registration_backoff_factor="10ms" --resources="cpus:2;gpus:0;mem:1024;disk:1024;ports:[31000-32000]"
--revocable_cpu_low_priority="true" --sandbox_directory="/mnt/mesos/sandbox" --strict="true"
--switch_user="true" --systemd_enable_support="true" --systemd_runtime_directory="/run/systemd/system"
--version="false" --work_dir="/tmp/Endpoint_SlaveEndpointTest_UnauthorizedRequest_2_aiT5SH"
I0706 19:02:27.959359 29445 credentials.hpp:86] Loading credential for authentication from
'/tmp/Endpoint_SlaveEndpointTest_UnauthorizedRequest_2_aiT5SH/credential'
I0706 19:02:27.959544 29445 slave.cpp:341] Agent using credential for: test-principal
I0706 19:02:27.959642 29445 credentials.hpp:37] Loading credentials for authentication from
'/tmp/Endpoint_SlaveEndpointTest_UnauthorizedRequest_2_aiT5SH/http_credentials'
I0706 19:02:27.959868 29445 slave.cpp:393] Using default 'basic' HTTP authenticator
I0706 19:02:27.960331 29445 resources.cpp:572] Parsing resources as JSON failed: cpus:2;gpus:0;mem:1024;disk:1024;ports:[31000-32000]
Trying semicolon-delimited string format instead
I0706 19:02:27.960682 29445 resources.cpp:572] Parsing resources as JSON failed: cpus:2;gpus:0;mem:1024;disk:1024;ports:[31000-32000]
Trying semicolon-delimited string format instead
I0706 19:02:27.961310 29445 slave.cpp:592] Agent resources: cpus(*):2; mem(*):1024; disk(*):1024;
ports(*):[31000-32000]
I0706 19:02:27.961390 29445 slave.cpp:600] Agent attributes: [  ]
I0706 19:02:27.961416 29445 slave.cpp:605] Agent hostname: 1de645f4e05d
I0706 19:02:27.962855 29447 state.cpp:57] Recovering state from '/tmp/Endpoint_SlaveEndpointTest_UnauthorizedRequest_2_aiT5SH/meta'
I0706 19:02:27.962931 29445 process.cpp:3322] Handling HTTP event for process 'slave(550)'
with path: '/slave(550)/containers'
I0706 19:02:27.963459 29452 status_update_manager.cpp:200] Recovering status update manager
I0706 19:02:27.963749 29447 containerizer.cpp:522] Recovering containerizer
I0706 19:02:27.963889 29450 http.cpp:765] Authorizing principal 'test-principal' to GET the
'/containers' endpoint
I0706 19:02:27.965155 29439 provisioner.cpp:253] Provisioner recovery complete
I0706 19:02:27.965442 29442 slave.cpp:4839] Finished recovery
I0706 19:02:27.965878 29442 slave.cpp:5011] Querying resource estimator for oversubscribable
resources
I0706 19:02:27.966186 29447 slave.cpp:5025] Received oversubscribable resources  from the
resource estimator
I0706 19:02:27.967206 29446 slave.cpp:839] Agent terminating
[       OK ] Endpoint/SlaveEndpointTest.UnauthorizedRequest/2 (19 ms)
[ RUN      ] Endpoint/SlaveEndpointTest.NoAuthorizer/0
I0706 19:02:27.976434 29420 containerizer.cpp:196] Using isolation: posix/cpu,posix/mem,filesystem/posix,network/cni
W0706 19:02:27.977216 29420 backend.cpp:75] Failed to create 'aufs' backend: AufsBackend requires
root privileges, but is running as user mesos
W0706 19:02:27.977346 29420 backend.cpp:75] Failed to create 'bind' backend: BindBackend requires
root privileges
I0706 19:02:27.978613 29420 cluster.cpp:432] Creating default 'local' authorizer
I0706 19:02:27.980087 29441 slave.cpp:203] Agent started on 551)@172.17.0.2:51937
I0706 19:02:27.980134 29441 slave.cpp:204] Flags at startup: --acls="" --appc_simple_discovery_uri_prefix="http://"
--appc_store_dir="/tmp/mesos/store/appc" --authenticate_http="true" --authenticatee="crammd5"
--authorizer="local" --cgroups_cpu_enable_pids_and_tids_count="false" --cgroups_enable_cfs="false"
--cgroups_hierarchy="/sys/fs/cgroup" --cgroups_limit_swap="false" --cgroups_root="mesos" --container_disk_watch_interval="15secs"
--containerizers="mesos" --credential="/tmp/Endpoint_SlaveEndpointTest_NoAuthorizer_0_rRTjcC/credential"
--default_role="*" --disk_watch_interval="1mins" --docker="docker" --docker_kill_orphans="true"
--docker_registry="https://registry-1.docker.io" --docker_remove_delay="6hrs" --docker_socket="/var/run/docker.sock"
--docker_stop_timeout="0ns" --docker_store_dir="/tmp/mesos/store/docker" --docker_volume_checkpoint_dir="/var/run/mesos/isolators/docker/volume"
--enforce_container_disk_quota="false" --executor_registration_timeout="1mins" --executor_shutdown_grace_period="5secs"
--fetcher_cache_dir="/tmp/Endpoint_SlaveEndpointTest_NoAuthorizer_0_rRTjcC/fetch" --fetcher_cache_size="2GB"
--frameworks_home="" --gc_delay="1weeks" --gc_disk_headroom="0.1" --hadoop_home="" --help="false"
--hostname_lookup="true" --http_authenticators="basic" --http_command_executor="false" --http_credentials="/tmp/Endpoint_SlaveEndpointTest_NoAuthorizer_0_rRTjcC/http_credentials"
--image_provisioner_backend="copy" --initialize_driver_logging="true" --isolation="posix/cpu,posix/mem"
--launcher_dir="/mesos/mesos-1.0.0/_build/src" --logbufsecs="0" --logging_level="INFO" --oversubscribed_resources_interval="15secs"
--perf_duration="10secs" --perf_interval="1mins" --qos_correction_interval_min="0ns" --quiet="false"
--recover="reconnect" --recovery_timeout="15mins" --registration_backoff_factor="10ms" --resources="cpus:2;gpus:0;mem:1024;disk:1024;ports:[31000-32000]"
--revocable_cpu_low_priority="true" --sandbox_directory="/mnt/mesos/sandbox" --strict="true"
--switch_user="true" --systemd_enable_support="true" --systemd_runtime_directory="/run/systemd/system"
--version="false" --work_dir="/tmp/Endpoint_SlaveEndpointTest_NoAuthorizer_0_rRTjcC"
I0706 19:02:27.980487 29441 credentials.hpp:86] Loading credential for authentication from
'/tmp/Endpoint_SlaveEndpointTest_NoAuthorizer_0_rRTjcC/credential'
I0706 19:02:27.980625 29441 slave.cpp:341] Agent using credential for: test-principal
I0706 19:02:27.980655 29441 credentials.hpp:37] Loading credentials for authentication from
'/tmp/Endpoint_SlaveEndpointTest_NoAuthorizer_0_rRTjcC/http_credentials'
I0706 19:02:27.980867 29441 slave.cpp:393] Using default 'basic' HTTP authenticator
I0706 19:02:27.981245 29441 resources.cpp:572] Parsing resources as JSON failed: cpus:2;gpus:0;mem:1024;disk:1024;ports:[31000-32000]
Trying semicolon-delimited string format instead
I0706 19:02:27.981609 29441 resources.cpp:572] Parsing resources as JSON failed: cpus:2;gpus:0;mem:1024;disk:1024;ports:[31000-32000]
Trying semicolon-delimited string format instead
I0706 19:02:27.982003 29441 slave.cpp:592] Agent resources: cpus(*):2; mem(*):1024; disk(*):1024;
ports(*):[31000-32000]
I0706 19:02:27.982108 29441 slave.cpp:600] Agent attributes: [  ]
I0706 19:02:27.982120 29441 slave.cpp:605] Agent hostname: 1de645f4e05d
I0706 19:02:27.983525 29447 state.cpp:57] Recovering state from '/tmp/Endpoint_SlaveEndpointTest_NoAuthorizer_0_rRTjcC/meta'
I0706 19:02:27.983582 29441 process.cpp:3322] Handling HTTP event for process 'slave(551)'
with path: '/slave(551)/monitor/statistics'
I0706 19:02:27.984041 29450 status_update_manager.cpp:200] Recovering status update manager
I0706 19:02:27.984331 29454 containerizer.cpp:522] Recovering containerizer
I0706 19:02:27.984532 29444 http.cpp:765] Authorizing principal 'test-principal' to GET the
'/monitor/statistics' endpoint
I0706 19:02:27.985390 29453 provisioner.cpp:253] Provisioner recovery complete
I0706 19:02:27.986187 29448 slave.cpp:4839] Finished recovery
I0706 19:02:27.986649 29448 slave.cpp:5011] Querying resource estimator for oversubscribable
resources
I0706 19:02:27.986845 29449 slave.cpp:5025] Received oversubscribable resources  from the
resource estimator
I0706 19:02:27.987562 29447 slave.cpp:839] Agent terminating
[       OK ] Endpoint/SlaveEndpointTest.NoAuthorizer/0 (19 ms)
[ RUN      ] Endpoint/SlaveEndpointTest.NoAuthorizer/1
I0706 19:02:27.994783 29420 containerizer.cpp:196] Using isolation: posix/cpu,posix/mem,filesystem/posix,network/cni
W0706 19:02:27.995383 29420 backend.cpp:75] Failed to create 'aufs' backend: AufsBackend requires
root privileges, but is running as user mesos
W0706 19:02:27.995510 29420 backend.cpp:75] Failed to create 'bind' backend: BindBackend requires
root privileges
I0706 19:02:27.996767 29420 cluster.cpp:432] Creating default 'local' authorizer
I0706 19:02:27.998188 29452 slave.cpp:203] Agent started on 552)@172.17.0.2:51937
I0706 19:02:27.998282 29452 slave.cpp:204] Flags at startup: --acls="" --appc_simple_discovery_uri_prefix="http://"
--appc_store_dir="/tmp/mesos/store/appc" --authenticate_http="true" --authenticatee="crammd5"
--authorizer="local" --cgroups_cpu_enable_pids_and_tids_count="false" --cgroups_enable_cfs="false"
--cgroups_hierarchy="/sys/fs/cgroup" --cgroups_limit_swap="false" --cgroups_root="mesos" --container_disk_watch_interval="15secs"
--containerizers="mesos" --credential="/tmp/Endpoint_SlaveEndpointTest_NoAuthorizer_1_lbe7Ew/credential"
--default_role="*" --disk_watch_interval="1mins" --docker="docker" --docker_kill_orphans="true"
--docker_registry="https://registry-1.docker.io" --docker_remove_delay="6hrs" --docker_socket="/var/run/docker.sock"
--docker_stop_timeout="0ns" --docker_store_dir="/tmp/mesos/store/docker" --docker_volume_checkpoint_dir="/var/run/mesos/isolators/docker/volume"
--enforce_container_disk_quota="false" --executor_registration_timeout="1mins" --executor_shutdown_grace_period="5secs"
--fetcher_cache_dir="/tmp/Endpoint_SlaveEndpointTest_NoAuthorizer_1_lbe7Ew/fetch" --fetcher_cache_size="2GB"
--frameworks_home="" --gc_delay="1weeks" --gc_disk_headroom="0.1" --hadoop_home="" --help="false"
--hostname_lookup="true" --http_authenticators="basic" --http_command_executor="false" --http_credentials="/tmp/Endpoint_SlaveEndpointTest_NoAuthorizer_1_lbe7Ew/http_credentials"
--image_provisioner_backend="copy" --initialize_driver_logging="true" --isolation="posix/cpu,posix/mem"
--launcher_dir="/mesos/mesos-1.0.0/_build/src" --logbufsecs="0" --logging_level="INFO" --oversubscribed_resources_interval="15secs"
--perf_duration="10secs" --perf_interval="1mins" --qos_correction_interval_min="0ns" --quiet="false"
--recover="reconnect" --recovery_timeout="15mins" --registration_backoff_factor="10ms" --resources="cpus:2;gpus:0;mem:1024;disk:1024;ports:[31000-32000]"
--revocable_cpu_low_priority="true" --sandbox_directory="/mnt/mesos/sandbox" --strict="true"
--switch_user="true" --systemd_enable_support="true" --systemd_runtime_directory="/run/systemd/system"
--version="false" --work_dir="/tmp/Endpoint_SlaveEndpointTest_NoAuthorizer_1_lbe7Ew"
I0706 19:02:27.998785 29452 credentials.hpp:86] Loading credential for authentication from
'/tmp/Endpoint_SlaveEndpointTest_NoAuthorizer_1_lbe7Ew/credential'
I0706 19:02:27.998939 29452 slave.cpp:341] Agent using credential for: test-principal
I0706 19:02:27.998972 29452 credentials.hpp:37] Loading credentials for authentication from
'/tmp/Endpoint_SlaveEndpointTest_NoAuthorizer_1_lbe7Ew/http_credentials'
I0706 19:02:27.999253 29452 slave.cpp:393] Using default 'basic' HTTP authenticator
I0706 19:02:27.999570 29452 resources.cpp:572] Parsing resources as JSON failed: cpus:2;gpus:0;mem:1024;disk:1024;ports:[31000-32000]
Trying semicolon-delimited string format instead
I0706 19:02:27.999833 29452 resources.cpp:572] Parsing resources as JSON failed: cpus:2;gpus:0;mem:1024;disk:1024;ports:[31000-32000]
Trying semicolon-delimited string format instead
I0706 19:02:28.000175 29452 slave.cpp:592] Agent resources: cpus(*):2; mem(*):1024; disk(*):1024;
ports(*):[31000-32000]
I0706 19:02:28.000236 29452 slave.cpp:600] Agent attributes: [  ]
I0706 19:02:28.000246 29452 slave.cpp:605] Agent hostname: 1de645f4e05d
I0706 19:02:28.001499 29448 state.cpp:57] Recovering state from '/tmp/Endpoint_SlaveEndpointTest_NoAuthorizer_1_lbe7Ew/meta'
I0706 19:02:28.001541 29452 process.cpp:3322] Handling HTTP event for process 'slave(552)'
with path: '/slave(552)/monitor/statistics.json'
I0706 19:02:28.001999 29444 status_update_manager.cpp:200] Recovering status update manager
I0706 19:02:28.002351 29443 containerizer.cpp:522] Recovering containerizer
I0706 19:02:28.002394 29448 http.cpp:765] Authorizing principal 'test-principal' to GET the
'/monitor/statistics.json' endpoint
I0706 19:02:28.003437 29446 provisioner.cpp:253] Provisioner recovery complete
I0706 19:02:28.003767 29451 slave.cpp:4839] Finished recovery
I0706 19:02:28.004261 29451 slave.cpp:5011] Querying resource estimator for oversubscribable
resources
I0706 19:02:28.004950 29454 slave.cpp:839] Agent terminating
[       OK ] Endpoint/SlaveEndpointTest.NoAuthorizer/1 (18 ms)
[ RUN      ] Endpoint/SlaveEndpointTest.NoAuthorizer/2
I0706 19:02:28.014719 29420 containerizer.cpp:196] Using isolation: posix/cpu,posix/mem,filesystem/posix,network/cni
W0706 19:02:28.015405 29420 backend.cpp:75] Failed to create 'aufs' backend: AufsBackend requires
root privileges, but is running as user mesos
W0706 19:02:28.015552 29420 backend.cpp:75] Failed to create 'bind' backend: BindBackend requires
root privileges
I0706 19:02:28.016858 29420 cluster.cpp:432] Creating default 'local' authorizer
I0706 19:02:28.018543 29446 slave.cpp:203] Agent started on 553)@172.17.0.2:51937
I0706 19:02:28.018570 29446 slave.cpp:204] Flags at startup: --acls="" --appc_simple_discovery_uri_prefix="http://"
--appc_store_dir="/tmp/mesos/store/appc" --authenticate_http="true" --authenticatee="crammd5"
--authorizer="local" --cgroups_cpu_enable_pids_and_tids_count="false" --cgroups_enable_cfs="false"
--cgroups_hierarchy="/sys/fs/cgroup" --cgroups_limit_swap="false" --cgroups_root="mesos" --container_disk_watch_interval="15secs"
--containerizers="mesos" --credential="/tmp/Endpoint_SlaveEndpointTest_NoAuthorizer_2_XHMPgr/credential"
--default_role="*" --disk_watch_interval="1mins" --docker="docker" --docker_kill_orphans="true"
--docker_registry="https://registry-1.docker.io" --docker_remove_delay="6hrs" --docker_socket="/var/run/docker.sock"
--docker_stop_timeout="0ns" --docker_store_dir="/tmp/mesos/store/docker" --docker_volume_checkpoint_dir="/var/run/mesos/isolators/docker/volume"
--enforce_container_disk_quota="false" --executor_registration_timeout="1mins" --executor_shutdown_grace_period="5secs"
--fetcher_cache_dir="/tmp/Endpoint_SlaveEndpointTest_NoAuthorizer_2_XHMPgr/fetch" --fetcher_cache_size="2GB"
--frameworks_home="" --gc_delay="1weeks" --gc_disk_headroom="0.1" --hadoop_home="" --help="false"
--hostname_lookup="true" --http_authenticators="basic" --http_command_executor="false" --http_credentials="/tmp/Endpoint_SlaveEndpointTest_NoAuthorizer_2_XHMPgr/http_credentials"
--image_provisioner_backend="copy" --initialize_driver_logging="true" --isolation="posix/cpu,posix/mem"
--launcher_dir="/mesos/mesos-1.0.0/_build/src" --logbufsecs="0" --logging_level="INFO" --oversubscribed_resources_interval="15secs"
--perf_duration="10secs" --perf_interval="1mins" --qos_correction_interval_min="0ns" --quiet="false"
--recover="reconnect" --recovery_timeout="15mins" --registration_backoff_factor="10ms" --resources="cpus:2;gpus:0;mem:1024;disk:1024;ports:[31000-32000]"
--revocable_cpu_low_priority="true" --sandbox_directory="/mnt/mesos/sandbox" --strict="true"
--switch_user="true" --systemd_enable_support="true" --systemd_runtime_directory="/run/systemd/system"
--version="false" --work_dir="/tmp/Endpoint_SlaveEndpointTest_NoAuthorizer_2_XHMPgr"
I0706 19:02:28.019016 29446 credentials.hpp:86] Loading credential for authentication from
'/tmp/Endpoint_SlaveEndpointTest_NoAuthorizer_2_XHMPgr/credential'
I0706 19:02:28.019192 29446 slave.cpp:341] Agent using credential for: test-principal
I0706 19:02:28.019222 29446 credentials.hpp:37] Loading credentials for authentication from
'/tmp/Endpoint_SlaveEndpointTest_NoAuthorizer_2_XHMPgr/http_credentials'
I0706 19:02:28.019428 29446 slave.cpp:393] Using default 'basic' HTTP authenticator
I0706 19:02:28.019664 29446 resources.cpp:572] Parsing resources as JSON failed: cpus:2;gpus:0;mem:1024;disk:1024;ports:[31000-32000]
Trying semicolon-delimited string format instead
I0706 19:02:28.019943 29446 resources.cpp:572] Parsing resources as JSON failed: cpus:2;gpus:0;mem:1024;disk:1024;ports:[31000-32000]
Trying semicolon-delimited string format instead
I0706 19:02:28.020323 29446 slave.cpp:592] Agent resources: cpus(*):2; mem(*):1024; disk(*):1024;
ports(*):[31000-32000]
I0706 19:02:28.020377 29446 slave.cpp:600] Agent attributes: [  ]
I0706 19:02:28.020387 29446 slave.cpp:605] Agent hostname: 1de645f4e05d
I0706 19:02:28.021623 29450 state.cpp:57] Recovering state from '/tmp/Endpoint_SlaveEndpointTest_NoAuthorizer_2_XHMPgr/meta'
I0706 19:02:28.021708 29446 process.cpp:3322] Handling HTTP event for process 'slave(553)'
with path: '/slave(553)/containers'
I0706 19:02:28.022183 29454 status_update_manager.cpp:200] Recovering status update manager
I0706 19:02:28.022435 29443 containerizer.cpp:522] Recovering containerizer
I0706 19:02:28.022581 29441 http.cpp:765] Authorizing principal 'test-principal' to GET the
'/containers' endpoint
I0706 19:02:28.023579 29441 provisioner.cpp:253] Provisioner recovery complete
I0706 19:02:28.023799 29453 slave.cpp:4839] Finished recovery
I0706 19:02:28.024322 29453 slave.cpp:5011] Querying resource estimator for oversubscribable
resources
I0706 19:02:28.024500 29453 slave.cpp:5025] Received oversubscribable resources  from the
resource estimator
I0706 19:02:28.025665 29449 slave.cpp:839] Agent terminating
[       OK ] Endpoint/SlaveEndpointTest.NoAuthorizer/2 (19 ms)
[----------] 9 tests from Endpoint/SlaveEndpointTest (182 ms total)

[----------] Global test environment tear-down
[==========] 1228 tests from 139 test cases ran. (378422 ms total)
[  PASSED  ] 1227 tests.
[  FAILED  ] 1 test, listed below:
[  FAILED  ] DiskQuotaTest.SlaveRecovery

 1 FAILED TEST
  YOU HAVE 6 DISABLED TESTS

make[4]: *** [check-local] Error 1
make[4]: Leaving directory `/mesos/mesos-1.0.0/_build/src'
make[3]: *** [check-am] Error 2
make[3]: Leaving directory `/mesos/mesos-1.0.0/_build/src'
make[2]: *** [check] Error 2
make[2]: Leaving directory `/mesos/mesos-1.0.0/_build/src'
make[1]: *** [check-recursive] Error 1
make[1]: Leaving directory `/mesos/mesos-1.0.0/_build'
make: *** [distcheck] Error 1
+ docker rmi mesos-1467829624-15343
Untagged: mesos-1467829624-15343:latest
Deleted: 2cd9f479ee2f68b613b642fb670b8efdf79d679020140a268a59a2ca16f901b8
Deleted: 0a2e3d54bfb63f86ff4c19355b7b018bb85bc44503890b2a11c4befd1af019e4
Deleted: 1cff69da3aee73f25ee2ff9bc7b19a05eaf0acdea16b5d872b3835f9eca90dff
Deleted: a7111cc0055ac3651b14de42afc24ade184facb9b62935ee1489b6fc3dd89c7c
Deleted: cde29744d7a56310b4dc1c7502987669d77b59effe33ff930148bbe14e7eac48
Deleted: 8bbf2683d6ffc79ee2b45e6816b3b772cacecd64467076ce1eff63a19919faf0
Deleted: d47e65e32ba2b14b25c8388ed0a79dbf9da1e7e0cccef76a6dc16487a98ba5ff
Deleted: 706e5a6d927e8013b01f4664d5c335747f295e1b388a41ccb5a10f184e7a0e3c
Deleted: 7e46f7ebd7310ae6da5d9bcfbccd38c6d6a3bffc77e4e2cf1c785de3d67b91fa
Deleted: 68b81fa471f4c979e8c4052fde2f8386930123f035fddada757b910e71ddfc3f
Deleted: 99b7ff4e59c950fd01a3364245b0c202fda6d2a8c3ce9d15dbe0b1aa8b35ffc9
Deleted: 85cf5bd35747f48cbe7477237fd0a52ef899834ba00a02a52733de18ed17833e
Deleted: 33802bd27d52c11a49dce76744ef8692729eed54c39e564ccfe1526390e4b76f
Deleted: 9cd9155645f1ecca35cb2de34be3bfd5eed1af6f640623645f2b0b38e493cf16
Deleted: fc932f04209f82647e516091a1b02b1732eac52a9a6d10ece532ab66a95f8551
Build step 'Execute shell' marked build as failure

Mime
View raw message