mesos-builds mailing list archives

Site index · List index
Message view « Date » · « Thread »
Top « Date » · « Thread »
From Apache Jenkins Server <jenk...@builds.apache.org>
Subject Build failed in Jenkins: Mesos » cmake,gcc,--verbose,GLOG_v=1 MESOS_VERBOSE=1,centos:7,(docker||Hadoop)&&(!ubuntu-us1)&&(!ubuntu-6) #2452
Date Wed, 06 Jul 2016 06:09:40 GMT
See <https://builds.apache.org/job/Mesos/BUILDTOOL=cmake,COMPILER=gcc,CONFIGURATION=--verbose,ENVIRONMENT=GLOG_v=1%20MESOS_VERBOSE=1,OS=centos%3A7,label_exp=(docker%7C%7CHadoop)&&(!ubuntu-us1)&&(!ubuntu-6)/2452/changes>

Changes:

[anand] Refactored 'Master::Http::getTasks()' into helper function.

[anand] Refactored 'Master::Http::getAgents()' into helper function.

[anand] Refactored 'master::Http::getFrameworks()' to helper function.

[anand] Revised protobuf definition of 'GetState' response.

[anand] Refactored 'Master::Http::getExecutors()' into helper function.

[anand] Implemented 'GetState' call in v1 master API.

[anand] Implemented 'Subscribed' event for v1 master event stream.

------------------------------------------
[...truncated 6650 lines...]
[       OK ] UUIDTest.MalformedUUID (0 ms)
[----------] 2 tests from UUIDTest (0 ms total)

[----------] 2 tests from VersionTest
[ RUN      ] VersionTest.Comparison
[       OK ] VersionTest.Comparison (0 ms)
[ RUN      ] VersionTest.Parse
[       OK ] VersionTest.Parse (0 ms)
[----------] 2 tests from VersionTest (0 ms total)

[----------] 25 tests from FlagsTest
[ RUN      ] FlagsTest.Load
[       OK ] FlagsTest.Load (0 ms)
[ RUN      ] FlagsTest.Add
[       OK ] FlagsTest.Add (0 ms)
[ RUN      ] FlagsTest.Alias
[       OK ] FlagsTest.Alias (0 ms)
[ RUN      ] FlagsTest.Flags
[       OK ] FlagsTest.Flags (0 ms)
[ RUN      ] FlagsTest.LoadFromEnvironment
[       OK ] FlagsTest.LoadFromEnvironment (0 ms)
[ RUN      ] FlagsTest.LoadFromCommandLine
[       OK ] FlagsTest.LoadFromCommandLine (1 ms)
[ RUN      ] FlagsTest.LoadFromCommandLineWithNonFlags
[       OK ] FlagsTest.LoadFromCommandLineWithNonFlags (0 ms)
[ RUN      ] FlagsTest.LoadFromCommandLineWithDashDash
[       OK ] FlagsTest.LoadFromCommandLineWithDashDash (0 ms)
[ RUN      ] FlagsTest.LoadFromCommandLineAndUpdateArgcArgv
[       OK ] FlagsTest.LoadFromCommandLineAndUpdateArgcArgv (0 ms)
[ RUN      ] FlagsTest.Stringification
[       OK ] FlagsTest.Stringification (0 ms)
[ RUN      ] FlagsTest.EffectiveName
[       OK ] FlagsTest.EffectiveName (0 ms)
[ RUN      ] FlagsTest.DeprecationWarning
[       OK ] FlagsTest.DeprecationWarning (0 ms)
[ RUN      ] FlagsTest.DuplicatesFromEnvironment
[       OK ] FlagsTest.DuplicatesFromEnvironment (1 ms)
[ RUN      ] FlagsTest.DuplicatesFromCommandLine
[       OK ] FlagsTest.DuplicatesFromCommandLine (0 ms)
[ RUN      ] FlagsTest.AliasDuplicateFromCommandLine
[       OK ] FlagsTest.AliasDuplicateFromCommandLine (0 ms)
[ RUN      ] FlagsTest.Errors
[       OK ] FlagsTest.Errors (0 ms)
[ RUN      ] FlagsTest.MissingRequiredFlag
[       OK ] FlagsTest.MissingRequiredFlag (0 ms)
[ RUN      ] FlagsTest.Validate
[       OK ] FlagsTest.Validate (0 ms)
[ RUN      ] FlagsTest.Usage
[       OK ] FlagsTest.Usage (1 ms)
[ RUN      ] FlagsTest.UsageMessage
[       OK ] FlagsTest.UsageMessage (0 ms)
[ RUN      ] FlagsTest.EmptyUsage
[       OK ] FlagsTest.EmptyUsage (0 ms)
[ RUN      ] FlagsTest.ProgramName
[       OK ] FlagsTest.ProgramName (0 ms)
[ RUN      ] FlagsTest.OptionalMessage
[       OK ] FlagsTest.OptionalMessage (0 ms)
[ RUN      ] FlagsTest.Duration
[       OK ] FlagsTest.Duration (0 ms)
[ RUN      ] FlagsTest.JSON
[       OK ] FlagsTest.JSON (0 ms)
[----------] 25 tests from FlagsTest (3 ms total)

[----------] 2 tests from FlagsFileTest
[ RUN      ] FlagsFileTest.JSONFile
WARNING: Logging before InitGoogleLogging() is written to STDERR
W0706 06:09:38.717160 18836 parse.hpp:89] Specifying an absolute filename to read a command
line option out of without using 'file:// is deprecated and will be removed in a future release.
Simply adding 'file://' to the beginning of the path should eliminate this warning.
[       OK ] FlagsFileTest.JSONFile (1 ms)
[ RUN      ] FlagsFileTest.FilePrefix
[       OK ] FlagsFileTest.FilePrefix (0 ms)
[----------] 2 tests from FlagsFileTest (1 ms total)

[----------] 18 tests from OsTest
[ RUN      ] OsTest.Environment
[       OK ] OsTest.Environment (1 ms)
[ RUN      ] OsTest.Argv
[       OK ] OsTest.Argv (0 ms)
[ RUN      ] OsTest.System
sh: invalid.command: command not found
[       OK ] OsTest.System (13 ms)
[ RUN      ] OsTest.Cloexec
[       OK ] OsTest.Cloexec (1 ms)
[ RUN      ] OsTest.Nonblock
[       OK ] OsTest.Nonblock (0 ms)
[ RUN      ] OsTest.Size
[       OK ] OsTest.Size (0 ms)
[ RUN      ] OsTest.BootId
[       OK ] OsTest.BootId (1 ms)
[ RUN      ] OsTest.Sleep
[       OK ] OsTest.Sleep (10 ms)
[ RUN      ] OsTest.Children
[       OK ] OsTest.Children (4 ms)
[ RUN      ] OsTest.Killtree
[       OK ] OsTest.Killtree (21 ms)
[ RUN      ] OsTest.KilltreeNoRoot
[       OK ] OsTest.KilltreeNoRoot (16 ms)
[ RUN      ] OsTest.ProcessExists
[       OK ] OsTest.ProcessExists (6 ms)
[ RUN      ] OsTest.User
[       OK ] OsTest.User (14 ms)
[ RUN      ] OsTest.Libraries
[       OK ] OsTest.Libraries (1 ms)
[ RUN      ] OsTest.Shell
sh: foobar: command not found
E0706 06:09:38.809008 18836 shell.hpp:106] Command 'foobar' failed; this is the output:
[       OK ] OsTest.Shell (11 ms)
[ RUN      ] OsTest.Mknod
[       OK ] OsTest.Mknod (0 ms)
[ RUN      ] OsTest.Realpath
[       OK ] OsTest.Realpath (0 ms)
[ RUN      ] OsTest.Which
[       OK ] OsTest.Which (1 ms)
[----------] 18 tests from OsTest (101 ms total)

[----------] 6 tests from PathTest
[ RUN      ] PathTest.Basename
[       OK ] PathTest.Basename (0 ms)
[ RUN      ] PathTest.Dirname
[       OK ] PathTest.Dirname (0 ms)
[ RUN      ] PathTest.Extension
[       OK ] PathTest.Extension (0 ms)
[ RUN      ] PathTest.Join
[       OK ] PathTest.Join (0 ms)
[ RUN      ] PathTest.Absolute
[       OK ] PathTest.Absolute (0 ms)
[ RUN      ] PathTest.Comparison
[       OK ] PathTest.Comparison (0 ms)
[----------] 6 tests from PathTest (0 ms total)

[----------] 1 test from PathFileTest
[ RUN      ] PathFileTest.ImplicitConversion
[       OK ] PathFileTest.ImplicitConversion (0 ms)
[----------] 1 test from PathFileTest (0 ms total)

[----------] 10 tests from ProtobufTest
[ RUN      ] ProtobufTest.JSON
[       OK ] ProtobufTest.JSON (2 ms)
[ RUN      ] ProtobufTest.JSONArray
[       OK ] ProtobufTest.JSONArray (0 ms)
[ RUN      ] ProtobufTest.JsonLargeIntegers
[       OK ] ProtobufTest.JsonLargeIntegers (1 ms)
[ RUN      ] ProtobufTest.SimpleMessageEquals
[       OK ] ProtobufTest.SimpleMessageEquals (0 ms)
[ RUN      ] ProtobufTest.ParseJSONArray
[       OK ] ProtobufTest.ParseJSONArray (0 ms)
[ RUN      ] ProtobufTest.ParseJSONNull
[       OK ] ProtobufTest.ParseJSONNull (0 ms)
[ RUN      ] ProtobufTest.ParseJSONNestedError
[       OK ] ProtobufTest.ParseJSONNestedError (0 ms)
[ RUN      ] ProtobufTest.Jsonify
[       OK ] ProtobufTest.Jsonify (0 ms)
[ RUN      ] ProtobufTest.JsonifyArray
[       OK ] ProtobufTest.JsonifyArray (0 ms)
[ RUN      ] ProtobufTest.JsonifyLargeIntegers
[       OK ] ProtobufTest.JsonifyLargeIntegers (0 ms)
[----------] 10 tests from ProtobufTest (3 ms total)

[----------] 2 tests from RecordIOTest
[ RUN      ] RecordIOTest.Encoder
[       OK ] RecordIOTest.Encoder (1 ms)
[ RUN      ] RecordIOTest.Decoder
[       OK ] RecordIOTest.Decoder (0 ms)
[----------] 2 tests from RecordIOTest (1 ms total)

[----------] 2 tests from SubcommandTest
[ RUN      ] SubcommandTest.Flags
[       OK ] SubcommandTest.Flags (0 ms)
[ RUN      ] SubcommandTest.Dispatch
Subcommand 'subcommand' is not available
Usage: command <subcommand> [OPTIONS]

Available subcommands:
    help
    subcommand2

Multiple subcommands have name 'subcommand'
[       OK ] SubcommandTest.Dispatch (0 ms)
[----------] 2 tests from SubcommandTest (0 ms total)

[----------] 2 tests from SVNTest
[ RUN      ] SVNTest.DiffPatch
[       OK ] SVNTest.DiffPatch (44 ms)
[ RUN      ] SVNTest.EmptyDiffPatch
[       OK ] SVNTest.EmptyDiffPatch (42 ms)
[----------] 2 tests from SVNTest (86 ms total)

[----------] 1 test from TryTest
[ RUN      ] TryTest.ArrowOperator
[       OK ] TryTest.ArrowOperator (0 ms)
[----------] 1 test from TryTest (0 ms total)

[----------] 1 test from OsSendfileTest
[ RUN      ] OsSendfileTest.Sendfile
[       OK ] OsSendfileTest.Sendfile (8 ms)
[----------] 1 test from OsSendfileTest (8 ms total)

[----------] 1 test from OsSignalsTest
[ RUN      ] OsSignalsTest.Suppress
[       OK ] OsSignalsTest.Suppress (0 ms)
[----------] 1 test from OsSignalsTest (0 ms total)

[----------] 6 tests from ProcTest
[ RUN      ] ProcTest.Pids
[       OK ] ProcTest.Pids (1 ms)
[ RUN      ] ProcTest.Cpus
[       OK ] ProcTest.Cpus (1 ms)
[ RUN      ] ProcTest.SystemStatus
[       OK ] ProcTest.SystemStatus (0 ms)
[ RUN      ] ProcTest.ProcessStatus
[       OK ] ProcTest.ProcessStatus (0 ms)
[ RUN      ] ProcTest.SingleThread
[       OK ] ProcTest.SingleThread (0 ms)
[ RUN      ] ProcTest.MultipleThreads
[       OK ] ProcTest.MultipleThreads (1 ms)
[----------] 6 tests from ProcTest (3 ms total)

[----------] Global test environment tear-down
[==========] 267 tests from 45 test cases ran. (263 ms total)
[  PASSED  ] 266 tests.
[  FAILED  ] 1 test, listed below:
[  FAILED  ] JsonTest.Find

 1 FAILED TEST
make[3]: *** [CMakeFiles/check] Error 1
make[3]: Leaving directory `/mesos/build'
make[2]: *** [CMakeFiles/check.dir/all] Error 2
make[2]: Leaving directory `/mesos/build'
make[1]: *** [CMakeFiles/check.dir/rule] Error 2
make[1]: Leaving directory `/mesos/build'
make: *** [check] Error 2
+ docker rmi mesos-1467784633-1702
Untagged: mesos-1467784633-1702:latest
Deleted: a21e6a98fab9fdb8ab85ec61bb52fd12eb2592da185956fa6988f6a83bc33fe8
Deleted: 584fb438407c575e4fe1f2f964c10b089e591181b195e1346db7ce1fb49b8bc7
Deleted: 3a88993bf160319277fbe0d7e33629b22588b7fe586dceea998a256c249ae5b6
Deleted: d47beecf6bed6cdbc7478f647503168fbd51d06fdf939a20893e420b51780a89
Deleted: d06ceff3dab77e9a8b661f99887776e8a2fad7b2d1da3a008e0d02f8146c8ce1
Deleted: df12353dfecf566b862acf4e22add8ad46658ac231d9c22e15ca784975dfe55b
Deleted: ec05b3ce7c6e917234388506a6cc50fa09966891b3e418f7d2c9f2bd015443a6
Deleted: 3b5ad3de2d61a5905eb3e8bbdc5acd2e5807512fa442754fb716985f555a3242
Deleted: accb1b9250688e7cce5f6a05d56a01293ee4bd30ab9ed10f435b51925d27678e
Deleted: f324fc03e5e0817f91243308111713aee9dbe0c5f5a307bef19b6a00c6e7d1e8
Deleted: ec3a469060ba76311c80fa5eee7492c5b2e0a8a990dd5f7f7f170284bceb6eba
Deleted: e3848ebe8267871ea926bb1c60b5f853023292dfff89855bc2d8cfee47e7d75f
Deleted: 0dc14630507c4ca89278a80b31fbe6b41e87e6437d4d1ea561dd4535b29c28e6
Deleted: 60fb1e6aa3ec119941ef726eb702d1740941cf4da0f630c8874982e6b6b5704d
Deleted: 4787d81e23b95ca836f177b6fd3c8831f8089caed4aca3d05f2db29f8468abd5
Deleted: f697b8c4c82aeb1febadc03737b8e19fb15beef610d289cd14e569dda8f4bd1e
Build step 'Execute shell' marked build as failure

Mime
View raw message