mesos-builds mailing list archives

Site index · List index
Message view « Date » · « Thread »
Top « Date » · « Thread »
From Apache Jenkins Server <jenk...@builds.apache.org>
Subject Build failed in Jenkins: mesos-reviewbot #14129
Date Mon, 04 Jul 2016 06:09:02 GMT
See <https://builds.apache.org/job/mesos-reviewbot/14129/>

------------------------------------------
[...truncated 197093 lines...]
I0704 06:08:58.986129 28109 slave.cpp:605] Agent hostname: b4b32b894964
I0704 06:08:58.987895 28115 state.cpp:57] Recovering state from '/tmp/Endpoint_SlaveEndpointTest_AuthorizedRequest_1_XpTVXu/meta'
I0704 06:08:58.988029 28109 process.cpp:3322] Handling HTTP event for process 'slave(537)'
with path: '/slave(537)/monitor/statistics.json'
I0704 06:08:58.988703 28115 status_update_manager.cpp:200] Recovering status update manager
I0704 06:08:58.988859 28108 containerizer.cpp:526] Recovering containerizer
I0704 06:08:58.989917 28117 http.cpp:765] Authorizing principal 'test-principal' to GET the
'/monitor/statistics.json' endpoint
I0704 06:08:58.990362 28111 provisioner.cpp:253] Provisioner recovery complete
I0704 06:08:58.992144 28117 slave.cpp:4840] Finished recovery
I0704 06:08:58.992805 28117 slave.cpp:5012] Querying resource estimator for oversubscribable
resources
I0704 06:08:58.994238 28117 slave.cpp:5026] Received oversubscribable resources  from the
resource estimator
I0704 06:08:58.997359 28112 slave.cpp:839] Agent terminating
[       OK ] Endpoint/SlaveEndpointTest.AuthorizedRequest/1 (28 ms)
[ RUN      ] Endpoint/SlaveEndpointTest.AuthorizedRequest/2
I0704 06:08:59.007175 28089 containerizer.cpp:200] Using isolation: posix/cpu,posix/mem,filesystem/posix,network/cni
W0704 06:08:59.007998 28089 backend.cpp:75] Failed to create 'aufs' backend: AufsBackend requires
root privileges, but is running as user mesos
W0704 06:08:59.008162 28089 backend.cpp:75] Failed to create 'bind' backend: BindBackend requires
root privileges
I0704 06:08:59.011334 28118 slave.cpp:203] Agent started on 538)@172.17.0.2:35435
I0704 06:08:59.011453 28118 slave.cpp:204] Flags at startup: --acls="" --appc_simple_discovery_uri_prefix="http://"
--appc_store_dir="/tmp/mesos/store/appc" --authenticate_http="true" --authenticatee="crammd5"
--authorizer="local" --cgroups_cpu_enable_pids_and_tids_count="false" --cgroups_enable_cfs="false"
--cgroups_hierarchy="/sys/fs/cgroup" --cgroups_limit_swap="false" --cgroups_root="mesos" --container_disk_watch_interval="15secs"
--containerizers="mesos" --credential="/tmp/Endpoint_SlaveEndpointTest_AuthorizedRequest_2_uja5WS/credential"
--default_role="*" --disk_watch_interval="1mins" --docker="docker" --docker_kill_orphans="true"
--docker_registry="https://registry-1.docker.io" --docker_remove_delay="6hrs" --docker_socket="/var/run/docker.sock"
--docker_stop_timeout="0ns" --docker_store_dir="/tmp/mesos/store/docker" --docker_volume_checkpoint_dir="/var/run/mesos/isolators/docker/volume"
--enforce_container_disk_quota="false" --executor_registration_timeout="1mins" --executor_shutdown_grace_period="5secs"
--fetcher_cache_dir="/tmp/Endpoint_SlaveEndpointTest_AuthorizedRequest_2_uja5WS/fetch" --fetcher_cache_size="2GB"
--frameworks_home="" --gc_delay="1weeks" --gc_disk_headroom="0.1" --hadoop_home="" --help="true"
--hostname_lookup="true" --http_authenticators="basic" --http_command_executor="false" --http_credentials="/tmp/Endpoint_SlaveEndpointTest_AuthorizedRequest_2_uja5WS/http_credentials"
--image_provisioner_backend="copy" --initialize_driver_logging="true" --isolation="posix/cpu,posix/mem"
--launcher_dir="/mesos/mesos-1.0.0/_build/src" --logbufsecs="0" --logging_level="INFO" --oversubscribed_resources_interval="15secs"
--perf_duration="10secs" --perf_interval="1mins" --qos_correction_interval_min="0ns" --quiet="false"
--recover="reconnect" --recovery_timeout="15mins" --registration_backoff_factor="10ms" --resources="cpus:2;gpus:0;mem:1024;disk:1024;ports:[31000-32000]"
--revocable_cpu_low_priority="true" --sandbox_directory="/mnt/mesos/sandbox" --strict="true"
--switch_user="true" --systemd_enable_support="true" --systemd_runtime_directory="/run/systemd/system"
--version="false" --work_dir="/tmp/Endpoint_SlaveEndpointTest_AuthorizedRequest_2_uja5WS"
I0704 06:08:59.012114 28118 credentials.hpp:86] Loading credential for authentication from
'/tmp/Endpoint_SlaveEndpointTest_AuthorizedRequest_2_uja5WS/credential'
I0704 06:08:59.012326 28118 slave.cpp:341] Agent using credential for: test-principal
I0704 06:08:59.012409 28118 credentials.hpp:37] Loading credentials for authentication from
'/tmp/Endpoint_SlaveEndpointTest_AuthorizedRequest_2_uja5WS/http_credentials'
I0704 06:08:59.012670 28118 slave.cpp:393] Using default 'basic' HTTP authenticator
I0704 06:08:59.013124 28118 resources.cpp:572] Parsing resources as JSON failed: cpus:2;gpus:0;mem:1024;disk:1024;ports:[31000-32000]
Trying semicolon-delimited string format instead
I0704 06:08:59.013774 28118 resources.cpp:572] Parsing resources as JSON failed: cpus:2;gpus:0;mem:1024;disk:1024;ports:[31000-32000]
Trying semicolon-delimited string format instead
I0704 06:08:59.014353 28118 slave.cpp:592] Agent resources: cpus(*):2; mem(*):1024; disk(*):1024;
ports(*):[31000-32000]
I0704 06:08:59.014415 28118 slave.cpp:600] Agent attributes: [  ]
I0704 06:08:59.014434 28118 slave.cpp:605] Agent hostname: b4b32b894964
I0704 06:08:59.015854 28118 process.cpp:3322] Handling HTTP event for process 'slave(538)'
with path: '/slave(538)/containers'
I0704 06:08:59.015897 28111 state.cpp:57] Recovering state from '/tmp/Endpoint_SlaveEndpointTest_AuthorizedRequest_2_uja5WS/meta'
I0704 06:08:59.017408 28114 status_update_manager.cpp:200] Recovering status update manager
I0704 06:08:59.017633 28118 containerizer.cpp:526] Recovering containerizer
I0704 06:08:59.018189 28114 http.cpp:765] Authorizing principal 'test-principal' to GET the
'/containers' endpoint
I0704 06:08:59.019918 28111 provisioner.cpp:253] Provisioner recovery complete
I0704 06:08:59.021204 28114 slave.cpp:4840] Finished recovery
I0704 06:08:59.021839 28114 slave.cpp:5012] Querying resource estimator for oversubscribable
resources
I0704 06:08:59.022109 28108 slave.cpp:5026] Received oversubscribable resources  from the
resource estimator
I0704 06:08:59.024667 28120 slave.cpp:839] Agent terminating
[       OK ] Endpoint/SlaveEndpointTest.AuthorizedRequest/2 (27 ms)
[ RUN      ] Endpoint/SlaveEndpointTest.UnauthorizedRequest/0
I0704 06:08:59.034940 28089 containerizer.cpp:200] Using isolation: posix/cpu,posix/mem,filesystem/posix,network/cni
W0704 06:08:59.035727 28089 backend.cpp:75] Failed to create 'aufs' backend: AufsBackend requires
root privileges, but is running as user mesos
W0704 06:08:59.035887 28089 backend.cpp:75] Failed to create 'bind' backend: BindBackend requires
root privileges
I0704 06:08:59.039216 28116 slave.cpp:203] Agent started on 539)@172.17.0.2:35435
I0704 06:08:59.039248 28116 slave.cpp:204] Flags at startup: --acls="" --appc_simple_discovery_uri_prefix="http://"
--appc_store_dir="/tmp/mesos/store/appc" --authenticate_http="true" --authenticatee="crammd5"
--authorizer="local" --cgroups_cpu_enable_pids_and_tids_count="false" --cgroups_enable_cfs="false"
--cgroups_hierarchy="/sys/fs/cgroup" --cgroups_limit_swap="false" --cgroups_root="mesos" --container_disk_watch_interval="15secs"
--containerizers="mesos" --credential="/tmp/Endpoint_SlaveEndpointTest_UnauthorizedRequest_0_XQpX9g/credential"
--default_role="*" --disk_watch_interval="1mins" --docker="docker" --docker_kill_orphans="true"
--docker_registry="https://registry-1.docker.io" --docker_remove_delay="6hrs" --docker_socket="/var/run/docker.sock"
--docker_stop_timeout="0ns" --docker_store_dir="/tmp/mesos/store/docker" --docker_volume_checkpoint_dir="/var/run/mesos/isolators/docker/volume"
--enforce_container_disk_quota="false" --executor_registration_timeout="1mins" --executor_shutdown_grace_period="5secs"
--fetcher_cache_dir="/tmp/Endpoint_SlaveEndpointTest_UnauthorizedRequest_0_XQpX9g/fetch" --fetcher_cache_size="2GB"
--frameworks_home="" --gc_delay="1weeks" --gc_disk_headroom="0.1" --hadoop_home="" --help="true"
--hostname_lookup="true" --http_authenticators="basic" --http_command_executor="false" --http_credentials="/tmp/Endpoint_SlaveEndpointTest_UnauthorizedRequest_0_XQpX9g/http_credentials"
--image_provisioner_backend="copy" --initialize_driver_logging="true" --isolation="posix/cpu,posix/mem"
--launcher_dir="/mesos/mesos-1.0.0/_build/src" --logbufsecs="0" --logging_level="INFO" --oversubscribed_resources_interval="15secs"
--perf_duration="10secs" --perf_interval="1mins" --qos_correction_interval_min="0ns" --quiet="false"
--recover="reconnect" --recovery_timeout="15mins" --registration_backoff_factor="10ms" --resources="cpus:2;gpus:0;mem:1024;disk:1024;ports:[31000-32000]"
--revocable_cpu_low_priority="true" --sandbox_directory="/mnt/mesos/sandbox" --strict="true"
--switch_user="true" --systemd_enable_support="true" --systemd_runtime_directory="/run/systemd/system"
--version="false" --work_dir="/tmp/Endpoint_SlaveEndpointTest_UnauthorizedRequest_0_XQpX9g"
I0704 06:08:59.039772 28116 credentials.hpp:86] Loading credential for authentication from
'/tmp/Endpoint_SlaveEndpointTest_UnauthorizedRequest_0_XQpX9g/credential'
I0704 06:08:59.040055 28116 slave.cpp:341] Agent using credential for: test-principal
I0704 06:08:59.040324 28116 credentials.hpp:37] Loading credentials for authentication from
'/tmp/Endpoint_SlaveEndpointTest_UnauthorizedRequest_0_XQpX9g/http_credentials'
I0704 06:08:59.040581 28116 slave.cpp:393] Using default 'basic' HTTP authenticator
I0704 06:08:59.041062 28116 resources.cpp:572] Parsing resources as JSON failed: cpus:2;gpus:0;mem:1024;disk:1024;ports:[31000-32000]
Trying semicolon-delimited string format instead
I0704 06:08:59.041393 28116 resources.cpp:572] Parsing resources as JSON failed: cpus:2;gpus:0;mem:1024;disk:1024;ports:[31000-32000]
Trying semicolon-delimited string format instead
I0704 06:08:59.041748 28116 slave.cpp:592] Agent resources: cpus(*):2; mem(*):1024; disk(*):1024;
ports(*):[31000-32000]
I0704 06:08:59.041810 28116 slave.cpp:600] Agent attributes: [  ]
I0704 06:08:59.041828 28116 slave.cpp:605] Agent hostname: b4b32b894964
I0704 06:08:59.043514 28112 state.cpp:57] Recovering state from '/tmp/Endpoint_SlaveEndpointTest_UnauthorizedRequest_0_XQpX9g/meta'
I0704 06:08:59.044286 28111 status_update_manager.cpp:200] Recovering status update manager
I0704 06:08:59.044445 28110 containerizer.cpp:526] Recovering containerizer
I0704 06:08:59.045083 28112 process.cpp:3322] Handling HTTP event for process 'slave(539)'
with path: '/slave(539)/monitor/statistics'
I0704 06:08:59.047915 28112 provisioner.cpp:253] Provisioner recovery complete
I0704 06:08:59.048248 28118 http.cpp:765] Authorizing principal 'test-principal' to GET the
'/monitor/statistics' endpoint
I0704 06:08:59.048756 28118 slave.cpp:4840] Finished recovery
I0704 06:08:59.049276 28118 slave.cpp:5012] Querying resource estimator for oversubscribable
resources
I0704 06:08:59.049549 28114 slave.cpp:5026] Received oversubscribable resources  from the
resource estimator
I0704 06:08:59.050725 28089 slave.cpp:839] Agent terminating
[       OK ] Endpoint/SlaveEndpointTest.UnauthorizedRequest/0 (24 ms)
[ RUN      ] Endpoint/SlaveEndpointTest.UnauthorizedRequest/1
I0704 06:08:59.059231 28089 containerizer.cpp:200] Using isolation: posix/cpu,posix/mem,filesystem/posix,network/cni
W0704 06:08:59.060001 28089 backend.cpp:75] Failed to create 'aufs' backend: AufsBackend requires
root privileges, but is running as user mesos
W0704 06:08:59.060158 28089 backend.cpp:75] Failed to create 'bind' backend: BindBackend requires
root privileges
I0704 06:08:59.063551 28118 slave.cpp:203] Agent started on 540)@172.17.0.2:35435
I0704 06:08:59.063578 28118 slave.cpp:204] Flags at startup: --acls="" --appc_simple_discovery_uri_prefix="http://"
--appc_store_dir="/tmp/mesos/store/appc" --authenticate_http="true" --authenticatee="crammd5"
--authorizer="local" --cgroups_cpu_enable_pids_and_tids_count="false" --cgroups_enable_cfs="false"
--cgroups_hierarchy="/sys/fs/cgroup" --cgroups_limit_swap="false" --cgroups_root="mesos" --container_disk_watch_interval="15secs"
--containerizers="mesos" --credential="/tmp/Endpoint_SlaveEndpointTest_UnauthorizedRequest_1_yfzfzF/credential"
--default_role="*" --disk_watch_interval="1mins" --docker="docker" --docker_kill_orphans="true"
--docker_registry="https://registry-1.docker.io" --docker_remove_delay="6hrs" --docker_socket="/var/run/docker.sock"
--docker_stop_timeout="0ns" --docker_store_dir="/tmp/mesos/store/docker" --docker_volume_checkpoint_dir="/var/run/mesos/isolators/docker/volume"
--enforce_container_disk_quota="false" --executor_registration_timeout="1mins" --executor_shutdown_grace_period="5secs"
--fetcher_cache_dir="/tmp/Endpoint_SlaveEndpointTest_UnauthorizedRequest_1_yfzfzF/fetch" --fetcher_cache_size="2GB"
--frameworks_home="" --gc_delay="1weeks" --gc_disk_headroom="0.1" --hadoop_home="" --help="true"
--hostname_lookup="true" --http_authenticators="basic" --http_command_executor="false" --http_credentials="/tmp/Endpoint_SlaveEndpointTest_UnauthorizedRequest_1_yfzfzF/http_credentials"
--image_provisioner_backend="copy" --initialize_driver_logging="true" --isolation="posix/cpu,posix/mem"
--launcher_dir="/mesos/mesos-1.0.0/_build/src" --logbufsecs="0" --logging_level="INFO" --oversubscribed_resources_interval="15secs"
--perf_duration="10secs" --perf_interval="1mins" --qos_correction_interval_min="0ns" --quiet="false"
--recover="reconnect" --recovery_timeout="15mins" --registration_backoff_factor="10ms" --resources="cpus:2;gpus:0;mem:1024;disk:1024;ports:[31000-32000]"
--revocable_cpu_low_priority="true" --sandbox_directory="/mnt/mesos/sandbox" --strict="true"
--switch_user="true" --systemd_enable_support="true" --systemd_runtime_directory="/run/systemd/system"
--version="false" --work_dir="/tmp/Endpoint_SlaveEndpointTest_UnauthorizedRequest_1_yfzfzF"
I0704 06:08:59.064026 28118 credentials.hpp:86] Loading credential for authentication from
'/tmp/Endpoint_SlaveEndpointTest_UnauthorizedRequest_1_yfzfzF/credential'
I0704 06:08:59.064218 28118 slave.cpp:341] Agent using credential for: test-principal
I0704 06:08:59.064252 28118 credentials.hpp:37] Loading credentials for authentication from
'/tmp/Endpoint_SlaveEndpointTest_UnauthorizedRequest_1_yfzfzF/http_credentials'
I0704 06:08:59.064530 28118 slave.cpp:393] Using default 'basic' HTTP authenticator
I0704 06:08:59.064915 28118 resources.cpp:572] Parsing resources as JSON failed: cpus:2;gpus:0;mem:1024;disk:1024;ports:[31000-32000]
Trying semicolon-delimited string format instead
I0704 06:08:59.065342 28118 resources.cpp:572] Parsing resources as JSON failed: cpus:2;gpus:0;mem:1024;disk:1024;ports:[31000-32000]
Trying semicolon-delimited string format instead
I0704 06:08:59.065776 28118 slave.cpp:592] Agent resources: cpus(*):2; mem(*):1024; disk(*):1024;
ports(*):[31000-32000]
I0704 06:08:59.065846 28118 slave.cpp:600] Agent attributes: [  ]
I0704 06:08:59.065865 28118 slave.cpp:605] Agent hostname: b4b32b894964
I0704 06:08:59.067423 28109 state.cpp:57] Recovering state from '/tmp/Endpoint_SlaveEndpointTest_UnauthorizedRequest_1_yfzfzF/meta'
I0704 06:08:59.067495 28118 process.cpp:3322] Handling HTTP event for process 'slave(540)'
with path: '/slave(540)/monitor/statistics.json'
I0704 06:08:59.068017 28115 status_update_manager.cpp:200] Recovering status update manager
I0704 06:08:59.068184 28111 containerizer.cpp:526] Recovering containerizer
I0704 06:08:59.068542 28119 http.cpp:765] Authorizing principal 'test-principal' to GET the
'/monitor/statistics.json' endpoint
I0704 06:08:59.069723 28116 provisioner.cpp:253] Provisioner recovery complete
I0704 06:08:59.070085 28122 slave.cpp:4840] Finished recovery
I0704 06:08:59.070638 28122 slave.cpp:5012] Querying resource estimator for oversubscribable
resources
I0704 06:08:59.070899 28108 slave.cpp:5026] Received oversubscribable resources  from the
resource estimator
I0704 06:08:59.071512 28111 slave.cpp:839] Agent terminating
[       OK ] Endpoint/SlaveEndpointTest.UnauthorizedRequest/1 (21 ms)
[ RUN      ] Endpoint/SlaveEndpointTest.UnauthorizedRequest/2
I0704 06:08:59.083390 28089 containerizer.cpp:200] Using isolation: posix/cpu,posix/mem,filesystem/posix,network/cni
W0704 06:08:59.084390 28089 backend.cpp:75] Failed to create 'aufs' backend: AufsBackend requires
root privileges, but is running as user mesos
W0704 06:08:59.084573 28089 backend.cpp:75] Failed to create 'bind' backend: BindBackend requires
root privileges
I0704 06:08:59.088776 28111 slave.cpp:203] Agent started on 541)@172.17.0.2:35435
I0704 06:08:59.088804 28111 slave.cpp:204] Flags at startup: --acls="" --appc_simple_discovery_uri_prefix="http://"
--appc_store_dir="/tmp/mesos/store/appc" --authenticate_http="true" --authenticatee="crammd5"
--authorizer="local" --cgroups_cpu_enable_pids_and_tids_count="false" --cgroups_enable_cfs="false"
--cgroups_hierarchy="/sys/fs/cgroup" --cgroups_limit_swap="false" --cgroups_root="mesos" --container_disk_watch_interval="15secs"
--containerizers="mesos" --credential="/tmp/Endpoint_SlaveEndpointTest_UnauthorizedRequest_2_96vt93/credential"
--default_role="*" --disk_watch_interval="1mins" --docker="docker" --docker_kill_orphans="true"
--docker_registry="https://registry-1.docker.io" --docker_remove_delay="6hrs" --docker_socket="/var/run/docker.sock"
--docker_stop_timeout="0ns" --docker_store_dir="/tmp/mesos/store/docker" --docker_volume_checkpoint_dir="/var/run/mesos/isolators/docker/volume"
--enforce_container_disk_quota="false" --executor_registration_timeout="1mins" --executor_shutdown_grace_period="5secs"
--fetcher_cache_dir="/tmp/Endpoint_SlaveEndpointTest_UnauthorizedRequest_2_96vt93/fetch" --fetcher_cache_size="2GB"
--frameworks_home="" --gc_delay="1weeks" --gc_disk_headroom="0.1" --hadoop_home="" --help="true"
--hostname_lookup="true" --http_authenticators="basic" --http_command_executor="false" --http_credentials="/tmp/Endpoint_SlaveEndpointTest_UnauthorizedRequest_2_96vt93/http_credentials"
--image_provisioner_backend="copy" --initialize_driver_logging="true" --isolation="posix/cpu,posix/mem"
--launcher_dir="/mesos/mesos-1.0.0/_build/src" --logbufsecs="0" --logging_level="INFO" --oversubscribed_resources_interval="15secs"
--perf_duration="10secs" --perf_interval="1mins" --qos_correction_interval_min="0ns" --quiet="false"
--recover="reconnect" --recovery_timeout="15mins" --registration_backoff_factor="10ms" --resources="cpus:2;gpus:0;mem:1024;disk:1024;ports:[31000-32000]"
--revocable_cpu_low_priority="true" --sandbox_directory="/mnt/mesos/sandbox" --strict="true"
--switch_user="true" --systemd_enable_support="true" --systemd_runtime_directory="/run/systemd/system"
--version="false" --work_dir="/tmp/Endpoint_SlaveEndpointTest_UnauthorizedRequest_2_96vt93"
I0704 06:08:59.089258 28111 credentials.hpp:86] Loading credential for authentication from
'/tmp/Endpoint_SlaveEndpointTest_UnauthorizedRequest_2_96vt93/credential'
I0704 06:08:59.089442 28111 slave.cpp:341] Agent using credential for: test-principal
I0704 06:08:59.089478 28111 credentials.hpp:37] Loading credentials for authentication from
'/tmp/Endpoint_SlaveEndpointTest_UnauthorizedRequest_2_96vt93/http_credentials'
I0704 06:08:59.089757 28111 slave.cpp:393] Using default 'basic' HTTP authenticator
I0704 06:08:59.090154 28111 resources.cpp:572] Parsing resources as JSON failed: cpus:2;gpus:0;mem:1024;disk:1024;ports:[31000-32000]
Trying semicolon-delimited string format instead
I0704 06:08:59.090651 28111 resources.cpp:572] Parsing resources as JSON failed: cpus:2;gpus:0;mem:1024;disk:1024;ports:[31000-32000]
Trying semicolon-delimited string format instead
I0704 06:08:59.091203 28111 slave.cpp:592] Agent resources: cpus(*):2; mem(*):1024; disk(*):1024;
ports(*):[31000-32000]
I0704 06:08:59.091265 28111 slave.cpp:600] Agent attributes: [  ]
I0704 06:08:59.091284 28111 slave.cpp:605] Agent hostname: b4b32b894964
I0704 06:08:59.092823 28108 state.cpp:57] Recovering state from '/tmp/Endpoint_SlaveEndpointTest_UnauthorizedRequest_2_96vt93/meta'
I0704 06:08:59.092912 28111 process.cpp:3322] Handling HTTP event for process 'slave(541)'
with path: '/slave(541)/containers'
I0704 06:08:59.093380 28111 status_update_manager.cpp:200] Recovering status update manager
I0704 06:08:59.093529 28108 containerizer.cpp:526] Recovering containerizer
I0704 06:08:59.094074 28115 http.cpp:765] Authorizing principal 'test-principal' to GET the
'/containers' endpoint
I0704 06:08:59.094741 28111 provisioner.cpp:253] Provisioner recovery complete
I0704 06:08:59.095161 28123 slave.cpp:4840] Finished recovery
I0704 06:08:59.095705 28123 slave.cpp:5012] Querying resource estimator for oversubscribable
resources
I0704 06:08:59.095901 28116 slave.cpp:5026] Received oversubscribable resources  from the
resource estimator
I0704 06:08:59.096364 28113 slave.cpp:839] Agent terminating
[       OK ] Endpoint/SlaveEndpointTest.UnauthorizedRequest/2 (22 ms)
[ RUN      ] Endpoint/SlaveEndpointTest.NoAuthorizer/0
I0704 06:08:59.104388 28089 containerizer.cpp:200] Using isolation: posix/cpu,posix/mem,filesystem/posix,network/cni
W0704 06:08:59.105093 28089 backend.cpp:75] Failed to create 'aufs' backend: AufsBackend requires
root privileges, but is running as user mesos
W0704 06:08:59.105240 28089 backend.cpp:75] Failed to create 'bind' backend: BindBackend requires
root privileges
I0704 06:08:59.106537 28089 cluster.cpp:432] Creating default 'local' authorizer
I0704 06:08:59.108007 28116 slave.cpp:203] Agent started on 542)@172.17.0.2:35435
I0704 06:08:59.108099 28116 slave.cpp:204] Flags at startup: --acls="" --appc_simple_discovery_uri_prefix="http://"
--appc_store_dir="/tmp/mesos/store/appc" --authenticate_http="true" --authenticatee="crammd5"
--authorizer="local" --cgroups_cpu_enable_pids_and_tids_count="false" --cgroups_enable_cfs="false"
--cgroups_hierarchy="/sys/fs/cgroup" --cgroups_limit_swap="false" --cgroups_root="mesos" --container_disk_watch_interval="15secs"
--containerizers="mesos" --credential="/tmp/Endpoint_SlaveEndpointTest_NoAuthorizer_0_wOk0Us/credential"
--default_role="*" --disk_watch_interval="1mins" --docker="docker" --docker_kill_orphans="true"
--docker_registry="https://registry-1.docker.io" --docker_remove_delay="6hrs" --docker_socket="/var/run/docker.sock"
--docker_stop_timeout="0ns" --docker_store_dir="/tmp/mesos/store/docker" --docker_volume_checkpoint_dir="/var/run/mesos/isolators/docker/volume"
--enforce_container_disk_quota="false" --executor_registration_timeout="1mins" --executor_shutdown_grace_period="5secs"
--fetcher_cache_dir="/tmp/Endpoint_SlaveEndpointTest_NoAuthorizer_0_wOk0Us/fetch" --fetcher_cache_size="2GB"
--frameworks_home="" --gc_delay="1weeks" --gc_disk_headroom="0.1" --hadoop_home="" --help="false"
--hostname_lookup="true" --http_authenticators="basic" --http_command_executor="false" --http_credentials="/tmp/Endpoint_SlaveEndpointTest_NoAuthorizer_0_wOk0Us/http_credentials"
--image_provisioner_backend="copy" --initialize_driver_logging="true" --isolation="posix/cpu,posix/mem"
--launcher_dir="/mesos/mesos-1.0.0/_build/src" --logbufsecs="0" --logging_level="INFO" --oversubscribed_resources_interval="15secs"
--perf_duration="10secs" --perf_interval="1mins" --qos_correction_interval_min="0ns" --quiet="false"
--recover="reconnect" --recovery_timeout="15mins" --registration_backoff_factor="10ms" --resources="cpus:2;gpus:0;mem:1024;disk:1024;ports:[31000-32000]"
--revocable_cpu_low_priority="true" --sandbox_directory="/mnt/mesos/sandbox" --strict="true"
--switch_user="true" --systemd_enable_support="true" --systemd_runtime_directory="/run/systemd/system"
--version="false" --work_dir="/tmp/Endpoint_SlaveEndpointTest_NoAuthorizer_0_wOk0Us"
I0704 06:08:59.108511 28116 credentials.hpp:86] Loading credential for authentication from
'/tmp/Endpoint_SlaveEndpointTest_NoAuthorizer_0_wOk0Us/credential'
I0704 06:08:59.108706 28116 slave.cpp:341] Agent using credential for: test-principal
I0704 06:08:59.108860 28116 credentials.hpp:37] Loading credentials for authentication from
'/tmp/Endpoint_SlaveEndpointTest_NoAuthorizer_0_wOk0Us/http_credentials'
I0704 06:08:59.109242 28116 slave.cpp:393] Using default 'basic' HTTP authenticator
I0704 06:08:59.109556 28116 resources.cpp:572] Parsing resources as JSON failed: cpus:2;gpus:0;mem:1024;disk:1024;ports:[31000-32000]
Trying semicolon-delimited string format instead
I0704 06:08:59.109915 28116 resources.cpp:572] Parsing resources as JSON failed: cpus:2;gpus:0;mem:1024;disk:1024;ports:[31000-32000]
Trying semicolon-delimited string format instead
I0704 06:08:59.110312 28116 slave.cpp:592] Agent resources: cpus(*):2; mem(*):1024; disk(*):1024;
ports(*):[31000-32000]
I0704 06:08:59.110370 28116 slave.cpp:600] Agent attributes: [  ]
I0704 06:08:59.110386 28116 slave.cpp:605] Agent hostname: b4b32b894964
I0704 06:08:59.111687 28123 state.cpp:57] Recovering state from '/tmp/Endpoint_SlaveEndpointTest_NoAuthorizer_0_wOk0Us/meta'
I0704 06:08:59.111788 28116 process.cpp:3322] Handling HTTP event for process 'slave(542)'
with path: '/slave(542)/monitor/statistics'
I0704 06:08:59.112280 28115 status_update_manager.cpp:200] Recovering status update manager
I0704 06:08:59.112628 28121 containerizer.cpp:526] Recovering containerizer
I0704 06:08:59.112761 28122 http.cpp:765] Authorizing principal 'test-principal' to GET the
'/monitor/statistics' endpoint
I0704 06:08:59.113812 28117 provisioner.cpp:253] Provisioner recovery complete
I0704 06:08:59.114240 28114 slave.cpp:4840] Finished recovery
I0704 06:08:59.114751 28114 slave.cpp:5012] Querying resource estimator for oversubscribable
resources
I0704 06:08:59.115008 28114 slave.cpp:5026] Received oversubscribable resources  from the
resource estimator
I0704 06:08:59.116297 28111 slave.cpp:839] Agent terminating
[       OK ] Endpoint/SlaveEndpointTest.NoAuthorizer/0 (20 ms)
[ RUN      ] Endpoint/SlaveEndpointTest.NoAuthorizer/1
I0704 06:08:59.127765 28089 containerizer.cpp:200] Using isolation: posix/cpu,posix/mem,filesystem/posix,network/cni
W0704 06:08:59.128435 28089 backend.cpp:75] Failed to create 'aufs' backend: AufsBackend requires
root privileges, but is running as user mesos
W0704 06:08:59.128577 28089 backend.cpp:75] Failed to create 'bind' backend: BindBackend requires
root privileges
I0704 06:08:59.129914 28089 cluster.cpp:432] Creating default 'local' authorizer
I0704 06:08:59.131423 28108 slave.cpp:203] Agent started on 543)@172.17.0.2:35435
I0704 06:08:59.131449 28108 slave.cpp:204] Flags at startup: --acls="" --appc_simple_discovery_uri_prefix="http://"
--appc_store_dir="/tmp/mesos/store/appc" --authenticate_http="true" --authenticatee="crammd5"
--authorizer="local" --cgroups_cpu_enable_pids_and_tids_count="false" --cgroups_enable_cfs="false"
--cgroups_hierarchy="/sys/fs/cgroup" --cgroups_limit_swap="false" --cgroups_root="mesos" --container_disk_watch_interval="15secs"
--containerizers="mesos" --credential="/tmp/Endpoint_SlaveEndpointTest_NoAuthorizer_1_tIacRR/credential"
--default_role="*" --disk_watch_interval="1mins" --docker="docker" --docker_kill_orphans="true"
--docker_registry="https://registry-1.docker.io" --docker_remove_delay="6hrs" --docker_socket="/var/run/docker.sock"
--docker_stop_timeout="0ns" --docker_store_dir="/tmp/mesos/store/docker" --docker_volume_checkpoint_dir="/var/run/mesos/isolators/docker/volume"
--enforce_container_disk_quota="false" --executor_registration_timeout="1mins" --executor_shutdown_grace_period="5secs"
--fetcher_cache_dir="/tmp/Endpoint_SlaveEndpointTest_NoAuthorizer_1_tIacRR/fetch" --fetcher_cache_size="2GB"
--frameworks_home="" --gc_delay="1weeks" --gc_disk_headroom="0.1" --hadoop_home="" --help="false"
--hostname_lookup="true" --http_authenticators="basic" --http_command_executor="false" --http_credentials="/tmp/Endpoint_SlaveEndpointTest_NoAuthorizer_1_tIacRR/http_credentials"
--image_provisioner_backend="copy" --initialize_driver_logging="true" --isolation="posix/cpu,posix/mem"
--launcher_dir="/mesos/mesos-1.0.0/_build/src" --logbufsecs="0" --logging_level="INFO" --oversubscribed_resources_interval="15secs"
--perf_duration="10secs" --perf_interval="1mins" --qos_correction_interval_min="0ns" --quiet="false"
--recover="reconnect" --recovery_timeout="15mins" --registration_backoff_factor="10ms" --resources="cpus:2;gpus:0;mem:1024;disk:1024;ports:[31000-32000]"
--revocable_cpu_low_priority="true" --sandbox_directory="/mnt/mesos/sandbox" --strict="true"
--switch_user="true" --systemd_enable_support="true" --systemd_runtime_directory="/run/systemd/system"
--version="false" --work_dir="/tmp/Endpoint_SlaveEndpointTest_NoAuthorizer_1_tIacRR"
I0704 06:08:59.132026 28108 credentials.hpp:86] Loading credential for authentication from
'/tmp/Endpoint_SlaveEndpointTest_NoAuthorizer_1_tIacRR/credential'
I0704 06:08:59.132199 28108 slave.cpp:341] Agent using credential for: test-principal
I0704 06:08:59.132232 28108 credentials.hpp:37] Loading credentials for authentication from
'/tmp/Endpoint_SlaveEndpointTest_NoAuthorizer_1_tIacRR/http_credentials'
I0704 06:08:59.132488 28108 slave.cpp:393] Using default 'basic' HTTP authenticator
I0704 06:08:59.133002 28108 resources.cpp:572] Parsing resources as JSON failed: cpus:2;gpus:0;mem:1024;disk:1024;ports:[31000-32000]
Trying semicolon-delimited string format instead
I0704 06:08:59.133337 28108 resources.cpp:572] Parsing resources as JSON failed: cpus:2;gpus:0;mem:1024;disk:1024;ports:[31000-32000]
Trying semicolon-delimited string format instead
I0704 06:08:59.133700 28108 slave.cpp:592] Agent resources: cpus(*):2; mem(*):1024; disk(*):1024;
ports(*):[31000-32000]
I0704 06:08:59.133757 28108 slave.cpp:600] Agent attributes: [  ]
I0704 06:08:59.133769 28108 slave.cpp:605] Agent hostname: b4b32b894964
I0704 06:08:59.135170 28122 state.cpp:57] Recovering state from '/tmp/Endpoint_SlaveEndpointTest_NoAuthorizer_1_tIacRR/meta'
I0704 06:08:59.135251 28108 process.cpp:3322] Handling HTTP event for process 'slave(543)'
with path: '/slave(543)/monitor/statistics.json'
I0704 06:08:59.135673 28122 status_update_manager.cpp:200] Recovering status update manager
I0704 06:08:59.135818 28108 containerizer.cpp:526] Recovering containerizer
I0704 06:08:59.136378 28122 http.cpp:765] Authorizing principal 'test-principal' to GET the
'/monitor/statistics.json' endpoint
I0704 06:08:59.137069 28122 provisioner.cpp:253] Provisioner recovery complete
I0704 06:08:59.137828 28112 slave.cpp:4840] Finished recovery
I0704 06:08:59.138494 28112 slave.cpp:5012] Querying resource estimator for oversubscribable
resources
I0704 06:08:59.138777 28118 slave.cpp:5026] Received oversubscribable resources  from the
resource estimator
I0704 06:08:59.139969 28108 slave.cpp:839] Agent terminating
[       OK ] Endpoint/SlaveEndpointTest.NoAuthorizer/1 (20 ms)
[ RUN      ] Endpoint/SlaveEndpointTest.NoAuthorizer/2
I0704 06:08:59.149664 28089 containerizer.cpp:200] Using isolation: posix/cpu,posix/mem,filesystem/posix,network/cni
W0704 06:08:59.150398 28089 backend.cpp:75] Failed to create 'aufs' backend: AufsBackend requires
root privileges, but is running as user mesos
W0704 06:08:59.150565 28089 backend.cpp:75] Failed to create 'bind' backend: BindBackend requires
root privileges
I0704 06:08:59.152106 28089 cluster.cpp:432] Creating default 'local' authorizer
I0704 06:08:59.153640 28118 slave.cpp:203] Agent started on 544)@172.17.0.2:35435
I0704 06:08:59.153668 28118 slave.cpp:204] Flags at startup: --acls="" --appc_simple_discovery_uri_prefix="http://"
--appc_store_dir="/tmp/mesos/store/appc" --authenticate_http="true" --authenticatee="crammd5"
--authorizer="local" --cgroups_cpu_enable_pids_and_tids_count="false" --cgroups_enable_cfs="false"
--cgroups_hierarchy="/sys/fs/cgroup" --cgroups_limit_swap="false" --cgroups_root="mesos" --container_disk_watch_interval="15secs"
--containerizers="mesos" --credential="/tmp/Endpoint_SlaveEndpointTest_NoAuthorizer_2_UtdhYg/credential"
--default_role="*" --disk_watch_interval="1mins" --docker="docker" --docker_kill_orphans="true"
--docker_registry="https://registry-1.docker.io" --docker_remove_delay="6hrs" --docker_socket="/var/run/docker.sock"
--docker_stop_timeout="0ns" --docker_store_dir="/tmp/mesos/store/docker" --docker_volume_checkpoint_dir="/var/run/mesos/isolators/docker/volume"
--enforce_container_disk_quota="false" --executor_registration_timeout="1mins" --executor_shutdown_grace_period="5secs"
--fetcher_cache_dir="/tmp/Endpoint_SlaveEndpointTest_NoAuthorizer_2_UtdhYg/fetch" --fetcher_cache_size="2GB"
--frameworks_home="" --gc_delay="1weeks" --gc_disk_headroom="0.1" --hadoop_home="" --help="false"
--hostname_lookup="true" --http_authenticators="basic" --http_command_executor="false" --http_credentials="/tmp/Endpoint_SlaveEndpointTest_NoAuthorizer_2_UtdhYg/http_credentials"
--image_provisioner_backend="copy" --initialize_driver_logging="true" --isolation="posix/cpu,posix/mem"
--launcher_dir="/mesos/mesos-1.0.0/_build/src" --logbufsecs="0" --logging_level="INFO" --oversubscribed_resources_interval="15secs"
--perf_duration="10secs" --perf_interval="1mins" --qos_correction_interval_min="0ns" --quiet="false"
--recover="reconnect" --recovery_timeout="15mins" --registration_backoff_factor="10ms" --resources="cpus:2;gpus:0;mem:1024;disk:1024;ports:[31000-32000]"
--revocable_cpu_low_priority="true" --sandbox_directory="/mnt/mesos/sandbox" --strict="true"
--switch_user="true" --systemd_enable_support="true" --systemd_runtime_directory="/run/systemd/system"
--version="false" --work_dir="/tmp/Endpoint_SlaveEndpointTest_NoAuthorizer_2_UtdhYg"
I0704 06:08:59.154304 28118 credentials.hpp:86] Loading credential for authentication from
'/tmp/Endpoint_SlaveEndpointTest_NoAuthorizer_2_UtdhYg/credential'
I0704 06:08:59.154501 28118 slave.cpp:341] Agent using credential for: test-principal
I0704 06:08:59.154539 28118 credentials.hpp:37] Loading credentials for authentication from
'/tmp/Endpoint_SlaveEndpointTest_NoAuthorizer_2_UtdhYg/http_credentials'
I0704 06:08:59.154829 28118 slave.cpp:393] Using default 'basic' HTTP authenticator
I0704 06:08:59.155316 28118 resources.cpp:572] Parsing resources as JSON failed: cpus:2;gpus:0;mem:1024;disk:1024;ports:[31000-32000]
Trying semicolon-delimited string format instead
I0704 06:08:59.155760 28118 resources.cpp:572] Parsing resources as JSON failed: cpus:2;gpus:0;mem:1024;disk:1024;ports:[31000-32000]
Trying semicolon-delimited string format instead
I0704 06:08:59.156198 28118 slave.cpp:592] Agent resources: cpus(*):2; mem(*):1024; disk(*):1024;
ports(*):[31000-32000]
I0704 06:08:59.156256 28118 slave.cpp:600] Agent attributes: [  ]
I0704 06:08:59.156267 28118 slave.cpp:605] Agent hostname: b4b32b894964
I0704 06:08:59.157596 28108 state.cpp:57] Recovering state from '/tmp/Endpoint_SlaveEndpointTest_NoAuthorizer_2_UtdhYg/meta'
I0704 06:08:59.157668 28118 process.cpp:3322] Handling HTTP event for process 'slave(544)'
with path: '/slave(544)/containers'
I0704 06:08:59.158293 28110 status_update_manager.cpp:200] Recovering status update manager
I0704 06:08:59.158447 28122 containerizer.cpp:526] Recovering containerizer
I0704 06:08:59.158828 28119 http.cpp:765] Authorizing principal 'test-principal' to GET the
'/containers' endpoint
I0704 06:08:59.159800 28119 provisioner.cpp:253] Provisioner recovery complete
I0704 06:08:59.160238 28117 slave.cpp:4840] Finished recovery
I0704 06:08:59.160799 28117 slave.cpp:5012] Querying resource estimator for oversubscribable
resources
I0704 06:08:59.161085 28111 slave.cpp:5026] Received oversubscribable resources  from the
resource estimator
I0704 06:08:59.162729 28116 slave.cpp:839] Agent terminating
[       OK ] Endpoint/SlaveEndpointTest.NoAuthorizer/2 (22 ms)
[----------] 9 tests from Endpoint/SlaveEndpointTest (228 ms total)

[----------] Global test environment tear-down
[==========] 1216 tests from 139 test cases ran. (891797 ms total)
[  PASSED  ] 1215 tests.
[  FAILED  ] 1 test, listed below:
[  FAILED  ] SlaveTest.HTTPSchedulerSlaveRestart

 1 FAILED TEST
  YOU HAVE 6 DISABLED TESTS

make[4]: *** [check-local] Error 1
make[4]: Leaving directory `/mesos/mesos-1.0.0/_build/src'
make[3]: *** [check-am] Error 2
make[3]: Leaving directory `/mesos/mesos-1.0.0/_build/src'
make[2]: *** [check] Error 2
make[2]: Leaving directory `/mesos/mesos-1.0.0/_build/src'
make[1]: *** [check-recursive] Error 1
make[1]: Leaving directory `/mesos/mesos-1.0.0/_build'
make: *** [distcheck] Error 1
+ docker rmi mesos-1467609780-29934
Untagged: mesos-1467609780-29934:latest
Deleted: 372d7d540d44bf9fe45a4ffda57aa14ee73ead3f5c7fe32768d8ada161914f6b
Deleted: 4631dce73870139da26ba5985d3095cb5cd2b15401e60f3e4d8caecc247203ae
Deleted: c7238916166b41f84d8f7d20300fe9ee635f19893bc0558b16579dd477946e0e
Deleted: 52db4b29fd541842be7e4b297001f7b50f256d53ff100db78369c0262d2c5f8a
Deleted: a735e280e95f190f9a79e07892e0baa6e16c48d0935de468cebdfc708f508ef6
Deleted: 7977079e68d55a1248a7251672a9fdf0720a2d95c4a60847be024a3249d9a022
Deleted: 3d22ef9456378ad592eec563127c3c7cca768d31ea5501763641b33ba0dc0b24
Deleted: 693fdbeb539973b59184c0660ae317657d12d50059a55bae2f5d52db8c21b9ea
Deleted: 3f87c406e7ce43a23be201cc0e0c8ce7ad69b9d5bc665ad03c509f1a0518c4cd
Deleted: 36f2aec01f974115af86a7db38df3881a323cb3cfd353feb729e70734e688148
Deleted: 9ea20fe02f0acb6a3644f7ad615c70e9ce8d9e0acb3e75c58ee74d66e1b2f28e
Deleted: 5faea79a8d94b7bd4ee6636d596ec9499b3b49dacfe48acb30f5a226be6a3d63
Deleted: 9d9a00a4e2e7cda9010d57258d6e3bca3297c4af24ef87f42aadc99bb912323a
Deleted: c982849339524bc3eadd65c3e5261845c49a01ee10aa66af7892137dd79685f0
Deleted: c9030ffb20877bd00f495dde8b33cd7394f49ecee3000e4361572d019170fad7
Build step 'Execute shell' marked build as failure

Mime
View raw message