mesos-builds mailing list archives

Site index · List index
Message view « Date » · « Thread »
Top « Date » · « Thread »
From Apache Jenkins Server <jenk...@builds.apache.org>
Subject Build failed in Jenkins: Mesos » autotools,gcc,--verbose,GLOG_v=1 MESOS_VERBOSE=1,centos:7,(docker||Hadoop)&&(!ubuntu-us1)&&(!ubuntu-6) #2472
Date Fri, 08 Jul 2016 05:28:03 GMT
See <https://builds.apache.org/job/Mesos/BUILDTOOL=autotools,COMPILER=gcc,CONFIGURATION=--verbose,ENVIRONMENT=GLOG_v=1%20MESOS_VERBOSE=1,OS=centos%3A7,label_exp=(docker%7C%7CHadoop)&&(!ubuntu-us1)&&(!ubuntu-6)/2472/changes>

Changes:

[vinodkone] MESOS-5808 - Elasticsearch misspelled on homepage.

------------------------------------------
[...truncated 198396 lines...]
I0708 05:28:05.401407 29172 slave.cpp:607] Agent hostname: f23a7516267c
I0708 05:28:05.403169 29178 state.cpp:57] Recovering state from '/tmp/Endpoint_SlaveEndpointTest_AuthorizedRequest_1_6nsfR4/meta'
I0708 05:28:05.403256 29172 process.cpp:3322] Handling HTTP event for process 'slave(548)'
with path: '/slave(548)/monitor/statistics.json'
I0708 05:28:05.403820 29176 status_update_manager.cpp:200] Recovering status update manager
I0708 05:28:05.404011 29176 containerizer.cpp:522] Recovering containerizer
I0708 05:28:05.404347 29183 http.cpp:829] Authorizing principal 'test-principal' to GET the
'/monitor/statistics.json' endpoint
I0708 05:28:05.405621 29171 provisioner.cpp:253] Provisioner recovery complete
I0708 05:28:05.405915 29183 slave.cpp:4856] Finished recovery
I0708 05:28:05.406337 29183 slave.cpp:5028] Querying resource estimator for oversubscribable
resources
I0708 05:28:05.406514 29170 slave.cpp:5042] Received oversubscribable resources  from the
resource estimator
I0708 05:28:05.407467 29172 slave.cpp:841] Agent terminating
[       OK ] Endpoint/SlaveEndpointTest.AuthorizedRequest/1 (19 ms)
[ RUN      ] Endpoint/SlaveEndpointTest.AuthorizedRequest/2
I0708 05:28:05.416316 29150 containerizer.cpp:196] Using isolation: posix/cpu,posix/mem,filesystem/posix,network/cni
W0708 05:28:05.416991 29150 backend.cpp:75] Failed to create 'aufs' backend: AufsBackend requires
root privileges, but is running as user mesos
W0708 05:28:05.417129 29150 backend.cpp:75] Failed to create 'bind' backend: BindBackend requires
root privileges
I0708 05:28:05.419657 29179 slave.cpp:205] Agent started on 549)@172.17.0.3:51808
I0708 05:28:05.419679 29179 slave.cpp:206] Flags at startup: --acls="" --appc_simple_discovery_uri_prefix="http://"
--appc_store_dir="/tmp/mesos/store/appc" --authenticate_http="true" --authenticatee="crammd5"
--authentication_backoff_factor="1secs" --authorizer="local" --cgroups_cpu_enable_pids_and_tids_count="false"
--cgroups_enable_cfs="false" --cgroups_hierarchy="/sys/fs/cgroup" --cgroups_limit_swap="false"
--cgroups_root="mesos" --container_disk_watch_interval="15secs" --containerizers="mesos" --credential="/tmp/Endpoint_SlaveEndpointTest_AuthorizedRequest_2_dr7rbT/credential"
--default_role="*" --disk_watch_interval="1mins" --docker="docker" --docker_kill_orphans="true"
--docker_registry="https://registry-1.docker.io" --docker_remove_delay="6hrs" --docker_socket="/var/run/docker.sock"
--docker_stop_timeout="0ns" --docker_store_dir="/tmp/mesos/store/docker" --docker_volume_checkpoint_dir="/var/run/mesos/isolators/docker/volume"
--enforce_container_disk_quota="false" --executor_registration_timeout="1mins" --executor_shutdown_grace_period="5secs"
--fetcher_cache_dir="/tmp/Endpoint_SlaveEndpointTest_AuthorizedRequest_2_dr7rbT/fetch" --fetcher_cache_size="2GB"
--frameworks_home="" --gc_delay="1weeks" --gc_disk_headroom="0.1" --hadoop_home="" --help="true"
--hostname_lookup="true" --http_authenticators="basic" --http_command_executor="false" --http_credentials="/tmp/Endpoint_SlaveEndpointTest_AuthorizedRequest_2_dr7rbT/http_credentials"
--image_provisioner_backend="copy" --initialize_driver_logging="true" --isolation="posix/cpu,posix/mem"
--launcher_dir="/mesos/mesos-1.1.0/_build/src" --logbufsecs="0" --logging_level="INFO" --oversubscribed_resources_interval="15secs"
--perf_duration="10secs" --perf_interval="1mins" --qos_correction_interval_min="0ns" --quiet="false"
--recover="reconnect" --recovery_timeout="15mins" --registration_backoff_factor="10ms" --resources="cpus:2;gpus:0;mem:1024;disk:1024;ports:[31000-32000]"
--revocable_cpu_low_priority="true" --sandbox_directory="/mnt/mesos/sandbox" --strict="true"
--switch_user="true" --systemd_enable_support="true" --systemd_runtime_directory="/run/systemd/system"
--version="false" --work_dir="/tmp/Endpoint_SlaveEndpointTest_AuthorizedRequest_2_dr7rbT"
I0708 05:28:05.420106 29179 credentials.hpp:86] Loading credential for authentication from
'/tmp/Endpoint_SlaveEndpointTest_AuthorizedRequest_2_dr7rbT/credential'
I0708 05:28:05.420279 29179 slave.cpp:343] Agent using credential for: test-principal
I0708 05:28:05.420311 29179 credentials.hpp:37] Loading credentials for authentication from
'/tmp/Endpoint_SlaveEndpointTest_AuthorizedRequest_2_dr7rbT/http_credentials'
I0708 05:28:05.420636 29179 slave.cpp:395] Using default 'basic' HTTP authenticator
I0708 05:28:05.421054 29179 resources.cpp:572] Parsing resources as JSON failed: cpus:2;gpus:0;mem:1024;disk:1024;ports:[31000-32000]
Trying semicolon-delimited string format instead
I0708 05:28:05.421555 29179 resources.cpp:572] Parsing resources as JSON failed: cpus:2;gpus:0;mem:1024;disk:1024;ports:[31000-32000]
Trying semicolon-delimited string format instead
I0708 05:28:05.422082 29179 slave.cpp:594] Agent resources: cpus(*):2; mem(*):1024; disk(*):1024;
ports(*):[31000-32000]
I0708 05:28:05.422158 29179 slave.cpp:602] Agent attributes: [  ]
I0708 05:28:05.422173 29179 slave.cpp:607] Agent hostname: f23a7516267c
I0708 05:28:05.424087 29183 state.cpp:57] Recovering state from '/tmp/Endpoint_SlaveEndpointTest_AuthorizedRequest_2_dr7rbT/meta'
I0708 05:28:05.424105 29179 process.cpp:3322] Handling HTTP event for process 'slave(549)'
with path: '/slave(549)/containers'
I0708 05:28:05.424625 29169 status_update_manager.cpp:200] Recovering status update manager
I0708 05:28:05.424993 29184 containerizer.cpp:522] Recovering containerizer
I0708 05:28:05.425190 29172 http.cpp:829] Authorizing principal 'test-principal' to GET the
'/containers' endpoint
I0708 05:28:05.426518 29175 provisioner.cpp:253] Provisioner recovery complete
I0708 05:28:05.426957 29183 slave.cpp:4856] Finished recovery
I0708 05:28:05.427355 29183 slave.cpp:5028] Querying resource estimator for oversubscribable
resources
I0708 05:28:05.427543 29177 slave.cpp:5042] Received oversubscribable resources  from the
resource estimator
I0708 05:28:05.428625 29179 slave.cpp:841] Agent terminating
[       OK ] Endpoint/SlaveEndpointTest.AuthorizedRequest/2 (19 ms)
[ RUN      ] Endpoint/SlaveEndpointTest.UnauthorizedRequest/0
I0708 05:28:05.436614 29150 containerizer.cpp:196] Using isolation: posix/cpu,posix/mem,filesystem/posix,network/cni
W0708 05:28:05.437245 29150 backend.cpp:75] Failed to create 'aufs' backend: AufsBackend requires
root privileges, but is running as user mesos
W0708 05:28:05.437372 29150 backend.cpp:75] Failed to create 'bind' backend: BindBackend requires
root privileges
I0708 05:28:05.439888 29170 slave.cpp:205] Agent started on 550)@172.17.0.3:51808
I0708 05:28:05.439906 29170 slave.cpp:206] Flags at startup: --acls="" --appc_simple_discovery_uri_prefix="http://"
--appc_store_dir="/tmp/mesos/store/appc" --authenticate_http="true" --authenticatee="crammd5"
--authentication_backoff_factor="1secs" --authorizer="local" --cgroups_cpu_enable_pids_and_tids_count="false"
--cgroups_enable_cfs="false" --cgroups_hierarchy="/sys/fs/cgroup" --cgroups_limit_swap="false"
--cgroups_root="mesos" --container_disk_watch_interval="15secs" --containerizers="mesos" --credential="/tmp/Endpoint_SlaveEndpointTest_UnauthorizedRequest_0_S0HJFH/credential"
--default_role="*" --disk_watch_interval="1mins" --docker="docker" --docker_kill_orphans="true"
--docker_registry="https://registry-1.docker.io" --docker_remove_delay="6hrs" --docker_socket="/var/run/docker.sock"
--docker_stop_timeout="0ns" --docker_store_dir="/tmp/mesos/store/docker" --docker_volume_checkpoint_dir="/var/run/mesos/isolators/docker/volume"
--enforce_container_disk_quota="false" --executor_registration_timeout="1mins" --executor_shutdown_grace_period="5secs"
--fetcher_cache_dir="/tmp/Endpoint_SlaveEndpointTest_UnauthorizedRequest_0_S0HJFH/fetch" --fetcher_cache_size="2GB"
--frameworks_home="" --gc_delay="1weeks" --gc_disk_headroom="0.1" --hadoop_home="" --help="true"
--hostname_lookup="true" --http_authenticators="basic" --http_command_executor="false" --http_credentials="/tmp/Endpoint_SlaveEndpointTest_UnauthorizedRequest_0_S0HJFH/http_credentials"
--image_provisioner_backend="copy" --initialize_driver_logging="true" --isolation="posix/cpu,posix/mem"
--launcher_dir="/mesos/mesos-1.1.0/_build/src" --logbufsecs="0" --logging_level="INFO" --oversubscribed_resources_interval="15secs"
--perf_duration="10secs" --perf_interval="1mins" --qos_correction_interval_min="0ns" --quiet="false"
--recover="reconnect" --recovery_timeout="15mins" --registration_backoff_factor="10ms" --resources="cpus:2;gpus:0;mem:1024;disk:1024;ports:[31000-32000]"
--revocable_cpu_low_priority="true" --sandbox_directory="/mnt/mesos/sandbox" --strict="true"
--switch_user="true" --systemd_enable_support="true" --systemd_runtime_directory="/run/systemd/system"
--version="false" --work_dir="/tmp/Endpoint_SlaveEndpointTest_UnauthorizedRequest_0_S0HJFH"
I0708 05:28:05.440330 29170 credentials.hpp:86] Loading credential for authentication from
'/tmp/Endpoint_SlaveEndpointTest_UnauthorizedRequest_0_S0HJFH/credential'
I0708 05:28:05.440445 29170 slave.cpp:343] Agent using credential for: test-principal
I0708 05:28:05.440472 29170 credentials.hpp:37] Loading credentials for authentication from
'/tmp/Endpoint_SlaveEndpointTest_UnauthorizedRequest_0_S0HJFH/http_credentials'
I0708 05:28:05.440672 29170 slave.cpp:395] Using default 'basic' HTTP authenticator
I0708 05:28:05.441082 29170 resources.cpp:572] Parsing resources as JSON failed: cpus:2;gpus:0;mem:1024;disk:1024;ports:[31000-32000]
Trying semicolon-delimited string format instead
I0708 05:28:05.441536 29170 resources.cpp:572] Parsing resources as JSON failed: cpus:2;gpus:0;mem:1024;disk:1024;ports:[31000-32000]
Trying semicolon-delimited string format instead
I0708 05:28:05.442142 29170 slave.cpp:594] Agent resources: cpus(*):2; mem(*):1024; disk(*):1024;
ports(*):[31000-32000]
I0708 05:28:05.442216 29170 slave.cpp:602] Agent attributes: [  ]
I0708 05:28:05.442229 29170 slave.cpp:607] Agent hostname: f23a7516267c
I0708 05:28:05.443717 29180 state.cpp:57] Recovering state from '/tmp/Endpoint_SlaveEndpointTest_UnauthorizedRequest_0_S0HJFH/meta'
I0708 05:28:05.443774 29170 process.cpp:3322] Handling HTTP event for process 'slave(550)'
with path: '/slave(550)/monitor/statistics'
I0708 05:28:05.444370 29176 status_update_manager.cpp:200] Recovering status update manager
I0708 05:28:05.444706 29180 containerizer.cpp:522] Recovering containerizer
I0708 05:28:05.444862 29177 http.cpp:829] Authorizing principal 'test-principal' to GET the
'/monitor/statistics' endpoint
I0708 05:28:05.445998 29180 provisioner.cpp:253] Provisioner recovery complete
I0708 05:28:05.446274 29172 slave.cpp:4856] Finished recovery
I0708 05:28:05.446701 29172 slave.cpp:5028] Querying resource estimator for oversubscribable
resources
I0708 05:28:05.446813 29172 slave.cpp:841] Agent terminating
[       OK ] Endpoint/SlaveEndpointTest.UnauthorizedRequest/0 (18 ms)
[ RUN      ] Endpoint/SlaveEndpointTest.UnauthorizedRequest/1
I0708 05:28:05.455155 29150 containerizer.cpp:196] Using isolation: posix/cpu,posix/mem,filesystem/posix,network/cni
W0708 05:28:05.455905 29150 backend.cpp:75] Failed to create 'aufs' backend: AufsBackend requires
root privileges, but is running as user mesos
W0708 05:28:05.456073 29150 backend.cpp:75] Failed to create 'bind' backend: BindBackend requires
root privileges
I0708 05:28:05.458849 29184 slave.cpp:205] Agent started on 551)@172.17.0.3:51808
I0708 05:28:05.458873 29184 slave.cpp:206] Flags at startup: --acls="" --appc_simple_discovery_uri_prefix="http://"
--appc_store_dir="/tmp/mesos/store/appc" --authenticate_http="true" --authenticatee="crammd5"
--authentication_backoff_factor="1secs" --authorizer="local" --cgroups_cpu_enable_pids_and_tids_count="false"
--cgroups_enable_cfs="false" --cgroups_hierarchy="/sys/fs/cgroup" --cgroups_limit_swap="false"
--cgroups_root="mesos" --container_disk_watch_interval="15secs" --containerizers="mesos" --credential="/tmp/Endpoint_SlaveEndpointTest_UnauthorizedRequest_1_tZr4iw/credential"
--default_role="*" --disk_watch_interval="1mins" --docker="docker" --docker_kill_orphans="true"
--docker_registry="https://registry-1.docker.io" --docker_remove_delay="6hrs" --docker_socket="/var/run/docker.sock"
--docker_stop_timeout="0ns" --docker_store_dir="/tmp/mesos/store/docker" --docker_volume_checkpoint_dir="/var/run/mesos/isolators/docker/volume"
--enforce_container_disk_quota="false" --executor_registration_timeout="1mins" --executor_shutdown_grace_period="5secs"
--fetcher_cache_dir="/tmp/Endpoint_SlaveEndpointTest_UnauthorizedRequest_1_tZr4iw/fetch" --fetcher_cache_size="2GB"
--frameworks_home="" --gc_delay="1weeks" --gc_disk_headroom="0.1" --hadoop_home="" --help="true"
--hostname_lookup="true" --http_authenticators="basic" --http_command_executor="false" --http_credentials="/tmp/Endpoint_SlaveEndpointTest_UnauthorizedRequest_1_tZr4iw/http_credentials"
--image_provisioner_backend="copy" --initialize_driver_logging="true" --isolation="posix/cpu,posix/mem"
--launcher_dir="/mesos/mesos-1.1.0/_build/src" --logbufsecs="0" --logging_level="INFO" --oversubscribed_resources_interval="15secs"
--perf_duration="10secs" --perf_interval="1mins" --qos_correction_interval_min="0ns" --quiet="false"
--recover="reconnect" --recovery_timeout="15mins" --registration_backoff_factor="10ms" --resources="cpus:2;gpus:0;mem:1024;disk:1024;ports:[31000-32000]"
--revocable_cpu_low_priority="true" --sandbox_directory="/mnt/mesos/sandbox" --strict="true"
--switch_user="true" --systemd_enable_support="true" --systemd_runtime_directory="/run/systemd/system"
--version="false" --work_dir="/tmp/Endpoint_SlaveEndpointTest_UnauthorizedRequest_1_tZr4iw"
I0708 05:28:05.459280 29184 credentials.hpp:86] Loading credential for authentication from
'/tmp/Endpoint_SlaveEndpointTest_UnauthorizedRequest_1_tZr4iw/credential'
I0708 05:28:05.459429 29184 slave.cpp:343] Agent using credential for: test-principal
I0708 05:28:05.459460 29184 credentials.hpp:37] Loading credentials for authentication from
'/tmp/Endpoint_SlaveEndpointTest_UnauthorizedRequest_1_tZr4iw/http_credentials'
I0708 05:28:05.459684 29184 slave.cpp:395] Using default 'basic' HTTP authenticator
I0708 05:28:05.460196 29184 resources.cpp:572] Parsing resources as JSON failed: cpus:2;gpus:0;mem:1024;disk:1024;ports:[31000-32000]
Trying semicolon-delimited string format instead
I0708 05:28:05.460538 29184 resources.cpp:572] Parsing resources as JSON failed: cpus:2;gpus:0;mem:1024;disk:1024;ports:[31000-32000]
Trying semicolon-delimited string format instead
I0708 05:28:05.461045 29184 slave.cpp:594] Agent resources: cpus(*):2; mem(*):1024; disk(*):1024;
ports(*):[31000-32000]
I0708 05:28:05.461119 29184 slave.cpp:602] Agent attributes: [  ]
I0708 05:28:05.461140 29184 slave.cpp:607] Agent hostname: f23a7516267c
I0708 05:28:05.462649 29183 state.cpp:57] Recovering state from '/tmp/Endpoint_SlaveEndpointTest_UnauthorizedRequest_1_tZr4iw/meta'
I0708 05:28:05.462718 29184 process.cpp:3322] Handling HTTP event for process 'slave(551)'
with path: '/slave(551)/monitor/statistics.json'
I0708 05:28:05.463345 29183 status_update_manager.cpp:200] Recovering status update manager
I0708 05:28:05.463551 29170 containerizer.cpp:522] Recovering containerizer
I0708 05:28:05.463836 29171 http.cpp:829] Authorizing principal 'test-principal' to GET the
'/monitor/statistics.json' endpoint
I0708 05:28:05.465082 29180 provisioner.cpp:253] Provisioner recovery complete
I0708 05:28:05.465386 29172 slave.cpp:4856] Finished recovery
I0708 05:28:05.465843 29172 slave.cpp:5028] Querying resource estimator for oversubscribable
resources
I0708 05:28:05.466099 29179 slave.cpp:5042] Received oversubscribable resources  from the
resource estimator
I0708 05:28:05.466696 29184 slave.cpp:841] Agent terminating
[       OK ] Endpoint/SlaveEndpointTest.UnauthorizedRequest/1 (19 ms)
[ RUN      ] Endpoint/SlaveEndpointTest.UnauthorizedRequest/2
I0708 05:28:05.475184 29150 containerizer.cpp:196] Using isolation: posix/cpu,posix/mem,filesystem/posix,network/cni
W0708 05:28:05.475778 29150 backend.cpp:75] Failed to create 'aufs' backend: AufsBackend requires
root privileges, but is running as user mesos
W0708 05:28:05.475916 29150 backend.cpp:75] Failed to create 'bind' backend: BindBackend requires
root privileges
I0708 05:28:05.478693 29173 slave.cpp:205] Agent started on 552)@172.17.0.3:51808
I0708 05:28:05.478718 29173 slave.cpp:206] Flags at startup: --acls="" --appc_simple_discovery_uri_prefix="http://"
--appc_store_dir="/tmp/mesos/store/appc" --authenticate_http="true" --authenticatee="crammd5"
--authentication_backoff_factor="1secs" --authorizer="local" --cgroups_cpu_enable_pids_and_tids_count="false"
--cgroups_enable_cfs="false" --cgroups_hierarchy="/sys/fs/cgroup" --cgroups_limit_swap="false"
--cgroups_root="mesos" --container_disk_watch_interval="15secs" --containerizers="mesos" --credential="/tmp/Endpoint_SlaveEndpointTest_UnauthorizedRequest_2_yBg65k/credential"
--default_role="*" --disk_watch_interval="1mins" --docker="docker" --docker_kill_orphans="true"
--docker_registry="https://registry-1.docker.io" --docker_remove_delay="6hrs" --docker_socket="/var/run/docker.sock"
--docker_stop_timeout="0ns" --docker_store_dir="/tmp/mesos/store/docker" --docker_volume_checkpoint_dir="/var/run/mesos/isolators/docker/volume"
--enforce_container_disk_quota="false" --executor_registration_timeout="1mins" --executor_shutdown_grace_period="5secs"
--fetcher_cache_dir="/tmp/Endpoint_SlaveEndpointTest_UnauthorizedRequest_2_yBg65k/fetch" --fetcher_cache_size="2GB"
--frameworks_home="" --gc_delay="1weeks" --gc_disk_headroom="0.1" --hadoop_home="" --help="true"
--hostname_lookup="true" --http_authenticators="basic" --http_command_executor="false" --http_credentials="/tmp/Endpoint_SlaveEndpointTest_UnauthorizedRequest_2_yBg65k/http_credentials"
--image_provisioner_backend="copy" --initialize_driver_logging="true" --isolation="posix/cpu,posix/mem"
--launcher_dir="/mesos/mesos-1.1.0/_build/src" --logbufsecs="0" --logging_level="INFO" --oversubscribed_resources_interval="15secs"
--perf_duration="10secs" --perf_interval="1mins" --qos_correction_interval_min="0ns" --quiet="false"
--recover="reconnect" --recovery_timeout="15mins" --registration_backoff_factor="10ms" --resources="cpus:2;gpus:0;mem:1024;disk:1024;ports:[31000-32000]"
--revocable_cpu_low_priority="true" --sandbox_directory="/mnt/mesos/sandbox" --strict="true"
--switch_user="true" --systemd_enable_support="true" --systemd_runtime_directory="/run/systemd/system"
--version="false" --work_dir="/tmp/Endpoint_SlaveEndpointTest_UnauthorizedRequest_2_yBg65k"
I0708 05:28:05.479305 29173 credentials.hpp:86] Loading credential for authentication from
'/tmp/Endpoint_SlaveEndpointTest_UnauthorizedRequest_2_yBg65k/credential'
I0708 05:28:05.479454 29173 slave.cpp:343] Agent using credential for: test-principal
I0708 05:28:05.479485 29173 credentials.hpp:37] Loading credentials for authentication from
'/tmp/Endpoint_SlaveEndpointTest_UnauthorizedRequest_2_yBg65k/http_credentials'
I0708 05:28:05.479699 29173 slave.cpp:395] Using default 'basic' HTTP authenticator
I0708 05:28:05.480154 29173 resources.cpp:572] Parsing resources as JSON failed: cpus:2;gpus:0;mem:1024;disk:1024;ports:[31000-32000]
Trying semicolon-delimited string format instead
I0708 05:28:05.480492 29173 resources.cpp:572] Parsing resources as JSON failed: cpus:2;gpus:0;mem:1024;disk:1024;ports:[31000-32000]
Trying semicolon-delimited string format instead
I0708 05:28:05.480986 29173 slave.cpp:594] Agent resources: cpus(*):2; mem(*):1024; disk(*):1024;
ports(*):[31000-32000]
I0708 05:28:05.481063 29173 slave.cpp:602] Agent attributes: [  ]
I0708 05:28:05.481076 29173 slave.cpp:607] Agent hostname: f23a7516267c
I0708 05:28:05.482750 29184 state.cpp:57] Recovering state from '/tmp/Endpoint_SlaveEndpointTest_UnauthorizedRequest_2_yBg65k/meta'
I0708 05:28:05.482812 29173 process.cpp:3322] Handling HTTP event for process 'slave(552)'
with path: '/slave(552)/containers'
I0708 05:28:05.483517 29179 status_update_manager.cpp:200] Recovering status update manager
I0708 05:28:05.483881 29184 containerizer.cpp:522] Recovering containerizer
I0708 05:28:05.483954 29175 http.cpp:829] Authorizing principal 'test-principal' to GET the
'/containers' endpoint
I0708 05:28:05.485770 29183 provisioner.cpp:253] Provisioner recovery complete
I0708 05:28:05.486222 29177 slave.cpp:4856] Finished recovery
I0708 05:28:05.486692 29177 slave.cpp:5028] Querying resource estimator for oversubscribable
resources
I0708 05:28:05.486860 29177 slave.cpp:841] Agent terminating
[       OK ] Endpoint/SlaveEndpointTest.UnauthorizedRequest/2 (18 ms)
[ RUN      ] Endpoint/SlaveEndpointTest.NoAuthorizer/0
I0708 05:28:05.500898 29150 containerizer.cpp:196] Using isolation: posix/cpu,posix/mem,filesystem/posix,network/cni
W0708 05:28:05.501497 29150 backend.cpp:75] Failed to create 'aufs' backend: AufsBackend requires
root privileges, but is running as user mesos
W0708 05:28:05.501655 29150 backend.cpp:75] Failed to create 'bind' backend: BindBackend requires
root privileges
I0708 05:28:05.502950 29150 cluster.cpp:432] Creating default 'local' authorizer
I0708 05:28:05.504372 29183 slave.cpp:205] Agent started on 553)@172.17.0.3:51808
I0708 05:28:05.504395 29183 slave.cpp:206] Flags at startup: --acls="" --appc_simple_discovery_uri_prefix="http://"
--appc_store_dir="/tmp/mesos/store/appc" --authenticate_http="true" --authenticatee="crammd5"
--authentication_backoff_factor="1secs" --authorizer="local" --cgroups_cpu_enable_pids_and_tids_count="false"
--cgroups_enable_cfs="false" --cgroups_hierarchy="/sys/fs/cgroup" --cgroups_limit_swap="false"
--cgroups_root="mesos" --container_disk_watch_interval="15secs" --containerizers="mesos" --credential="/tmp/Endpoint_SlaveEndpointTest_NoAuthorizer_0_b11Q49/credential"
--default_role="*" --disk_watch_interval="1mins" --docker="docker" --docker_kill_orphans="true"
--docker_registry="https://registry-1.docker.io" --docker_remove_delay="6hrs" --docker_socket="/var/run/docker.sock"
--docker_stop_timeout="0ns" --docker_store_dir="/tmp/mesos/store/docker" --docker_volume_checkpoint_dir="/var/run/mesos/isolators/docker/volume"
--enforce_container_disk_quota="false" --executor_registration_timeout="1mins" --executor_shutdown_grace_period="5secs"
--fetcher_cache_dir="/tmp/Endpoint_SlaveEndpointTest_NoAuthorizer_0_b11Q49/fetch" --fetcher_cache_size="2GB"
--frameworks_home="" --gc_delay="1weeks" --gc_disk_headroom="0.1" --hadoop_home="" --help="false"
--hostname_lookup="true" --http_authenticators="basic" --http_command_executor="false" --http_credentials="/tmp/Endpoint_SlaveEndpointTest_NoAuthorizer_0_b11Q49/http_credentials"
--image_provisioner_backend="copy" --initialize_driver_logging="true" --isolation="posix/cpu,posix/mem"
--launcher_dir="/mesos/mesos-1.1.0/_build/src" --logbufsecs="0" --logging_level="INFO" --oversubscribed_resources_interval="15secs"
--perf_duration="10secs" --perf_interval="1mins" --qos_correction_interval_min="0ns" --quiet="false"
--recover="reconnect" --recovery_timeout="15mins" --registration_backoff_factor="10ms" --resources="cpus:2;gpus:0;mem:1024;disk:1024;ports:[31000-32000]"
--revocable_cpu_low_priority="true" --sandbox_directory="/mnt/mesos/sandbox" --strict="true"
--switch_user="true" --systemd_enable_support="true" --systemd_runtime_directory="/run/systemd/system"
--version="false" --work_dir="/tmp/Endpoint_SlaveEndpointTest_NoAuthorizer_0_b11Q49"
I0708 05:28:05.504796 29183 credentials.hpp:86] Loading credential for authentication from
'/tmp/Endpoint_SlaveEndpointTest_NoAuthorizer_0_b11Q49/credential'
I0708 05:28:05.504983 29183 slave.cpp:343] Agent using credential for: test-principal
I0708 05:28:05.505020 29183 credentials.hpp:37] Loading credentials for authentication from
'/tmp/Endpoint_SlaveEndpointTest_NoAuthorizer_0_b11Q49/http_credentials'
I0708 05:28:05.505218 29183 slave.cpp:395] Using default 'basic' HTTP authenticator
I0708 05:28:05.505518 29183 resources.cpp:572] Parsing resources as JSON failed: cpus:2;gpus:0;mem:1024;disk:1024;ports:[31000-32000]
Trying semicolon-delimited string format instead
I0708 05:28:05.505774 29183 resources.cpp:572] Parsing resources as JSON failed: cpus:2;gpus:0;mem:1024;disk:1024;ports:[31000-32000]
Trying semicolon-delimited string format instead
I0708 05:28:05.506095 29183 slave.cpp:594] Agent resources: cpus(*):2; mem(*):1024; disk(*):1024;
ports(*):[31000-32000]
I0708 05:28:05.506150 29183 slave.cpp:602] Agent attributes: [  ]
I0708 05:28:05.506160 29183 slave.cpp:607] Agent hostname: f23a7516267c
I0708 05:28:05.507387 29179 state.cpp:57] Recovering state from '/tmp/Endpoint_SlaveEndpointTest_NoAuthorizer_0_b11Q49/meta'
I0708 05:28:05.507447 29183 process.cpp:3322] Handling HTTP event for process 'slave(553)'
with path: '/slave(553)/monitor/statistics'
I0708 05:28:05.507904 29181 status_update_manager.cpp:200] Recovering status update manager
I0708 05:28:05.508136 29172 containerizer.cpp:522] Recovering containerizer
I0708 05:28:05.508594 29178 http.cpp:829] Authorizing principal 'test-principal' to GET the
'/monitor/statistics' endpoint
I0708 05:28:05.509610 29169 provisioner.cpp:253] Provisioner recovery complete
I0708 05:28:05.510489 29173 slave.cpp:4856] Finished recovery
I0708 05:28:05.511160 29173 slave.cpp:5028] Querying resource estimator for oversubscribable
resources
I0708 05:28:05.511351 29182 slave.cpp:5042] Received oversubscribable resources  from the
resource estimator
I0708 05:28:05.512377 29172 slave.cpp:841] Agent terminating
[       OK ] Endpoint/SlaveEndpointTest.NoAuthorizer/0 (18 ms)
[ RUN      ] Endpoint/SlaveEndpointTest.NoAuthorizer/1
I0708 05:28:05.527075 29150 containerizer.cpp:196] Using isolation: posix/cpu,posix/mem,filesystem/posix,network/cni
W0708 05:28:05.527688 29150 backend.cpp:75] Failed to create 'aufs' backend: AufsBackend requires
root privileges, but is running as user mesos
W0708 05:28:05.527820 29150 backend.cpp:75] Failed to create 'bind' backend: BindBackend requires
root privileges
I0708 05:28:05.529120 29150 cluster.cpp:432] Creating default 'local' authorizer
I0708 05:28:05.530515 29177 slave.cpp:205] Agent started on 554)@172.17.0.3:51808
I0708 05:28:05.530580 29177 slave.cpp:206] Flags at startup: --acls="" --appc_simple_discovery_uri_prefix="http://"
--appc_store_dir="/tmp/mesos/store/appc" --authenticate_http="true" --authenticatee="crammd5"
--authentication_backoff_factor="1secs" --authorizer="local" --cgroups_cpu_enable_pids_and_tids_count="false"
--cgroups_enable_cfs="false" --cgroups_hierarchy="/sys/fs/cgroup" --cgroups_limit_swap="false"
--cgroups_root="mesos" --container_disk_watch_interval="15secs" --containerizers="mesos" --credential="/tmp/Endpoint_SlaveEndpointTest_NoAuthorizer_1_r77AfZ/credential"
--default_role="*" --disk_watch_interval="1mins" --docker="docker" --docker_kill_orphans="true"
--docker_registry="https://registry-1.docker.io" --docker_remove_delay="6hrs" --docker_socket="/var/run/docker.sock"
--docker_stop_timeout="0ns" --docker_store_dir="/tmp/mesos/store/docker" --docker_volume_checkpoint_dir="/var/run/mesos/isolators/docker/volume"
--enforce_container_disk_quota="false" --executor_registration_timeout="1mins" --executor_shutdown_grace_period="5secs"
--fetcher_cache_dir="/tmp/Endpoint_SlaveEndpointTest_NoAuthorizer_1_r77AfZ/fetch" --fetcher_cache_size="2GB"
--frameworks_home="" --gc_delay="1weeks" --gc_disk_headroom="0.1" --hadoop_home="" --help="false"
--hostname_lookup="true" --http_authenticators="basic" --http_command_executor="false" --http_credentials="/tmp/Endpoint_SlaveEndpointTest_NoAuthorizer_1_r77AfZ/http_credentials"
--image_provisioner_backend="copy" --initialize_driver_logging="true" --isolation="posix/cpu,posix/mem"
--launcher_dir="/mesos/mesos-1.1.0/_build/src" --logbufsecs="0" --logging_level="INFO" --oversubscribed_resources_interval="15secs"
--perf_duration="10secs" --perf_interval="1mins" --qos_correction_interval_min="0ns" --quiet="false"
--recover="reconnect" --recovery_timeout="15mins" --registration_backoff_factor="10ms" --resources="cpus:2;gpus:0;mem:1024;disk:1024;ports:[31000-32000]"
--revocable_cpu_low_priority="true" --sandbox_directory="/mnt/mesos/sandbox" --strict="true"
--switch_user="true" --systemd_enable_support="true" --systemd_runtime_directory="/run/systemd/system"
--version="false" --work_dir="/tmp/Endpoint_SlaveEndpointTest_NoAuthorizer_1_r77AfZ"
I0708 05:28:05.531041 29177 credentials.hpp:86] Loading credential for authentication from
'/tmp/Endpoint_SlaveEndpointTest_NoAuthorizer_1_r77AfZ/credential'
I0708 05:28:05.531222 29177 slave.cpp:343] Agent using credential for: test-principal
I0708 05:28:05.531349 29177 credentials.hpp:37] Loading credentials for authentication from
'/tmp/Endpoint_SlaveEndpointTest_NoAuthorizer_1_r77AfZ/http_credentials'
I0708 05:28:05.531651 29177 slave.cpp:395] Using default 'basic' HTTP authenticator
I0708 05:28:05.531968 29177 resources.cpp:572] Parsing resources as JSON failed: cpus:2;gpus:0;mem:1024;disk:1024;ports:[31000-32000]
Trying semicolon-delimited string format instead
I0708 05:28:05.532320 29177 resources.cpp:572] Parsing resources as JSON failed: cpus:2;gpus:0;mem:1024;disk:1024;ports:[31000-32000]
Trying semicolon-delimited string format instead
I0708 05:28:05.532696 29177 slave.cpp:594] Agent resources: cpus(*):2; mem(*):1024; disk(*):1024;
ports(*):[31000-32000]
I0708 05:28:05.532749 29177 slave.cpp:602] Agent attributes: [  ]
I0708 05:28:05.532759 29177 slave.cpp:607] Agent hostname: f23a7516267c
I0708 05:28:05.534137 29172 state.cpp:57] Recovering state from '/tmp/Endpoint_SlaveEndpointTest_NoAuthorizer_1_r77AfZ/meta'
I0708 05:28:05.534216 29177 process.cpp:3322] Handling HTTP event for process 'slave(554)'
with path: '/slave(554)/monitor/statistics.json'
I0708 05:28:05.534631 29180 status_update_manager.cpp:200] Recovering status update manager
I0708 05:28:05.534803 29171 containerizer.cpp:522] Recovering containerizer
I0708 05:28:05.535094 29179 http.cpp:829] Authorizing principal 'test-principal' to GET the
'/monitor/statistics.json' endpoint
I0708 05:28:05.536053 29178 provisioner.cpp:253] Provisioner recovery complete
I0708 05:28:05.536458 29172 slave.cpp:4856] Finished recovery
I0708 05:28:05.536912 29172 slave.cpp:5028] Querying resource estimator for oversubscribable
resources
I0708 05:28:05.537247 29176 slave.cpp:5042] Received oversubscribable resources  from the
resource estimator
I0708 05:28:05.538452 29182 slave.cpp:841] Agent terminating
[       OK ] Endpoint/SlaveEndpointTest.NoAuthorizer/1 (21 ms)
[ RUN      ] Endpoint/SlaveEndpointTest.NoAuthorizer/2
I0708 05:28:05.549129 29150 containerizer.cpp:196] Using isolation: posix/cpu,posix/mem,filesystem/posix,network/cni
W0708 05:28:05.549981 29150 backend.cpp:75] Failed to create 'aufs' backend: AufsBackend requires
root privileges, but is running as user mesos
W0708 05:28:05.550160 29150 backend.cpp:75] Failed to create 'bind' backend: BindBackend requires
root privileges
I0708 05:28:05.551849 29150 cluster.cpp:432] Creating default 'local' authorizer
I0708 05:28:05.553885 29181 slave.cpp:205] Agent started on 555)@172.17.0.3:51808
I0708 05:28:05.553942 29181 slave.cpp:206] Flags at startup: --acls="" --appc_simple_discovery_uri_prefix="http://"
--appc_store_dir="/tmp/mesos/store/appc" --authenticate_http="true" --authenticatee="crammd5"
--authentication_backoff_factor="1secs" --authorizer="local" --cgroups_cpu_enable_pids_and_tids_count="false"
--cgroups_enable_cfs="false" --cgroups_hierarchy="/sys/fs/cgroup" --cgroups_limit_swap="false"
--cgroups_root="mesos" --container_disk_watch_interval="15secs" --containerizers="mesos" --credential="/tmp/Endpoint_SlaveEndpointTest_NoAuthorizer_2_XVMIBO/credential"
--default_role="*" --disk_watch_interval="1mins" --docker="docker" --docker_kill_orphans="true"
--docker_registry="https://registry-1.docker.io" --docker_remove_delay="6hrs" --docker_socket="/var/run/docker.sock"
--docker_stop_timeout="0ns" --docker_store_dir="/tmp/mesos/store/docker" --docker_volume_checkpoint_dir="/var/run/mesos/isolators/docker/volume"
--enforce_container_disk_quota="false" --executor_registration_timeout="1mins" --executor_shutdown_grace_period="5secs"
--fetcher_cache_dir="/tmp/Endpoint_SlaveEndpointTest_NoAuthorizer_2_XVMIBO/fetch" --fetcher_cache_size="2GB"
--frameworks_home="" --gc_delay="1weeks" --gc_disk_headroom="0.1" --hadoop_home="" --help="false"
--hostname_lookup="true" --http_authenticators="basic" --http_command_executor="false" --http_credentials="/tmp/Endpoint_SlaveEndpointTest_NoAuthorizer_2_XVMIBO/http_credentials"
--image_provisioner_backend="copy" --initialize_driver_logging="true" --isolation="posix/cpu,posix/mem"
--launcher_dir="/mesos/mesos-1.1.0/_build/src" --logbufsecs="0" --logging_level="INFO" --oversubscribed_resources_interval="15secs"
--perf_duration="10secs" --perf_interval="1mins" --qos_correction_interval_min="0ns" --quiet="false"
--recover="reconnect" --recovery_timeout="15mins" --registration_backoff_factor="10ms" --resources="cpus:2;gpus:0;mem:1024;disk:1024;ports:[31000-32000]"
--revocable_cpu_low_priority="true" --sandbox_directory="/mnt/mesos/sandbox" --strict="true"
--switch_user="true" --systemd_enable_support="true" --systemd_runtime_directory="/run/systemd/system"
--version="false" --work_dir="/tmp/Endpoint_SlaveEndpointTest_NoAuthorizer_2_XVMIBO"
I0708 05:28:05.554509 29181 credentials.hpp:86] Loading credential for authentication from
'/tmp/Endpoint_SlaveEndpointTest_NoAuthorizer_2_XVMIBO/credential'
I0708 05:28:05.554752 29181 slave.cpp:343] Agent using credential for: test-principal
I0708 05:28:05.554797 29181 credentials.hpp:37] Loading credentials for authentication from
'/tmp/Endpoint_SlaveEndpointTest_NoAuthorizer_2_XVMIBO/http_credentials'
I0708 05:28:05.555084 29181 slave.cpp:395] Using default 'basic' HTTP authenticator
I0708 05:28:05.555397 29181 resources.cpp:572] Parsing resources as JSON failed: cpus:2;gpus:0;mem:1024;disk:1024;ports:[31000-32000]
Trying semicolon-delimited string format instead
I0708 05:28:05.555723 29181 resources.cpp:572] Parsing resources as JSON failed: cpus:2;gpus:0;mem:1024;disk:1024;ports:[31000-32000]
Trying semicolon-delimited string format instead
I0708 05:28:05.556198 29181 slave.cpp:594] Agent resources: cpus(*):2; mem(*):1024; disk(*):1024;
ports(*):[31000-32000]
I0708 05:28:05.556274 29181 slave.cpp:602] Agent attributes: [  ]
I0708 05:28:05.556288 29181 slave.cpp:607] Agent hostname: f23a7516267c
I0708 05:28:05.557579 29177 state.cpp:57] Recovering state from '/tmp/Endpoint_SlaveEndpointTest_NoAuthorizer_2_XVMIBO/meta'
I0708 05:28:05.557627 29181 process.cpp:3322] Handling HTTP event for process 'slave(555)'
with path: '/slave(555)/containers'
I0708 05:28:05.558131 29172 status_update_manager.cpp:200] Recovering status update manager
I0708 05:28:05.558396 29176 containerizer.cpp:522] Recovering containerizer
I0708 05:28:05.558437 29174 http.cpp:829] Authorizing principal 'test-principal' to GET the
'/containers' endpoint
I0708 05:28:05.559597 29183 provisioner.cpp:253] Provisioner recovery complete
I0708 05:28:05.559938 29175 slave.cpp:4856] Finished recovery
I0708 05:28:05.560350 29175 slave.cpp:5028] Querying resource estimator for oversubscribable
resources
I0708 05:28:05.560530 29172 slave.cpp:5042] Received oversubscribable resources  from the
resource estimator
I0708 05:28:05.562134 29174 slave.cpp:841] Agent terminating
[       OK ] Endpoint/SlaveEndpointTest.NoAuthorizer/2 (21 ms)
[----------] 9 tests from Endpoint/SlaveEndpointTest (203 ms total)

[----------] Global test environment tear-down
[==========] 1237 tests from 140 test cases ran. (882165 ms total)
[  PASSED  ] 1235 tests.
[  FAILED  ] 2 tests, listed below:
[  FAILED  ] ContentType/MasterAPITest.GetAgents/0, where GetParam() = application/x-protobuf
[  FAILED  ] ContentType/MasterAPITest.GetAgents/1, where GetParam() = application/json

 2 FAILED TESTS
  YOU HAVE 6 DISABLED TESTS

make[4]: *** [check-local] Error 1
make[4]: Leaving directory `/mesos/mesos-1.1.0/_build/src'
make[3]: *** [check-am] Error 2
make[3]: Leaving directory `/mesos/mesos-1.1.0/_build/src'
make[2]: *** [check] Error 2
make[2]: Leaving directory `/mesos/mesos-1.1.0/_build/src'
make[1]: *** [check-recursive] Error 1
make[1]: Leaving directory `/mesos/mesos-1.1.0/_build'
make: *** [distcheck] Error 1
+ docker rmi mesos-1467952926-19869
Untagged: mesos-1467952926-19869:latest
Deleted: 458362113dbbe36fa741278f0fa2a528573a0cc71a4c6858b8d33fd23db90593
Deleted: 7a67e6582f6a9d261df609f7476d426fe0b5dcb54f4a43d3c15f8e07c2d4cac5
Deleted: d14d003285b4db8da87fab98d73c7195b0e11514d19dfcb13c48ef0cd20ab73d
Deleted: 0e2a43d895756a1d397278a1c5cafa2d42f4cb8e4daedcc93fe37724af5146ce
Deleted: 4bf10c2cf34d4cb36534bcdc26fb948e8b80d129f9d966d89836d746888b9592
Deleted: d1a02c32b9a30b48df00290c9c9c7e87f87571bac60d50f046b7491b70d97524
Deleted: d82626007158feb5d56ffa176e72e8478b604669310ba6b21e705c3ee251d686
Deleted: d7278bf27d7775ee43fde30c7e51629262f832627e96afddfaf79e65967eccf2
Deleted: 49f518887c90d4a07236b0d309fdd9d9bd14f15c9b1c9b335c98e46a78e7340d
Deleted: c4b8560b932fe50d8618edbb0516bf2c3cc8a2ba54029c88f0206737072e1f3e
Deleted: 88d49f55a444175f90d0c9c8805e021303d7e2d1df8986d80faf847ceb6c94dc
Deleted: 3e94c01794f6f745f7837520ead7e7b652c9911ba74db43419ec6c53495ad577
Deleted: 60e157ac2c7b581a850c1a253b2f7c9db35179f2454ff32881b8b461b4943990
Deleted: 00ceb53167eddb3aeb8d7f4fdb700d53fdd94cde5162d3aaddd1abd8d8c07da8
Deleted: 4f2a4f589da0f8c90013802cf5a583bc3e55a4631b505578bacfdbf55dc21dd0
Deleted: 9aea81ea00e3d1775a39834b3e5230d7afc5cce97e42d82d907e84a53ba686f5
Build step 'Execute shell' marked build as failure

Mime
View raw message