mesos-builds mailing list archives

Site index · List index
Message view « Date » · « Thread »
Top « Date » · « Thread »
From Apache Jenkins Server <jenk...@builds.apache.org>
Subject Build failed in Jenkins: Mesos » cmake,gcc,--verbose --enable-libevent --enable-ssl,GLOG_v=1 MESOS_VERBOSE=1,centos:7,(docker||Hadoop)&&(!ubuntu-us1)&&(!ubuntu-6) #2451
Date Wed, 06 Jul 2016 05:12:10 GMT
See <https://builds.apache.org/job/Mesos/BUILDTOOL=cmake,COMPILER=gcc,CONFIGURATION=--verbose%20--enable-libevent%20--enable-ssl,ENVIRONMENT=GLOG_v=1%20MESOS_VERBOSE=1,OS=centos%3A7,label_exp=(docker%7C%7CHadoop)&&(!ubuntu-us1)&&(!ubuntu-6)/2451/changes>

Changes:

[bmahler] Added test for using an Nvidia Docker image.

[bmahler] Updated JSON::Value.find to return None when a Null is found.

[bmahler] Minor cleanups in JsonTest.Find.

[bmahler] Fixed a bug in JSON::Object.find: array subscript is dropped.

[bmahler] Fixed the docker executor to handle inspect failures.

------------------------------------------
[...truncated 7323 lines...]
[       OK ] UUIDTest.MalformedUUID (0 ms)
[----------] 2 tests from UUIDTest (0 ms total)

[----------] 2 tests from VersionTest
[ RUN      ] VersionTest.Comparison
[       OK ] VersionTest.Comparison (0 ms)
[ RUN      ] VersionTest.Parse
[       OK ] VersionTest.Parse (0 ms)
[----------] 2 tests from VersionTest (0 ms total)

[----------] 25 tests from FlagsTest
[ RUN      ] FlagsTest.Load
[       OK ] FlagsTest.Load (0 ms)
[ RUN      ] FlagsTest.Add
[       OK ] FlagsTest.Add (0 ms)
[ RUN      ] FlagsTest.Alias
[       OK ] FlagsTest.Alias (1 ms)
[ RUN      ] FlagsTest.Flags
[       OK ] FlagsTest.Flags (0 ms)
[ RUN      ] FlagsTest.LoadFromEnvironment
[       OK ] FlagsTest.LoadFromEnvironment (0 ms)
[ RUN      ] FlagsTest.LoadFromCommandLine
[       OK ] FlagsTest.LoadFromCommandLine (0 ms)
[ RUN      ] FlagsTest.LoadFromCommandLineWithNonFlags
[       OK ] FlagsTest.LoadFromCommandLineWithNonFlags (0 ms)
[ RUN      ] FlagsTest.LoadFromCommandLineWithDashDash
[       OK ] FlagsTest.LoadFromCommandLineWithDashDash (0 ms)
[ RUN      ] FlagsTest.LoadFromCommandLineAndUpdateArgcArgv
[       OK ] FlagsTest.LoadFromCommandLineAndUpdateArgcArgv (0 ms)
[ RUN      ] FlagsTest.Stringification
[       OK ] FlagsTest.Stringification (0 ms)
[ RUN      ] FlagsTest.EffectiveName
[       OK ] FlagsTest.EffectiveName (0 ms)
[ RUN      ] FlagsTest.DeprecationWarning
[       OK ] FlagsTest.DeprecationWarning (1 ms)
[ RUN      ] FlagsTest.DuplicatesFromEnvironment
[       OK ] FlagsTest.DuplicatesFromEnvironment (0 ms)
[ RUN      ] FlagsTest.DuplicatesFromCommandLine
[       OK ] FlagsTest.DuplicatesFromCommandLine (0 ms)
[ RUN      ] FlagsTest.AliasDuplicateFromCommandLine
[       OK ] FlagsTest.AliasDuplicateFromCommandLine (0 ms)
[ RUN      ] FlagsTest.Errors
[       OK ] FlagsTest.Errors (0 ms)
[ RUN      ] FlagsTest.MissingRequiredFlag
[       OK ] FlagsTest.MissingRequiredFlag (0 ms)
[ RUN      ] FlagsTest.Validate
[       OK ] FlagsTest.Validate (0 ms)
[ RUN      ] FlagsTest.Usage
[       OK ] FlagsTest.Usage (0 ms)
[ RUN      ] FlagsTest.UsageMessage
[       OK ] FlagsTest.UsageMessage (1 ms)
[ RUN      ] FlagsTest.EmptyUsage
[       OK ] FlagsTest.EmptyUsage (0 ms)
[ RUN      ] FlagsTest.ProgramName
[       OK ] FlagsTest.ProgramName (0 ms)
[ RUN      ] FlagsTest.OptionalMessage
[       OK ] FlagsTest.OptionalMessage (0 ms)
[ RUN      ] FlagsTest.Duration
[       OK ] FlagsTest.Duration (0 ms)
[ RUN      ] FlagsTest.JSON
[       OK ] FlagsTest.JSON (0 ms)
[----------] 25 tests from FlagsTest (3 ms total)

[----------] 2 tests from FlagsFileTest
[ RUN      ] FlagsFileTest.JSONFile
WARNING: Logging before InitGoogleLogging() is written to STDERR
W0706 05:12:11.169833 19630 parse.hpp:89] Specifying an absolute filename to read a command
line option out of without using 'file:// is deprecated and will be removed in a future release.
Simply adding 'file://' to the beginning of the path should eliminate this warning.
[       OK ] FlagsFileTest.JSONFile (1 ms)
[ RUN      ] FlagsFileTest.FilePrefix
[       OK ] FlagsFileTest.FilePrefix (0 ms)
[----------] 2 tests from FlagsFileTest (1 ms total)

[----------] 18 tests from OsTest
[ RUN      ] OsTest.Environment
[       OK ] OsTest.Environment (1 ms)
[ RUN      ] OsTest.Argv
[       OK ] OsTest.Argv (0 ms)
[ RUN      ] OsTest.System
sh: invalid.command: command not found
[       OK ] OsTest.System (15 ms)
[ RUN      ] OsTest.Cloexec
[       OK ] OsTest.Cloexec (0 ms)
[ RUN      ] OsTest.Nonblock
[       OK ] OsTest.Nonblock (0 ms)
[ RUN      ] OsTest.Size
[       OK ] OsTest.Size (1 ms)
[ RUN      ] OsTest.BootId
[       OK ] OsTest.BootId (0 ms)
[ RUN      ] OsTest.Sleep
[       OK ] OsTest.Sleep (10 ms)
[ RUN      ] OsTest.Children
[       OK ] OsTest.Children (5 ms)
[ RUN      ] OsTest.Killtree
[       OK ] OsTest.Killtree (20 ms)
[ RUN      ] OsTest.KilltreeNoRoot
[       OK ] OsTest.KilltreeNoRoot (16 ms)
[ RUN      ] OsTest.ProcessExists
[       OK ] OsTest.ProcessExists (5 ms)
[ RUN      ] OsTest.User
[       OK ] OsTest.User (13 ms)
[ RUN      ] OsTest.Libraries
[       OK ] OsTest.Libraries (0 ms)
[ RUN      ] OsTest.Shell
sh: foobar: command not found
E0706 05:12:11.261307 19630 shell.hpp:106] Command 'foobar' failed; this is the output:
[       OK ] OsTest.Shell (11 ms)
[ RUN      ] OsTest.Mknod
[       OK ] OsTest.Mknod (1 ms)
[ RUN      ] OsTest.Realpath
[       OK ] OsTest.Realpath (0 ms)
[ RUN      ] OsTest.Which
[       OK ] OsTest.Which (0 ms)
[----------] 18 tests from OsTest (99 ms total)

[----------] 6 tests from PathTest
[ RUN      ] PathTest.Basename
[       OK ] PathTest.Basename (0 ms)
[ RUN      ] PathTest.Dirname
[       OK ] PathTest.Dirname (0 ms)
[ RUN      ] PathTest.Extension
[       OK ] PathTest.Extension (0 ms)
[ RUN      ] PathTest.Join
[       OK ] PathTest.Join (0 ms)
[ RUN      ] PathTest.Absolute
[       OK ] PathTest.Absolute (0 ms)
[ RUN      ] PathTest.Comparison
[       OK ] PathTest.Comparison (0 ms)
[----------] 6 tests from PathTest (1 ms total)

[----------] 1 test from PathFileTest
[ RUN      ] PathFileTest.ImplicitConversion
[       OK ] PathFileTest.ImplicitConversion (0 ms)
[----------] 1 test from PathFileTest (0 ms total)

[----------] 10 tests from ProtobufTest
[ RUN      ] ProtobufTest.JSON
[       OK ] ProtobufTest.JSON (2 ms)
[ RUN      ] ProtobufTest.JSONArray
[       OK ] ProtobufTest.JSONArray (0 ms)
[ RUN      ] ProtobufTest.JsonLargeIntegers
[       OK ] ProtobufTest.JsonLargeIntegers (1 ms)
[ RUN      ] ProtobufTest.SimpleMessageEquals
[       OK ] ProtobufTest.SimpleMessageEquals (0 ms)
[ RUN      ] ProtobufTest.ParseJSONArray
[       OK ] ProtobufTest.ParseJSONArray (0 ms)
[ RUN      ] ProtobufTest.ParseJSONNull
[       OK ] ProtobufTest.ParseJSONNull (0 ms)
[ RUN      ] ProtobufTest.ParseJSONNestedError
[       OK ] ProtobufTest.ParseJSONNestedError (0 ms)
[ RUN      ] ProtobufTest.Jsonify
[       OK ] ProtobufTest.Jsonify (0 ms)
[ RUN      ] ProtobufTest.JsonifyArray
[       OK ] ProtobufTest.JsonifyArray (0 ms)
[ RUN      ] ProtobufTest.JsonifyLargeIntegers
[       OK ] ProtobufTest.JsonifyLargeIntegers (0 ms)
[----------] 10 tests from ProtobufTest (3 ms total)

[----------] 2 tests from RecordIOTest
[ RUN      ] RecordIOTest.Encoder
[       OK ] RecordIOTest.Encoder (0 ms)
[ RUN      ] RecordIOTest.Decoder
[       OK ] RecordIOTest.Decoder (0 ms)
[----------] 2 tests from RecordIOTest (0 ms total)

[----------] 2 tests from SubcommandTest
[ RUN      ] SubcommandTest.Flags
[       OK ] SubcommandTest.Flags (1 ms)
[ RUN      ] SubcommandTest.Dispatch
Subcommand 'subcommand' is not available
Usage: command <subcommand> [OPTIONS]

Available subcommands:
    help
    subcommand2

Multiple subcommands have name 'subcommand'
[       OK ] SubcommandTest.Dispatch (0 ms)
[----------] 2 tests from SubcommandTest (1 ms total)

[----------] 2 tests from SVNTest
[ RUN      ] SVNTest.DiffPatch
[       OK ] SVNTest.DiffPatch (47 ms)
[ RUN      ] SVNTest.EmptyDiffPatch
[       OK ] SVNTest.EmptyDiffPatch (43 ms)
[----------] 2 tests from SVNTest (90 ms total)

[----------] 1 test from TryTest
[ RUN      ] TryTest.ArrowOperator
[       OK ] TryTest.ArrowOperator (0 ms)
[----------] 1 test from TryTest (0 ms total)

[----------] 1 test from OsSendfileTest
[ RUN      ] OsSendfileTest.Sendfile
[       OK ] OsSendfileTest.Sendfile (0 ms)
[----------] 1 test from OsSendfileTest (0 ms total)

[----------] 1 test from OsSignalsTest
[ RUN      ] OsSignalsTest.Suppress
[       OK ] OsSignalsTest.Suppress (0 ms)
[----------] 1 test from OsSignalsTest (0 ms total)

[----------] 6 tests from ProcTest
[ RUN      ] ProcTest.Pids
[       OK ] ProcTest.Pids (1 ms)
[ RUN      ] ProcTest.Cpus
[       OK ] ProcTest.Cpus (1 ms)
[ RUN      ] ProcTest.SystemStatus
[       OK ] ProcTest.SystemStatus (0 ms)
[ RUN      ] ProcTest.ProcessStatus
[       OK ] ProcTest.ProcessStatus (0 ms)
[ RUN      ] ProcTest.SingleThread
[       OK ] ProcTest.SingleThread (0 ms)
[ RUN      ] ProcTest.MultipleThreads
[       OK ] ProcTest.MultipleThreads (0 ms)
[----------] 6 tests from ProcTest (2 ms total)

[----------] Global test environment tear-down
[==========] 267 tests from 45 test cases ran. (231 ms total)
[  PASSED  ] 266 tests.
[  FAILED  ] 1 test, listed below:
[  FAILED  ] JsonTest.Find

 1 FAILED TEST
make[3]: *** [CMakeFiles/check] Error 1
make[3]: Leaving directory `/mesos/build'
make[2]: *** [CMakeFiles/check.dir/all] Error 2
make[2]: Leaving directory `/mesos/build'
make[1]: *** [CMakeFiles/check.dir/rule] Error 2
make[1]: Leaving directory `/mesos/build'
make: *** [check] Error 2
+ docker rmi mesos-1467781414-18866
Untagged: mesos-1467781414-18866:latest
Deleted: 21e209a2f5df238319e00a6b4c3e803b1a65d12a9c436df767056694fcf94928
Deleted: 60d496d3f00027c8853fc195d2da129dd14f6e7ad4cd9c271493e0f6ed5c414b
Deleted: 9681cef9a312f712b7805b58fb5732137b90ecb555feaba82e27412e9a76a80b
Deleted: b66fa24960579936bd9b3c92285f3aef78d066abbb3e7cb86defe40da0c20e5d
Deleted: 8c7fcac6ecdce9b2741c98898a10d3f1e34759731bf8e652dde1b35a7e1e9846
Deleted: 30518a6a189a9d4835e842cbcf141a4f510dedb1af0052374fa0dda67a13313c
Deleted: 71accb743ebb2eac3b9967a7bcbfb6ab7f1e0c36692c83a27e01a9e53d449b5c
Deleted: e9bb8a266b570eb2b8e21476ffb8690e5e5c33c810728dd0cb3e39823c2a74a1
Deleted: 732fb245f8341d05c87536260cd889c8e38b54dcefe7128ec4f7c07b8701ec89
Deleted: bac4634a9cda2db55f8748bf327107545b74b75cef8409f94f961a6772cfc17b
Deleted: c0180296bc867eb52178294fb3c503624e73f9a29072b54aa3a0335a7608bd2c
Deleted: 8407c01f5139a2dd2adf27cbbc1419abc2d754a848939113ec8ec2ee676f889a
Deleted: f9213fbbfb10c9bcd9d84b17d6e3694ce4e2289bbe74c7476f1c3b7c50a4d59c
Deleted: 8c6a7cd267867a402813d383a2844b20ad783392ef056946df508aab679fe68f
Deleted: d632d93e7d237d07a79bc08f214c1df198cd5bf953804d46552e3d3f17ccc99b
Deleted: 44e25d3130fe56994a990f1bf4bb494a4365326dda975d96c2dc42a8521d83fa
Build step 'Execute shell' marked build as failure

Mime
View raw message