mesos-builds mailing list archives

Site index · List index
Message view « Date » · « Thread »
Top « Date » · « Thread »
From Apache Jenkins Server <jenk...@builds.apache.org>
Subject Build failed in Jenkins: Mesos » autotools,gcc,--verbose --enable-libevent --enable-ssl,GLOG_v=1 MESOS_VERBOSE=1,centos:7,(docker||Hadoop)&&(!ubuntu-us1)&&(!ubuntu-6) #2454
Date Wed, 06 Jul 2016 07:32:11 GMT
See <https://builds.apache.org/job/Mesos/BUILDTOOL=autotools,COMPILER=gcc,CONFIGURATION=--verbose%20--enable-libevent%20--enable-ssl,ENVIRONMENT=GLOG_v=1%20MESOS_VERBOSE=1,OS=centos%3A7,label_exp=(docker%7C%7CHadoop)&&(!ubuntu-us1)&&(!ubuntu-6)/2454/changes>

Changes:

[bmahler] Fixed JsonTest.Find.

------------------------------------------
[...truncated 193467 lines...]
I0706 07:32:09.634389 30393 slave.cpp:592] Agent resources: cpus(*):2; mem(*):1024; disk(*):1024;
ports(*):[31000-32000]
I0706 07:32:09.634454 30393 slave.cpp:600] Agent attributes: [  ]
I0706 07:32:09.634472 30393 slave.cpp:605] Agent hostname: ad716981d9f5
I0706 07:32:09.636049 30389 state.cpp:57] Recovering state from '/tmp/Endpoint_SlaveEndpointTest_AuthorizedRequest_1_ypmpqb/meta'
I0706 07:32:09.636116 30393 process.cpp:3322] Handling HTTP event for process 'slave(542)'
with path: '/slave(542)/monitor/statistics.json'
I0706 07:32:09.636580 30390 status_update_manager.cpp:200] Recovering status update manager
I0706 07:32:09.636714 30396 containerizer.cpp:522] Recovering containerizer
I0706 07:32:09.637001 30400 http.cpp:765] Authorizing principal 'test-principal' to GET the
'/monitor/statistics.json' endpoint
I0706 07:32:09.638083 30402 provisioner.cpp:253] Provisioner recovery complete
I0706 07:32:09.638458 30400 slave.cpp:4839] Finished recovery
I0706 07:32:09.638875 30400 slave.cpp:5011] Querying resource estimator for oversubscribable
resources
I0706 07:32:09.639070 30397 slave.cpp:5025] Received oversubscribable resources  from the
resource estimator
I0706 07:32:09.640156 30400 slave.cpp:839] Agent terminating
[       OK ] Endpoint/SlaveEndpointTest.AuthorizedRequest/1 (20 ms)
[ RUN      ] Endpoint/SlaveEndpointTest.AuthorizedRequest/2
I0706 07:32:09.648440 30370 containerizer.cpp:196] Using isolation: posix/cpu,posix/mem,filesystem/posix,network/cni
W0706 07:32:09.649204 30370 backend.cpp:75] Failed to create 'aufs' backend: AufsBackend requires
root privileges, but is running as user mesos
W0706 07:32:09.649369 30370 backend.cpp:75] Failed to create 'bind' backend: BindBackend requires
root privileges
I0706 07:32:09.652632 30401 slave.cpp:203] Agent started on 543)@172.17.0.3:46522
I0706 07:32:09.652711 30401 slave.cpp:204] Flags at startup: --acls="" --appc_simple_discovery_uri_prefix="http://"
--appc_store_dir="/tmp/mesos/store/appc" --authenticate_http="true" --authenticatee="crammd5"
--authorizer="local" --cgroups_cpu_enable_pids_and_tids_count="false" --cgroups_enable_cfs="false"
--cgroups_hierarchy="/sys/fs/cgroup" --cgroups_limit_swap="false" --cgroups_root="mesos" --container_disk_watch_interval="15secs"
--containerizers="mesos" --credential="/tmp/Endpoint_SlaveEndpointTest_AuthorizedRequest_2_aTeRL5/credential"
--default_role="*" --disk_watch_interval="1mins" --docker="docker" --docker_kill_orphans="true"
--docker_registry="https://registry-1.docker.io" --docker_remove_delay="6hrs" --docker_socket="/var/run/docker.sock"
--docker_stop_timeout="0ns" --docker_store_dir="/tmp/mesos/store/docker" --docker_volume_checkpoint_dir="/var/run/mesos/isolators/docker/volume"
--enforce_container_disk_quota="false" --executor_registration_timeout="1mins" --executor_shutdown_grace_period="5secs"
--fetcher_cache_dir="/tmp/Endpoint_SlaveEndpointTest_AuthorizedRequest_2_aTeRL5/fetch" --fetcher_cache_size="2GB"
--frameworks_home="" --gc_delay="1weeks" --gc_disk_headroom="0.1" --hadoop_home="" --help="true"
--hostname_lookup="true" --http_authenticators="basic" --http_command_executor="false" --http_credentials="/tmp/Endpoint_SlaveEndpointTest_AuthorizedRequest_2_aTeRL5/http_credentials"
--image_provisioner_backend="copy" --initialize_driver_logging="true" --isolation="posix/cpu,posix/mem"
--launcher_dir="/mesos/mesos-1.0.0/_build/src" --logbufsecs="0" --logging_level="INFO" --oversubscribed_resources_interval="15secs"
--perf_duration="10secs" --perf_interval="1mins" --qos_correction_interval_min="0ns" --quiet="false"
--recover="reconnect" --recovery_timeout="15mins" --registration_backoff_factor="10ms" --resources="cpus:2;gpus:0;mem:1024;disk:1024;ports:[31000-32000]"
--revocable_cpu_low_priority="true" --sandbox_directory="/mnt/mesos/sandbox" --strict="true"
--switch_user="true" --systemd_enable_support="true" --systemd_runtime_directory="/run/systemd/system"
--version="false" --work_dir="/tmp/Endpoint_SlaveEndpointTest_AuthorizedRequest_2_aTeRL5"
I0706 07:32:09.653393 30401 credentials.hpp:86] Loading credential for authentication from
'/tmp/Endpoint_SlaveEndpointTest_AuthorizedRequest_2_aTeRL5/credential'
I0706 07:32:09.653628 30401 slave.cpp:341] Agent using credential for: test-principal
I0706 07:32:09.653661 30401 credentials.hpp:37] Loading credentials for authentication from
'/tmp/Endpoint_SlaveEndpointTest_AuthorizedRequest_2_aTeRL5/http_credentials'
I0706 07:32:09.653904 30401 slave.cpp:393] Using default 'basic' HTTP authenticator
I0706 07:32:09.654243 30401 resources.cpp:572] Parsing resources as JSON failed: cpus:2;gpus:0;mem:1024;disk:1024;ports:[31000-32000]
Trying semicolon-delimited string format instead
I0706 07:32:09.654582 30401 resources.cpp:572] Parsing resources as JSON failed: cpus:2;gpus:0;mem:1024;disk:1024;ports:[31000-32000]
Trying semicolon-delimited string format instead
I0706 07:32:09.654996 30401 slave.cpp:592] Agent resources: cpus(*):2; mem(*):1024; disk(*):1024;
ports(*):[31000-32000]
I0706 07:32:09.655062 30401 slave.cpp:600] Agent attributes: [  ]
I0706 07:32:09.655074 30401 slave.cpp:605] Agent hostname: ad716981d9f5
I0706 07:32:09.656433 30397 state.cpp:57] Recovering state from '/tmp/Endpoint_SlaveEndpointTest_AuthorizedRequest_2_aTeRL5/meta'
I0706 07:32:09.656512 30401 process.cpp:3322] Handling HTTP event for process 'slave(543)'
with path: '/slave(543)/containers'
I0706 07:32:09.657050 30402 status_update_manager.cpp:200] Recovering status update manager
I0706 07:32:09.657218 30389 containerizer.cpp:522] Recovering containerizer
I0706 07:32:09.657538 30390 http.cpp:765] Authorizing principal 'test-principal' to GET the
'/containers' endpoint
I0706 07:32:09.658896 30395 provisioner.cpp:253] Provisioner recovery complete
I0706 07:32:09.659246 30404 slave.cpp:4839] Finished recovery
I0706 07:32:09.659852 30404 slave.cpp:5011] Querying resource estimator for oversubscribable
resources
I0706 07:32:09.660329 30393 slave.cpp:5025] Received oversubscribable resources  from the
resource estimator
I0706 07:32:09.660605 30401 slave.cpp:839] Agent terminating
[       OK ] Endpoint/SlaveEndpointTest.AuthorizedRequest/2 (21 ms)
[ RUN      ] Endpoint/SlaveEndpointTest.UnauthorizedRequest/0
I0706 07:32:09.670179 30370 containerizer.cpp:196] Using isolation: posix/cpu,posix/mem,filesystem/posix,network/cni
W0706 07:32:09.670900 30370 backend.cpp:75] Failed to create 'aufs' backend: AufsBackend requires
root privileges, but is running as user mesos
W0706 07:32:09.671043 30370 backend.cpp:75] Failed to create 'bind' backend: BindBackend requires
root privileges
I0706 07:32:09.673955 30392 slave.cpp:203] Agent started on 544)@172.17.0.3:46522
I0706 07:32:09.673982 30392 slave.cpp:204] Flags at startup: --acls="" --appc_simple_discovery_uri_prefix="http://"
--appc_store_dir="/tmp/mesos/store/appc" --authenticate_http="true" --authenticatee="crammd5"
--authorizer="local" --cgroups_cpu_enable_pids_and_tids_count="false" --cgroups_enable_cfs="false"
--cgroups_hierarchy="/sys/fs/cgroup" --cgroups_limit_swap="false" --cgroups_root="mesos" --container_disk_watch_interval="15secs"
--containerizers="mesos" --credential="/tmp/Endpoint_SlaveEndpointTest_UnauthorizedRequest_0_Z91Ch0/credential"
--default_role="*" --disk_watch_interval="1mins" --docker="docker" --docker_kill_orphans="true"
--docker_registry="https://registry-1.docker.io" --docker_remove_delay="6hrs" --docker_socket="/var/run/docker.sock"
--docker_stop_timeout="0ns" --docker_store_dir="/tmp/mesos/store/docker" --docker_volume_checkpoint_dir="/var/run/mesos/isolators/docker/volume"
--enforce_container_disk_quota="false" --executor_registration_timeout="1mins" --executor_shutdown_grace_period="5secs"
--fetcher_cache_dir="/tmp/Endpoint_SlaveEndpointTest_UnauthorizedRequest_0_Z91Ch0/fetch" --fetcher_cache_size="2GB"
--frameworks_home="" --gc_delay="1weeks" --gc_disk_headroom="0.1" --hadoop_home="" --help="true"
--hostname_lookup="true" --http_authenticators="basic" --http_command_executor="false" --http_credentials="/tmp/Endpoint_SlaveEndpointTest_UnauthorizedRequest_0_Z91Ch0/http_credentials"
--image_provisioner_backend="copy" --initialize_driver_logging="true" --isolation="posix/cpu,posix/mem"
--launcher_dir="/mesos/mesos-1.0.0/_build/src" --logbufsecs="0" --logging_level="INFO" --oversubscribed_resources_interval="15secs"
--perf_duration="10secs" --perf_interval="1mins" --qos_correction_interval_min="0ns" --quiet="false"
--recover="reconnect" --recovery_timeout="15mins" --registration_backoff_factor="10ms" --resources="cpus:2;gpus:0;mem:1024;disk:1024;ports:[31000-32000]"
--revocable_cpu_low_priority="true" --sandbox_directory="/mnt/mesos/sandbox" --strict="true"
--switch_user="true" --systemd_enable_support="true" --systemd_runtime_directory="/run/systemd/system"
--version="false" --work_dir="/tmp/Endpoint_SlaveEndpointTest_UnauthorizedRequest_0_Z91Ch0"
I0706 07:32:09.674432 30392 credentials.hpp:86] Loading credential for authentication from
'/tmp/Endpoint_SlaveEndpointTest_UnauthorizedRequest_0_Z91Ch0/credential'
I0706 07:32:09.674583 30392 slave.cpp:341] Agent using credential for: test-principal
I0706 07:32:09.674618 30392 credentials.hpp:37] Loading credentials for authentication from
'/tmp/Endpoint_SlaveEndpointTest_UnauthorizedRequest_0_Z91Ch0/http_credentials'
I0706 07:32:09.674919 30392 slave.cpp:393] Using default 'basic' HTTP authenticator
I0706 07:32:09.675336 30392 resources.cpp:572] Parsing resources as JSON failed: cpus:2;gpus:0;mem:1024;disk:1024;ports:[31000-32000]
Trying semicolon-delimited string format instead
I0706 07:32:09.675653 30392 resources.cpp:572] Parsing resources as JSON failed: cpus:2;gpus:0;mem:1024;disk:1024;ports:[31000-32000]
Trying semicolon-delimited string format instead
I0706 07:32:09.676038 30392 slave.cpp:592] Agent resources: cpus(*):2; mem(*):1024; disk(*):1024;
ports(*):[31000-32000]
I0706 07:32:09.676100 30392 slave.cpp:600] Agent attributes: [  ]
I0706 07:32:09.676111 30392 slave.cpp:605] Agent hostname: ad716981d9f5
I0706 07:32:09.677435 30390 state.cpp:57] Recovering state from '/tmp/Endpoint_SlaveEndpointTest_UnauthorizedRequest_0_Z91Ch0/meta'
I0706 07:32:09.677500 30392 process.cpp:3322] Handling HTTP event for process 'slave(544)'
with path: '/slave(544)/monitor/statistics'
I0706 07:32:09.677942 30402 status_update_manager.cpp:200] Recovering status update manager
I0706 07:32:09.678129 30402 containerizer.cpp:522] Recovering containerizer
I0706 07:32:09.678429 30397 http.cpp:765] Authorizing principal 'test-principal' to GET the
'/monitor/statistics' endpoint
I0706 07:32:09.679370 30392 provisioner.cpp:253] Provisioner recovery complete
I0706 07:32:09.680063 30394 slave.cpp:4839] Finished recovery
I0706 07:32:09.680601 30394 slave.cpp:5011] Querying resource estimator for oversubscribable
resources
I0706 07:32:09.680752 30394 slave.cpp:839] Agent terminating
[       OK ] Endpoint/SlaveEndpointTest.UnauthorizedRequest/0 (19 ms)
[ RUN      ] Endpoint/SlaveEndpointTest.UnauthorizedRequest/1
I0706 07:32:09.688880 30370 containerizer.cpp:196] Using isolation: posix/cpu,posix/mem,filesystem/posix,network/cni
W0706 07:32:09.689499 30370 backend.cpp:75] Failed to create 'aufs' backend: AufsBackend requires
root privileges, but is running as user mesos
W0706 07:32:09.689687 30370 backend.cpp:75] Failed to create 'bind' backend: BindBackend requires
root privileges
I0706 07:32:09.692396 30392 slave.cpp:203] Agent started on 545)@172.17.0.3:46522
I0706 07:32:09.692427 30392 slave.cpp:204] Flags at startup: --acls="" --appc_simple_discovery_uri_prefix="http://"
--appc_store_dir="/tmp/mesos/store/appc" --authenticate_http="true" --authenticatee="crammd5"
--authorizer="local" --cgroups_cpu_enable_pids_and_tids_count="false" --cgroups_enable_cfs="false"
--cgroups_hierarchy="/sys/fs/cgroup" --cgroups_limit_swap="false" --cgroups_root="mesos" --container_disk_watch_interval="15secs"
--containerizers="mesos" --credential="/tmp/Endpoint_SlaveEndpointTest_UnauthorizedRequest_1_HFxSWU/credential"
--default_role="*" --disk_watch_interval="1mins" --docker="docker" --docker_kill_orphans="true"
--docker_registry="https://registry-1.docker.io" --docker_remove_delay="6hrs" --docker_socket="/var/run/docker.sock"
--docker_stop_timeout="0ns" --docker_store_dir="/tmp/mesos/store/docker" --docker_volume_checkpoint_dir="/var/run/mesos/isolators/docker/volume"
--enforce_container_disk_quota="false" --executor_registration_timeout="1mins" --executor_shutdown_grace_period="5secs"
--fetcher_cache_dir="/tmp/Endpoint_SlaveEndpointTest_UnauthorizedRequest_1_HFxSWU/fetch" --fetcher_cache_size="2GB"
--frameworks_home="" --gc_delay="1weeks" --gc_disk_headroom="0.1" --hadoop_home="" --help="true"
--hostname_lookup="true" --http_authenticators="basic" --http_command_executor="false" --http_credentials="/tmp/Endpoint_SlaveEndpointTest_UnauthorizedRequest_1_HFxSWU/http_credentials"
--image_provisioner_backend="copy" --initialize_driver_logging="true" --isolation="posix/cpu,posix/mem"
--launcher_dir="/mesos/mesos-1.0.0/_build/src" --logbufsecs="0" --logging_level="INFO" --oversubscribed_resources_interval="15secs"
--perf_duration="10secs" --perf_interval="1mins" --qos_correction_interval_min="0ns" --quiet="false"
--recover="reconnect" --recovery_timeout="15mins" --registration_backoff_factor="10ms" --resources="cpus:2;gpus:0;mem:1024;disk:1024;ports:[31000-32000]"
--revocable_cpu_low_priority="true" --sandbox_directory="/mnt/mesos/sandbox" --strict="true"
--switch_user="true" --systemd_enable_support="true" --systemd_runtime_directory="/run/systemd/system"
--version="false" --work_dir="/tmp/Endpoint_SlaveEndpointTest_UnauthorizedRequest_1_HFxSWU"
I0706 07:32:09.692826 30392 credentials.hpp:86] Loading credential for authentication from
'/tmp/Endpoint_SlaveEndpointTest_UnauthorizedRequest_1_HFxSWU/credential'
I0706 07:32:09.692981 30392 slave.cpp:341] Agent using credential for: test-principal
I0706 07:32:09.693014 30392 credentials.hpp:37] Loading credentials for authentication from
'/tmp/Endpoint_SlaveEndpointTest_UnauthorizedRequest_1_HFxSWU/http_credentials'
I0706 07:32:09.693245 30392 slave.cpp:393] Using default 'basic' HTTP authenticator
I0706 07:32:09.693563 30392 resources.cpp:572] Parsing resources as JSON failed: cpus:2;gpus:0;mem:1024;disk:1024;ports:[31000-32000]
Trying semicolon-delimited string format instead
I0706 07:32:09.693892 30392 resources.cpp:572] Parsing resources as JSON failed: cpus:2;gpus:0;mem:1024;disk:1024;ports:[31000-32000]
Trying semicolon-delimited string format instead
I0706 07:32:09.694294 30392 slave.cpp:592] Agent resources: cpus(*):2; mem(*):1024; disk(*):1024;
ports(*):[31000-32000]
I0706 07:32:09.694375 30392 slave.cpp:600] Agent attributes: [  ]
I0706 07:32:09.694387 30392 slave.cpp:605] Agent hostname: ad716981d9f5
I0706 07:32:09.695663 30400 state.cpp:57] Recovering state from '/tmp/Endpoint_SlaveEndpointTest_UnauthorizedRequest_1_HFxSWU/meta'
I0706 07:32:09.695724 30392 process.cpp:3322] Handling HTTP event for process 'slave(545)'
with path: '/slave(545)/monitor/statistics.json'
I0706 07:32:09.696177 30393 status_update_manager.cpp:200] Recovering status update manager
I0706 07:32:09.696490 30402 containerizer.cpp:522] Recovering containerizer
I0706 07:32:09.696590 30394 http.cpp:765] Authorizing principal 'test-principal' to GET the
'/monitor/statistics.json' endpoint
I0706 07:32:09.697559 30391 provisioner.cpp:253] Provisioner recovery complete
I0706 07:32:09.697866 30398 slave.cpp:4839] Finished recovery
I0706 07:32:09.698508 30398 slave.cpp:5011] Querying resource estimator for oversubscribable
resources
I0706 07:32:09.698645 30398 slave.cpp:839] Agent terminating
[       OK ] Endpoint/SlaveEndpointTest.UnauthorizedRequest/1 (19 ms)
[ RUN      ] Endpoint/SlaveEndpointTest.UnauthorizedRequest/2
I0706 07:32:09.707998 30370 containerizer.cpp:196] Using isolation: posix/cpu,posix/mem,filesystem/posix,network/cni
W0706 07:32:09.708817 30370 backend.cpp:75] Failed to create 'aufs' backend: AufsBackend requires
root privileges, but is running as user mesos
W0706 07:32:09.708991 30370 backend.cpp:75] Failed to create 'bind' backend: BindBackend requires
root privileges
I0706 07:32:09.712092 30400 slave.cpp:203] Agent started on 546)@172.17.0.3:46522
I0706 07:32:09.712116 30400 slave.cpp:204] Flags at startup: --acls="" --appc_simple_discovery_uri_prefix="http://"
--appc_store_dir="/tmp/mesos/store/appc" --authenticate_http="true" --authenticatee="crammd5"
--authorizer="local" --cgroups_cpu_enable_pids_and_tids_count="false" --cgroups_enable_cfs="false"
--cgroups_hierarchy="/sys/fs/cgroup" --cgroups_limit_swap="false" --cgroups_root="mesos" --container_disk_watch_interval="15secs"
--containerizers="mesos" --credential="/tmp/Endpoint_SlaveEndpointTest_UnauthorizedRequest_2_BXhdLP/credential"
--default_role="*" --disk_watch_interval="1mins" --docker="docker" --docker_kill_orphans="true"
--docker_registry="https://registry-1.docker.io" --docker_remove_delay="6hrs" --docker_socket="/var/run/docker.sock"
--docker_stop_timeout="0ns" --docker_store_dir="/tmp/mesos/store/docker" --docker_volume_checkpoint_dir="/var/run/mesos/isolators/docker/volume"
--enforce_container_disk_quota="false" --executor_registration_timeout="1mins" --executor_shutdown_grace_period="5secs"
--fetcher_cache_dir="/tmp/Endpoint_SlaveEndpointTest_UnauthorizedRequest_2_BXhdLP/fetch" --fetcher_cache_size="2GB"
--frameworks_home="" --gc_delay="1weeks" --gc_disk_headroom="0.1" --hadoop_home="" --help="true"
--hostname_lookup="true" --http_authenticators="basic" --http_command_executor="false" --http_credentials="/tmp/Endpoint_SlaveEndpointTest_UnauthorizedRequest_2_BXhdLP/http_credentials"
--image_provisioner_backend="copy" --initialize_driver_logging="true" --isolation="posix/cpu,posix/mem"
--launcher_dir="/mesos/mesos-1.0.0/_build/src" --logbufsecs="0" --logging_level="INFO" --oversubscribed_resources_interval="15secs"
--perf_duration="10secs" --perf_interval="1mins" --qos_correction_interval_min="0ns" --quiet="false"
--recover="reconnect" --recovery_timeout="15mins" --registration_backoff_factor="10ms" --resources="cpus:2;gpus:0;mem:1024;disk:1024;ports:[31000-32000]"
--revocable_cpu_low_priority="true" --sandbox_directory="/mnt/mesos/sandbox" --strict="true"
--switch_user="true" --systemd_enable_support="true" --systemd_runtime_directory="/run/systemd/system"
--version="false" --work_dir="/tmp/Endpoint_SlaveEndpointTest_UnauthorizedRequest_2_BXhdLP"
I0706 07:32:09.712549 30400 credentials.hpp:86] Loading credential for authentication from
'/tmp/Endpoint_SlaveEndpointTest_UnauthorizedRequest_2_BXhdLP/credential'
I0706 07:32:09.712713 30400 slave.cpp:341] Agent using credential for: test-principal
I0706 07:32:09.712815 30400 credentials.hpp:37] Loading credentials for authentication from
'/tmp/Endpoint_SlaveEndpointTest_UnauthorizedRequest_2_BXhdLP/http_credentials'
I0706 07:32:09.713079 30400 slave.cpp:393] Using default 'basic' HTTP authenticator
I0706 07:32:09.713431 30400 resources.cpp:572] Parsing resources as JSON failed: cpus:2;gpus:0;mem:1024;disk:1024;ports:[31000-32000]
Trying semicolon-delimited string format instead
I0706 07:32:09.713719 30400 resources.cpp:572] Parsing resources as JSON failed: cpus:2;gpus:0;mem:1024;disk:1024;ports:[31000-32000]
Trying semicolon-delimited string format instead
I0706 07:32:09.714102 30400 slave.cpp:592] Agent resources: cpus(*):2; mem(*):1024; disk(*):1024;
ports(*):[31000-32000]
I0706 07:32:09.714162 30400 slave.cpp:600] Agent attributes: [  ]
I0706 07:32:09.714181 30400 slave.cpp:605] Agent hostname: ad716981d9f5
I0706 07:32:09.715450 30397 state.cpp:57] Recovering state from '/tmp/Endpoint_SlaveEndpointTest_UnauthorizedRequest_2_BXhdLP/meta'
I0706 07:32:09.715528 30400 process.cpp:3322] Handling HTTP event for process 'slave(546)'
with path: '/slave(546)/containers'
I0706 07:32:09.715984 30389 status_update_manager.cpp:200] Recovering status update manager
I0706 07:32:09.716184 30393 containerizer.cpp:522] Recovering containerizer
I0706 07:32:09.716495 30401 http.cpp:765] Authorizing principal 'test-principal' to GET the
'/containers' endpoint
I0706 07:32:09.717437 30397 provisioner.cpp:253] Provisioner recovery complete
I0706 07:32:09.717938 30394 slave.cpp:4839] Finished recovery
I0706 07:32:09.718437 30394 slave.cpp:5011] Querying resource estimator for oversubscribable
resources
I0706 07:32:09.718629 30396 slave.cpp:839] Agent terminating
[       OK ] Endpoint/SlaveEndpointTest.UnauthorizedRequest/2 (19 ms)
[ RUN      ] Endpoint/SlaveEndpointTest.NoAuthorizer/0
I0706 07:32:09.727955 30370 containerizer.cpp:196] Using isolation: posix/cpu,posix/mem,filesystem/posix,network/cni
W0706 07:32:09.728796 30370 backend.cpp:75] Failed to create 'aufs' backend: AufsBackend requires
root privileges, but is running as user mesos
W0706 07:32:09.728972 30370 backend.cpp:75] Failed to create 'bind' backend: BindBackend requires
root privileges
I0706 07:32:09.730602 30370 cluster.cpp:432] Creating default 'local' authorizer
I0706 07:32:09.732333 30395 slave.cpp:203] Agent started on 547)@172.17.0.3:46522
I0706 07:32:09.732357 30395 slave.cpp:204] Flags at startup: --acls="" --appc_simple_discovery_uri_prefix="http://"
--appc_store_dir="/tmp/mesos/store/appc" --authenticate_http="true" --authenticatee="crammd5"
--authorizer="local" --cgroups_cpu_enable_pids_and_tids_count="false" --cgroups_enable_cfs="false"
--cgroups_hierarchy="/sys/fs/cgroup" --cgroups_limit_swap="false" --cgroups_root="mesos" --container_disk_watch_interval="15secs"
--containerizers="mesos" --credential="/tmp/Endpoint_SlaveEndpointTest_NoAuthorizer_0_vTscJK/credential"
--default_role="*" --disk_watch_interval="1mins" --docker="docker" --docker_kill_orphans="true"
--docker_registry="https://registry-1.docker.io" --docker_remove_delay="6hrs" --docker_socket="/var/run/docker.sock"
--docker_stop_timeout="0ns" --docker_store_dir="/tmp/mesos/store/docker" --docker_volume_checkpoint_dir="/var/run/mesos/isolators/docker/volume"
--enforce_container_disk_quota="false" --executor_registration_timeout="1mins" --executor_shutdown_grace_period="5secs"
--fetcher_cache_dir="/tmp/Endpoint_SlaveEndpointTest_NoAuthorizer_0_vTscJK/fetch" --fetcher_cache_size="2GB"
--frameworks_home="" --gc_delay="1weeks" --gc_disk_headroom="0.1" --hadoop_home="" --help="false"
--hostname_lookup="true" --http_authenticators="basic" --http_command_executor="false" --http_credentials="/tmp/Endpoint_SlaveEndpointTest_NoAuthorizer_0_vTscJK/http_credentials"
--image_provisioner_backend="copy" --initialize_driver_logging="true" --isolation="posix/cpu,posix/mem"
--launcher_dir="/mesos/mesos-1.0.0/_build/src" --logbufsecs="0" --logging_level="INFO" --oversubscribed_resources_interval="15secs"
--perf_duration="10secs" --perf_interval="1mins" --qos_correction_interval_min="0ns" --quiet="false"
--recover="reconnect" --recovery_timeout="15mins" --registration_backoff_factor="10ms" --resources="cpus:2;gpus:0;mem:1024;disk:1024;ports:[31000-32000]"
--revocable_cpu_low_priority="true" --sandbox_directory="/mnt/mesos/sandbox" --strict="true"
--switch_user="true" --systemd_enable_support="true" --systemd_runtime_directory="/run/systemd/system"
--version="false" --work_dir="/tmp/Endpoint_SlaveEndpointTest_NoAuthorizer_0_vTscJK"
I0706 07:32:09.732713 30395 credentials.hpp:86] Loading credential for authentication from
'/tmp/Endpoint_SlaveEndpointTest_NoAuthorizer_0_vTscJK/credential'
I0706 07:32:09.732848 30395 slave.cpp:341] Agent using credential for: test-principal
I0706 07:32:09.732875 30395 credentials.hpp:37] Loading credentials for authentication from
'/tmp/Endpoint_SlaveEndpointTest_NoAuthorizer_0_vTscJK/http_credentials'
I0706 07:32:09.733139 30395 slave.cpp:393] Using default 'basic' HTTP authenticator
I0706 07:32:09.733484 30395 resources.cpp:572] Parsing resources as JSON failed: cpus:2;gpus:0;mem:1024;disk:1024;ports:[31000-32000]
Trying semicolon-delimited string format instead
I0706 07:32:09.733808 30395 resources.cpp:572] Parsing resources as JSON failed: cpus:2;gpus:0;mem:1024;disk:1024;ports:[31000-32000]
Trying semicolon-delimited string format instead
I0706 07:32:09.734308 30395 slave.cpp:592] Agent resources: cpus(*):2; mem(*):1024; disk(*):1024;
ports(*):[31000-32000]
I0706 07:32:09.734378 30395 slave.cpp:600] Agent attributes: [  ]
I0706 07:32:09.734391 30395 slave.cpp:605] Agent hostname: ad716981d9f5
I0706 07:32:09.735761 30391 state.cpp:57] Recovering state from '/tmp/Endpoint_SlaveEndpointTest_NoAuthorizer_0_vTscJK/meta'
I0706 07:32:09.735828 30395 process.cpp:3322] Handling HTTP event for process 'slave(547)'
with path: '/slave(547)/monitor/statistics'
I0706 07:32:09.736347 30392 status_update_manager.cpp:200] Recovering status update manager
I0706 07:32:09.736634 30397 containerizer.cpp:522] Recovering containerizer
I0706 07:32:09.736768 30391 http.cpp:765] Authorizing principal 'test-principal' to GET the
'/monitor/statistics' endpoint
I0706 07:32:09.737627 30391 provisioner.cpp:253] Provisioner recovery complete
I0706 07:32:09.738095 30402 slave.cpp:4839] Finished recovery
I0706 07:32:09.738554 30402 slave.cpp:5011] Querying resource estimator for oversubscribable
resources
I0706 07:32:09.738699 30401 slave.cpp:5025] Received oversubscribable resources  from the
resource estimator
I0706 07:32:09.739482 30392 slave.cpp:839] Agent terminating
[       OK ] Endpoint/SlaveEndpointTest.NoAuthorizer/0 (20 ms)
[ RUN      ] Endpoint/SlaveEndpointTest.NoAuthorizer/1
I0706 07:32:09.748494 30370 containerizer.cpp:196] Using isolation: posix/cpu,posix/mem,filesystem/posix,network/cni
W0706 07:32:09.749245 30370 backend.cpp:75] Failed to create 'aufs' backend: AufsBackend requires
root privileges, but is running as user mesos
W0706 07:32:09.749434 30370 backend.cpp:75] Failed to create 'bind' backend: BindBackend requires
root privileges
I0706 07:32:09.750860 30370 cluster.cpp:432] Creating default 'local' authorizer
I0706 07:32:09.752367 30400 slave.cpp:203] Agent started on 548)@172.17.0.3:46522
I0706 07:32:09.752388 30400 slave.cpp:204] Flags at startup: --acls="" --appc_simple_discovery_uri_prefix="http://"
--appc_store_dir="/tmp/mesos/store/appc" --authenticate_http="true" --authenticatee="crammd5"
--authorizer="local" --cgroups_cpu_enable_pids_and_tids_count="false" --cgroups_enable_cfs="false"
--cgroups_hierarchy="/sys/fs/cgroup" --cgroups_limit_swap="false" --cgroups_root="mesos" --container_disk_watch_interval="15secs"
--containerizers="mesos" --credential="/tmp/Endpoint_SlaveEndpointTest_NoAuthorizer_1_33r8QF/credential"
--default_role="*" --disk_watch_interval="1mins" --docker="docker" --docker_kill_orphans="true"
--docker_registry="https://registry-1.docker.io" --docker_remove_delay="6hrs" --docker_socket="/var/run/docker.sock"
--docker_stop_timeout="0ns" --docker_store_dir="/tmp/mesos/store/docker" --docker_volume_checkpoint_dir="/var/run/mesos/isolators/docker/volume"
--enforce_container_disk_quota="false" --executor_registration_timeout="1mins" --executor_shutdown_grace_period="5secs"
--fetcher_cache_dir="/tmp/Endpoint_SlaveEndpointTest_NoAuthorizer_1_33r8QF/fetch" --fetcher_cache_size="2GB"
--frameworks_home="" --gc_delay="1weeks" --gc_disk_headroom="0.1" --hadoop_home="" --help="false"
--hostname_lookup="true" --http_authenticators="basic" --http_command_executor="false" --http_credentials="/tmp/Endpoint_SlaveEndpointTest_NoAuthorizer_1_33r8QF/http_credentials"
--image_provisioner_backend="copy" --initialize_driver_logging="true" --isolation="posix/cpu,posix/mem"
--launcher_dir="/mesos/mesos-1.0.0/_build/src" --logbufsecs="0" --logging_level="INFO" --oversubscribed_resources_interval="15secs"
--perf_duration="10secs" --perf_interval="1mins" --qos_correction_interval_min="0ns" --quiet="false"
--recover="reconnect" --recovery_timeout="15mins" --registration_backoff_factor="10ms" --resources="cpus:2;gpus:0;mem:1024;disk:1024;ports:[31000-32000]"
--revocable_cpu_low_priority="true" --sandbox_directory="/mnt/mesos/sandbox" --strict="true"
--switch_user="true" --systemd_enable_support="true" --systemd_runtime_directory="/run/systemd/system"
--version="false" --work_dir="/tmp/Endpoint_SlaveEndpointTest_NoAuthorizer_1_33r8QF"
I0706 07:32:09.752735 30400 credentials.hpp:86] Loading credential for authentication from
'/tmp/Endpoint_SlaveEndpointTest_NoAuthorizer_1_33r8QF/credential'
I0706 07:32:09.752863 30400 slave.cpp:341] Agent using credential for: test-principal
I0706 07:32:09.752890 30400 credentials.hpp:37] Loading credentials for authentication from
'/tmp/Endpoint_SlaveEndpointTest_NoAuthorizer_1_33r8QF/http_credentials'
I0706 07:32:09.753149 30400 slave.cpp:393] Using default 'basic' HTTP authenticator
I0706 07:32:09.753481 30400 resources.cpp:572] Parsing resources as JSON failed: cpus:2;gpus:0;mem:1024;disk:1024;ports:[31000-32000]
Trying semicolon-delimited string format instead
I0706 07:32:09.753842 30400 resources.cpp:572] Parsing resources as JSON failed: cpus:2;gpus:0;mem:1024;disk:1024;ports:[31000-32000]
Trying semicolon-delimited string format instead
I0706 07:32:09.754344 30400 slave.cpp:592] Agent resources: cpus(*):2; mem(*):1024; disk(*):1024;
ports(*):[31000-32000]
I0706 07:32:09.754423 30400 slave.cpp:600] Agent attributes: [  ]
I0706 07:32:09.754447 30400 slave.cpp:605] Agent hostname: ad716981d9f5
I0706 07:32:09.755946 30395 state.cpp:57] Recovering state from '/tmp/Endpoint_SlaveEndpointTest_NoAuthorizer_1_33r8QF/meta'
I0706 07:32:09.756029 30400 process.cpp:3322] Handling HTTP event for process 'slave(548)'
with path: '/slave(548)/monitor/statistics.json'
I0706 07:32:09.756474 30402 status_update_manager.cpp:200] Recovering status update manager
I0706 07:32:09.756721 30392 containerizer.cpp:522] Recovering containerizer
I0706 07:32:09.756968 30404 http.cpp:765] Authorizing principal 'test-principal' to GET the
'/monitor/statistics.json' endpoint
I0706 07:32:09.757709 30389 provisioner.cpp:253] Provisioner recovery complete
I0706 07:32:09.758348 30394 slave.cpp:4839] Finished recovery
I0706 07:32:09.758879 30394 slave.cpp:5011] Querying resource estimator for oversubscribable
resources
I0706 07:32:09.759053 30392 slave.cpp:5025] Received oversubscribable resources  from the
resource estimator
I0706 07:32:09.759870 30397 slave.cpp:839] Agent terminating
[       OK ] Endpoint/SlaveEndpointTest.NoAuthorizer/1 (20 ms)
[ RUN      ] Endpoint/SlaveEndpointTest.NoAuthorizer/2
I0706 07:32:09.767937 30370 containerizer.cpp:196] Using isolation: posix/cpu,posix/mem,filesystem/posix,network/cni
W0706 07:32:09.768762 30370 backend.cpp:75] Failed to create 'aufs' backend: AufsBackend requires
root privileges, but is running as user mesos
W0706 07:32:09.768961 30370 backend.cpp:75] Failed to create 'bind' backend: BindBackend requires
root privileges
I0706 07:32:09.770479 30370 cluster.cpp:432] Creating default 'local' authorizer
I0706 07:32:09.771826 30401 slave.cpp:203] Agent started on 549)@172.17.0.3:46522
I0706 07:32:09.771847 30401 slave.cpp:204] Flags at startup: --acls="" --appc_simple_discovery_uri_prefix="http://"
--appc_store_dir="/tmp/mesos/store/appc" --authenticate_http="true" --authenticatee="crammd5"
--authorizer="local" --cgroups_cpu_enable_pids_and_tids_count="false" --cgroups_enable_cfs="false"
--cgroups_hierarchy="/sys/fs/cgroup" --cgroups_limit_swap="false" --cgroups_root="mesos" --container_disk_watch_interval="15secs"
--containerizers="mesos" --credential="/tmp/Endpoint_SlaveEndpointTest_NoAuthorizer_2_FrEP8A/credential"
--default_role="*" --disk_watch_interval="1mins" --docker="docker" --docker_kill_orphans="true"
--docker_registry="https://registry-1.docker.io" --docker_remove_delay="6hrs" --docker_socket="/var/run/docker.sock"
--docker_stop_timeout="0ns" --docker_store_dir="/tmp/mesos/store/docker" --docker_volume_checkpoint_dir="/var/run/mesos/isolators/docker/volume"
--enforce_container_disk_quota="false" --executor_registration_timeout="1mins" --executor_shutdown_grace_period="5secs"
--fetcher_cache_dir="/tmp/Endpoint_SlaveEndpointTest_NoAuthorizer_2_FrEP8A/fetch" --fetcher_cache_size="2GB"
--frameworks_home="" --gc_delay="1weeks" --gc_disk_headroom="0.1" --hadoop_home="" --help="false"
--hostname_lookup="true" --http_authenticators="basic" --http_command_executor="false" --http_credentials="/tmp/Endpoint_SlaveEndpointTest_NoAuthorizer_2_FrEP8A/http_credentials"
--image_provisioner_backend="copy" --initialize_driver_logging="true" --isolation="posix/cpu,posix/mem"
--launcher_dir="/mesos/mesos-1.0.0/_build/src" --logbufsecs="0" --logging_level="INFO" --oversubscribed_resources_interval="15secs"
--perf_duration="10secs" --perf_interval="1mins" --qos_correction_interval_min="0ns" --quiet="false"
--recover="reconnect" --recovery_timeout="15mins" --registration_backoff_factor="10ms" --resources="cpus:2;gpus:0;mem:1024;disk:1024;ports:[31000-32000]"
--revocable_cpu_low_priority="true" --sandbox_directory="/mnt/mesos/sandbox" --strict="true"
--switch_user="true" --systemd_enable_support="true" --systemd_runtime_directory="/run/systemd/system"
--version="false" --work_dir="/tmp/Endpoint_SlaveEndpointTest_NoAuthorizer_2_FrEP8A"
I0706 07:32:09.772202 30401 credentials.hpp:86] Loading credential for authentication from
'/tmp/Endpoint_SlaveEndpointTest_NoAuthorizer_2_FrEP8A/credential'
I0706 07:32:09.772379 30401 slave.cpp:341] Agent using credential for: test-principal
I0706 07:32:09.772411 30401 credentials.hpp:37] Loading credentials for authentication from
'/tmp/Endpoint_SlaveEndpointTest_NoAuthorizer_2_FrEP8A/http_credentials'
I0706 07:32:09.772637 30401 slave.cpp:393] Using default 'basic' HTTP authenticator
I0706 07:32:09.773427 30401 resources.cpp:572] Parsing resources as JSON failed: cpus:2;gpus:0;mem:1024;disk:1024;ports:[31000-32000]
Trying semicolon-delimited string format instead
I0706 07:32:09.773841 30401 resources.cpp:572] Parsing resources as JSON failed: cpus:2;gpus:0;mem:1024;disk:1024;ports:[31000-32000]
Trying semicolon-delimited string format instead
I0706 07:32:09.774220 30401 slave.cpp:592] Agent resources: cpus(*):2; mem(*):1024; disk(*):1024;
ports(*):[31000-32000]
I0706 07:32:09.774286 30401 slave.cpp:600] Agent attributes: [  ]
I0706 07:32:09.774299 30401 slave.cpp:605] Agent hostname: ad716981d9f5
I0706 07:32:09.775815 30399 state.cpp:57] Recovering state from '/tmp/Endpoint_SlaveEndpointTest_NoAuthorizer_2_FrEP8A/meta'
I0706 07:32:09.775918 30401 process.cpp:3322] Handling HTTP event for process 'slave(549)'
with path: '/slave(549)/containers'
I0706 07:32:09.776664 30403 status_update_manager.cpp:200] Recovering status update manager
I0706 07:32:09.776911 30400 containerizer.cpp:522] Recovering containerizer
I0706 07:32:09.777101 30396 http.cpp:765] Authorizing principal 'test-principal' to GET the
'/containers' endpoint
I0706 07:32:09.778224 30397 provisioner.cpp:253] Provisioner recovery complete
I0706 07:32:09.778679 30393 slave.cpp:4839] Finished recovery
I0706 07:32:09.779335 30393 slave.cpp:5011] Querying resource estimator for oversubscribable
resources
I0706 07:32:09.779590 30389 slave.cpp:5025] Received oversubscribable resources  from the
resource estimator
I0706 07:32:09.780454 30398 slave.cpp:839] Agent terminating
[       OK ] Endpoint/SlaveEndpointTest.NoAuthorizer/2 (22 ms)
[----------] 9 tests from Endpoint/SlaveEndpointTest (184 ms total)

[----------] Global test environment tear-down
[==========] 1227 tests from 140 test cases ran. (370176 ms total)
[  PASSED  ] 1226 tests.
[  FAILED  ] 1 test, listed below:
[  FAILED  ] DiskQuotaTest.SlaveRecovery

 1 FAILED TEST
  YOU HAVE 6 DISABLED TESTS

make[4]: *** [check-local] Error 1
make[4]: Leaving directory `/mesos/mesos-1.0.0/_build/src'
make[3]: *** [check-am] Error 2
make[3]: Leaving directory `/mesos/mesos-1.0.0/_build/src'
make[2]: *** [check] Error 2
make[2]: Leaving directory `/mesos/mesos-1.0.0/_build/src'
make[1]: *** [check-recursive] Error 1
make[1]: Leaving directory `/mesos/mesos-1.0.0/_build'
make: *** [distcheck] Error 1
+ docker rmi mesos-1467788198-16593
Untagged: mesos-1467788198-16593:latest
Deleted: 82a44a780a88c254dce3dab7f3608a7f3950881ec096dbca8ef83a4e248969c1
Deleted: b5c69e7121c995ed8e726399ac5ab8107e11af679978263e5c591dc5a859e0ba
Deleted: fe3af2e3c87346f9fc5b1767a261ff0cbbc4dc5ac66680815fbf00afe1cfa639
Deleted: 5d0de912eb7dbebf5649fc7f81c9ac3b2eec745f257b6aec2b3cf9c431d39047
Deleted: 2fbcb4c9b33df994e8ef2141cc58912bd41860c1881aa04e12fd8740a2f2a19c
Deleted: 8177359230e0d7c542d7c7b2a3b3335342b368a93e4dea1a3536a5b105fd243b
Deleted: 05a5a0d8474cee4bffc436eea90a4b12cfa50fa9a48ae6c0de1ab8900cfe6d9d
Deleted: d275696b8ceeaa3fa1bf2add67e7efc74b1f83f4c6b5ae956a6f98014538bd82
Deleted: 185e61a65dd876f94bc765d5879c921e9d3ecfc96228e4dfbfe21012704b285f
Deleted: ec47a2882ef97521e777279453e098a43124e2efe7a5177f6274af64ff50207a
Deleted: c3b680189b5e0baf9bf3cef559515d3041e5f0c868017e00665dbecc38dfaab6
Deleted: 6cc594d9007ae32935b92d8ffb1a408a4b1c959efb52908f1b8f1a0f612e271e
Deleted: 5974d3a22b65c8ca6d97b012097ad3b3f4c297713172b065dadd77ff0d4137f4
Deleted: e30347a58ebfaffd2f06f7b99d5120f81e39bf3bf764c4279c963d650a72f790
Deleted: 790576f63653852dbae40b64b7c343b839baf32470aa43e25f2b599c841cbf76
Deleted: 1c9a57769424587bb90fd1409870f14bc7c5e4105621afe7f5d283a70caa07c6
Build step 'Execute shell' marked build as failure

Mime
View raw message