mesos-builds mailing list archives

Site index · List index
Message view « Date » · « Thread »
Top « Date » · « Thread »
From Apache Jenkins Server <jenk...@builds.apache.org>
Subject Build failed in Jenkins: Mesos » autotools,gcc,--verbose --enable-libevent --enable-ssl,GLOG_v=1 MESOS_VERBOSE=1,ubuntu:14.04,(docker||Hadoop)&&(!ubuntu-us1)&&(!ubuntu-6) #2447
Date Wed, 06 Jul 2016 00:43:16 GMT
See <https://builds.apache.org/job/Mesos/BUILDTOOL=autotools,COMPILER=gcc,CONFIGURATION=--verbose%20--enable-libevent%20--enable-ssl,ENVIRONMENT=GLOG_v=1%20MESOS_VERBOSE=1,OS=ubuntu%3A14.04,label_exp=(docker%7C%7CHadoop)&&(!ubuntu-us1)&&(!ubuntu-6)/2447/changes>

Changes:

[vinodkone] Fixed variable name in reconciliation tests.

[bmahler] Implemented 'shouldInject()' in the 'NvidiaVolume' component.

------------------------------------------
[...truncated 199978 lines...]
I0706 00:43:12.684098 29458 slave.cpp:605] Agent hostname: 2f46df2c7820
I0706 00:43:12.686838 29458 state.cpp:57] Recovering state from '/tmp/Endpoint_SlaveEndpointTest_AuthorizedRequest_1_MSiX5D/meta'
I0706 00:43:12.687337 29458 process.cpp:3322] Handling HTTP event for process 'slave(542)'
with path: '/slave(542)/monitor/statistics.json'
I0706 00:43:12.687711 29458 status_update_manager.cpp:200] Recovering status update manager
I0706 00:43:12.689518 29458 containerizer.cpp:522] Recovering containerizer
I0706 00:43:12.690845 29455 http.cpp:765] Authorizing principal 'test-principal' to GET the
'/monitor/statistics.json' endpoint
I0706 00:43:12.692279 29446 provisioner.cpp:253] Provisioner recovery complete
I0706 00:43:12.693596 29449 slave.cpp:4839] Finished recovery
I0706 00:43:12.694138 29449 slave.cpp:5011] Querying resource estimator for oversubscribable
resources
I0706 00:43:12.694569 29449 slave.cpp:5025] Received oversubscribable resources  from the
resource estimator
I0706 00:43:12.713188 29426 slave.cpp:839] Agent terminating
[       OK ] Endpoint/SlaveEndpointTest.AuthorizedRequest/1 (104 ms)
[ RUN      ] Endpoint/SlaveEndpointTest.AuthorizedRequest/2
I0706 00:43:12.765888 29426 containerizer.cpp:196] Using isolation: posix/cpu,posix/mem,filesystem/posix,network/cni
W0706 00:43:12.767298 29426 backend.cpp:75] Failed to create 'aufs' backend: AufsBackend requires
root privileges, but is running as user mesos
W0706 00:43:12.767556 29426 backend.cpp:75] Failed to create 'bind' backend: BindBackend requires
root privileges
I0706 00:43:12.779500 29458 slave.cpp:203] Agent started on 543)@172.17.0.7:36960
I0706 00:43:12.779528 29458 slave.cpp:204] Flags at startup: --acls="" --appc_simple_discovery_uri_prefix="http://"
--appc_store_dir="/tmp/mesos/store/appc" --authenticate_http="true" --authenticatee="crammd5"
--authorizer="local" --cgroups_cpu_enable_pids_and_tids_count="false" --cgroups_enable_cfs="false"
--cgroups_hierarchy="/sys/fs/cgroup" --cgroups_limit_swap="false" --cgroups_root="mesos" --container_disk_watch_interval="15secs"
--containerizers="mesos" --credential="/tmp/Endpoint_SlaveEndpointTest_AuthorizedRequest_2_ZJEDQe/credential"
--default_role="*" --disk_watch_interval="1mins" --docker="docker" --docker_kill_orphans="true"
--docker_registry="https://registry-1.docker.io" --docker_remove_delay="6hrs" --docker_socket="/var/run/docker.sock"
--docker_stop_timeout="0ns" --docker_store_dir="/tmp/mesos/store/docker" --docker_volume_checkpoint_dir="/var/run/mesos/isolators/docker/volume"
--enforce_container_disk_quota="false" --executor_registration_timeout="1mins" --executor_shutdown_grace_period="5secs"
--fetcher_cache_dir="/tmp/Endpoint_SlaveEndpointTest_AuthorizedRequest_2_ZJEDQe/fetch" --fetcher_cache_size="2GB"
--frameworks_home="" --gc_delay="1weeks" --gc_disk_headroom="0.1" --hadoop_home="" --help="false"
--hostname_lookup="true" --http_authenticators="basic" --http_command_executor="false" --http_credentials="/tmp/Endpoint_SlaveEndpointTest_AuthorizedRequest_2_ZJEDQe/http_credentials"
--image_provisioner_backend="copy" --initialize_driver_logging="true" --isolation="posix/cpu,posix/mem"
--launcher_dir="/mesos/mesos-1.0.0/_build/src" --logbufsecs="0" --logging_level="INFO" --oversubscribed_resources_interval="15secs"
--perf_duration="10secs" --perf_interval="1mins" --qos_correction_interval_min="0ns" --quiet="false"
--recover="reconnect" --recovery_timeout="15mins" --registration_backoff_factor="10ms" --resources="cpus:2;gpus:0;mem:1024;disk:1024;ports:[31000-32000]"
--revocable_cpu_low_priority="true" --sandbox_directory="/mnt/mesos/sandbox" --strict="true"
--switch_user="true" --systemd_enable_support="true" --systemd_runtime_directory="/run/systemd/system"
--version="false" --work_dir="/tmp/Endpoint_SlaveEndpointTest_AuthorizedRequest_2_ZJEDQe"
I0706 00:43:12.780140 29458 credentials.hpp:86] Loading credential for authentication from
'/tmp/Endpoint_SlaveEndpointTest_AuthorizedRequest_2_ZJEDQe/credential'
I0706 00:43:12.780339 29458 slave.cpp:341] Agent using credential for: test-principal
I0706 00:43:12.780374 29458 credentials.hpp:37] Loading credentials for authentication from
'/tmp/Endpoint_SlaveEndpointTest_AuthorizedRequest_2_ZJEDQe/http_credentials'
I0706 00:43:12.780673 29458 slave.cpp:393] Using default 'basic' HTTP authenticator
I0706 00:43:12.780983 29458 resources.cpp:572] Parsing resources as JSON failed: cpus:2;gpus:0;mem:1024;disk:1024;ports:[31000-32000]
Trying semicolon-delimited string format instead
I0706 00:43:12.781677 29458 resources.cpp:572] Parsing resources as JSON failed: cpus:2;gpus:0;mem:1024;disk:1024;ports:[31000-32000]
Trying semicolon-delimited string format instead
I0706 00:43:12.782150 29458 slave.cpp:592] Agent resources: cpus(*):2; mem(*):1024; disk(*):1024;
ports(*):[31000-32000]
I0706 00:43:12.782220 29458 slave.cpp:600] Agent attributes: [  ]
I0706 00:43:12.782235 29458 slave.cpp:605] Agent hostname: 2f46df2c7820
I0706 00:43:12.785225 29458 state.cpp:57] Recovering state from '/tmp/Endpoint_SlaveEndpointTest_AuthorizedRequest_2_ZJEDQe/meta'
I0706 00:43:12.785643 29459 status_update_manager.cpp:200] Recovering status update manager
I0706 00:43:12.785784 29459 containerizer.cpp:522] Recovering containerizer
I0706 00:43:12.789301 29445 provisioner.cpp:253] Provisioner recovery complete
I0706 00:43:12.789593 29450 slave.cpp:4839] Finished recovery
I0706 00:43:12.790138 29450 slave.cpp:5011] Querying resource estimator for oversubscribable
resources
I0706 00:43:12.790824 29450 slave.cpp:5025] Received oversubscribable resources  from the
resource estimator
I0706 00:43:12.794107 29459 process.cpp:3322] Handling HTTP event for process 'slave(543)'
with path: '/slave(543)/containers'
I0706 00:43:12.796955 29459 http.cpp:765] Authorizing principal 'test-principal' to GET the
'/containers' endpoint
I0706 00:43:12.855717 29453 slave.cpp:839] Agent terminating
[       OK ] Endpoint/SlaveEndpointTest.AuthorizedRequest/2 (132 ms)
[ RUN      ] Endpoint/SlaveEndpointTest.UnauthorizedRequest/0
I0706 00:43:12.902900 29426 containerizer.cpp:196] Using isolation: posix/cpu,posix/mem,filesystem/posix,network/cni
W0706 00:43:12.905714 29426 backend.cpp:75] Failed to create 'aufs' backend: AufsBackend requires
root privileges, but is running as user mesos
W0706 00:43:12.905920 29426 backend.cpp:75] Failed to create 'bind' backend: BindBackend requires
root privileges
I0706 00:43:12.920159 29452 slave.cpp:203] Agent started on 544)@172.17.0.7:36960
I0706 00:43:12.920189 29452 slave.cpp:204] Flags at startup: --acls="" --appc_simple_discovery_uri_prefix="http://"
--appc_store_dir="/tmp/mesos/store/appc" --authenticate_http="true" --authenticatee="crammd5"
--authorizer="local" --cgroups_cpu_enable_pids_and_tids_count="false" --cgroups_enable_cfs="false"
--cgroups_hierarchy="/sys/fs/cgroup" --cgroups_limit_swap="false" --cgroups_root="mesos" --container_disk_watch_interval="15secs"
--containerizers="mesos" --credential="/tmp/Endpoint_SlaveEndpointTest_UnauthorizedRequest_0_U1uSxQ/credential"
--default_role="*" --disk_watch_interval="1mins" --docker="docker" --docker_kill_orphans="true"
--docker_registry="https://registry-1.docker.io" --docker_remove_delay="6hrs" --docker_socket="/var/run/docker.sock"
--docker_stop_timeout="0ns" --docker_store_dir="/tmp/mesos/store/docker" --docker_volume_checkpoint_dir="/var/run/mesos/isolators/docker/volume"
--enforce_container_disk_quota="false" --executor_registration_timeout="1mins" --executor_shutdown_grace_period="5secs"
--fetcher_cache_dir="/tmp/Endpoint_SlaveEndpointTest_UnauthorizedRequest_0_U1uSxQ/fetch" --fetcher_cache_size="2GB"
--frameworks_home="" --gc_delay="1weeks" --gc_disk_headroom="0.1" --hadoop_home="" --help="false"
--hostname_lookup="true" --http_authenticators="basic" --http_command_executor="false" --http_credentials="/tmp/Endpoint_SlaveEndpointTest_UnauthorizedRequest_0_U1uSxQ/http_credentials"
--image_provisioner_backend="copy" --initialize_driver_logging="true" --isolation="posix/cpu,posix/mem"
--launcher_dir="/mesos/mesos-1.0.0/_build/src" --logbufsecs="0" --logging_level="INFO" --oversubscribed_resources_interval="15secs"
--perf_duration="10secs" --perf_interval="1mins" --qos_correction_interval_min="0ns" --quiet="false"
--recover="reconnect" --recovery_timeout="15mins" --registration_backoff_factor="10ms" --resources="cpus:2;gpus:0;mem:1024;disk:1024;ports:[31000-32000]"
--revocable_cpu_low_priority="true" --sandbox_directory="/mnt/mesos/sandbox" --strict="true"
--switch_user="true" --systemd_enable_support="true" --systemd_runtime_directory="/run/systemd/system"
--version="false" --work_dir="/tmp/Endpoint_SlaveEndpointTest_UnauthorizedRequest_0_U1uSxQ"
I0706 00:43:12.920862 29452 credentials.hpp:86] Loading credential for authentication from
'/tmp/Endpoint_SlaveEndpointTest_UnauthorizedRequest_0_U1uSxQ/credential'
I0706 00:43:12.921090 29452 slave.cpp:341] Agent using credential for: test-principal
I0706 00:43:12.921125 29452 credentials.hpp:37] Loading credentials for authentication from
'/tmp/Endpoint_SlaveEndpointTest_UnauthorizedRequest_0_U1uSxQ/http_credentials'
I0706 00:43:12.921433 29452 slave.cpp:393] Using default 'basic' HTTP authenticator
I0706 00:43:12.921730 29452 resources.cpp:572] Parsing resources as JSON failed: cpus:2;gpus:0;mem:1024;disk:1024;ports:[31000-32000]
Trying semicolon-delimited string format instead
I0706 00:43:12.922160 29452 resources.cpp:572] Parsing resources as JSON failed: cpus:2;gpus:0;mem:1024;disk:1024;ports:[31000-32000]
Trying semicolon-delimited string format instead
I0706 00:43:12.922664 29452 slave.cpp:592] Agent resources: cpus(*):2; mem(*):1024; disk(*):1024;
ports(*):[31000-32000]
I0706 00:43:12.922739 29452 slave.cpp:600] Agent attributes: [  ]
I0706 00:43:12.922754 29452 slave.cpp:605] Agent hostname: 2f46df2c7820
I0706 00:43:12.925381 29452 state.cpp:57] Recovering state from '/tmp/Endpoint_SlaveEndpointTest_UnauthorizedRequest_0_U1uSxQ/meta'
I0706 00:43:12.925688 29459 status_update_manager.cpp:200] Recovering status update manager
I0706 00:43:12.925868 29459 containerizer.cpp:522] Recovering containerizer
I0706 00:43:12.928195 29458 provisioner.cpp:253] Provisioner recovery complete
I0706 00:43:12.928580 29449 slave.cpp:4839] Finished recovery
I0706 00:43:12.929435 29449 slave.cpp:5011] Querying resource estimator for oversubscribable
resources
I0706 00:43:12.929687 29449 slave.cpp:5025] Received oversubscribable resources  from the
resource estimator
I0706 00:43:12.933416 29457 process.cpp:3322] Handling HTTP event for process 'slave(544)'
with path: '/slave(544)/monitor/statistics'
I0706 00:43:12.934787 29457 http.cpp:765] Authorizing principal 'test-principal' to GET the
'/monitor/statistics' endpoint
I0706 00:43:12.939512 29426 slave.cpp:839] Agent terminating
[       OK ] Endpoint/SlaveEndpointTest.UnauthorizedRequest/0 (80 ms)
[ RUN      ] Endpoint/SlaveEndpointTest.UnauthorizedRequest/1
I0706 00:43:12.980271 29426 containerizer.cpp:196] Using isolation: posix/cpu,posix/mem,filesystem/posix,network/cni
W0706 00:43:12.982133 29426 backend.cpp:75] Failed to create 'aufs' backend: AufsBackend requires
root privileges, but is running as user mesos
W0706 00:43:12.982743 29426 backend.cpp:75] Failed to create 'bind' backend: BindBackend requires
root privileges
I0706 00:43:12.988365 29455 slave.cpp:203] Agent started on 545)@172.17.0.7:36960
I0706 00:43:12.988391 29455 slave.cpp:204] Flags at startup: --acls="" --appc_simple_discovery_uri_prefix="http://"
--appc_store_dir="/tmp/mesos/store/appc" --authenticate_http="true" --authenticatee="crammd5"
--authorizer="local" --cgroups_cpu_enable_pids_and_tids_count="false" --cgroups_enable_cfs="false"
--cgroups_hierarchy="/sys/fs/cgroup" --cgroups_limit_swap="false" --cgroups_root="mesos" --container_disk_watch_interval="15secs"
--containerizers="mesos" --credential="/tmp/Endpoint_SlaveEndpointTest_UnauthorizedRequest_1_SEJT1s/credential"
--default_role="*" --disk_watch_interval="1mins" --docker="docker" --docker_kill_orphans="true"
--docker_registry="https://registry-1.docker.io" --docker_remove_delay="6hrs" --docker_socket="/var/run/docker.sock"
--docker_stop_timeout="0ns" --docker_store_dir="/tmp/mesos/store/docker" --docker_volume_checkpoint_dir="/var/run/mesos/isolators/docker/volume"
--enforce_container_disk_quota="false" --executor_registration_timeout="1mins" --executor_shutdown_grace_period="5secs"
--fetcher_cache_dir="/tmp/Endpoint_SlaveEndpointTest_UnauthorizedRequest_1_SEJT1s/fetch" --fetcher_cache_size="2GB"
--frameworks_home="" --gc_delay="1weeks" --gc_disk_headroom="0.1" --hadoop_home="" --help="true"
--hostname_lookup="true" --http_authenticators="basic" --http_command_executor="false" --http_credentials="/tmp/Endpoint_SlaveEndpointTest_UnauthorizedRequest_1_SEJT1s/http_credentials"
--image_provisioner_backend="copy" --initialize_driver_logging="true" --isolation="posix/cpu,posix/mem"
--launcher_dir="/mesos/mesos-1.0.0/_build/src" --logbufsecs="0" --logging_level="INFO" --oversubscribed_resources_interval="15secs"
--perf_duration="10secs" --perf_interval="1mins" --qos_correction_interval_min="0ns" --quiet="false"
--recover="reconnect" --recovery_timeout="15mins" --registration_backoff_factor="10ms" --resources="cpus:2;gpus:0;mem:1024;disk:1024;ports:[31000-32000]"
--revocable_cpu_low_priority="true" --sandbox_directory="/mnt/mesos/sandbox" --strict="true"
--switch_user="true" --systemd_enable_support="true" --systemd_runtime_directory="/run/systemd/system"
--version="false" --work_dir="/tmp/Endpoint_SlaveEndpointTest_UnauthorizedRequest_1_SEJT1s"
I0706 00:43:12.988952 29455 credentials.hpp:86] Loading credential for authentication from
'/tmp/Endpoint_SlaveEndpointTest_UnauthorizedRequest_1_SEJT1s/credential'
I0706 00:43:12.989239 29455 slave.cpp:341] Agent using credential for: test-principal
I0706 00:43:12.989274 29455 credentials.hpp:37] Loading credentials for authentication from
'/tmp/Endpoint_SlaveEndpointTest_UnauthorizedRequest_1_SEJT1s/http_credentials'
I0706 00:43:12.989557 29455 slave.cpp:393] Using default 'basic' HTTP authenticator
I0706 00:43:12.989832 29455 resources.cpp:572] Parsing resources as JSON failed: cpus:2;gpus:0;mem:1024;disk:1024;ports:[31000-32000]
Trying semicolon-delimited string format instead
I0706 00:43:12.990239 29455 resources.cpp:572] Parsing resources as JSON failed: cpus:2;gpus:0;mem:1024;disk:1024;ports:[31000-32000]
Trying semicolon-delimited string format instead
I0706 00:43:12.990902 29455 slave.cpp:592] Agent resources: cpus(*):2; mem(*):1024; disk(*):1024;
ports(*):[31000-32000]
I0706 00:43:12.990972 29455 slave.cpp:600] Agent attributes: [  ]
I0706 00:43:12.990988 29455 slave.cpp:605] Agent hostname: 2f46df2c7820
I0706 00:43:12.994220 29458 state.cpp:57] Recovering state from '/tmp/Endpoint_SlaveEndpointTest_UnauthorizedRequest_1_SEJT1s/meta'
I0706 00:43:12.994539 29448 status_update_manager.cpp:200] Recovering status update manager
I0706 00:43:12.994702 29453 containerizer.cpp:522] Recovering containerizer
I0706 00:43:12.997402 29453 provisioner.cpp:253] Provisioner recovery complete
I0706 00:43:12.997905 29455 slave.cpp:4839] Finished recovery
I0706 00:43:12.998404 29455 slave.cpp:5011] Querying resource estimator for oversubscribable
resources
I0706 00:43:12.998670 29458 slave.cpp:5025] Received oversubscribable resources  from the
resource estimator
I0706 00:43:13.001078 29453 process.cpp:3322] Handling HTTP event for process 'slave(545)'
with path: '/slave(545)/monitor/statistics.json'
I0706 00:43:13.002475 29453 http.cpp:765] Authorizing principal 'test-principal' to GET the
'/monitor/statistics.json' endpoint
I0706 00:43:13.032650 29448 slave.cpp:839] Agent terminating
[       OK ] Endpoint/SlaveEndpointTest.UnauthorizedRequest/1 (105 ms)
[ RUN      ] Endpoint/SlaveEndpointTest.UnauthorizedRequest/2
I0706 00:43:13.086791 29426 containerizer.cpp:196] Using isolation: posix/cpu,posix/mem,filesystem/posix,network/cni
W0706 00:43:13.088820 29426 backend.cpp:75] Failed to create 'aufs' backend: AufsBackend requires
root privileges, but is running as user mesos
W0706 00:43:13.088978 29426 backend.cpp:75] Failed to create 'bind' backend: BindBackend requires
root privileges
I0706 00:43:13.095464 29445 slave.cpp:203] Agent started on 546)@172.17.0.7:36960
I0706 00:43:13.095486 29445 slave.cpp:204] Flags at startup: --acls="" --appc_simple_discovery_uri_prefix="http://"
--appc_store_dir="/tmp/mesos/store/appc" --authenticate_http="true" --authenticatee="crammd5"
--authorizer="local" --cgroups_cpu_enable_pids_and_tids_count="false" --cgroups_enable_cfs="false"
--cgroups_hierarchy="/sys/fs/cgroup" --cgroups_limit_swap="false" --cgroups_root="mesos" --container_disk_watch_interval="15secs"
--containerizers="mesos" --credential="/tmp/Endpoint_SlaveEndpointTest_UnauthorizedRequest_2_EJdNf6/credential"
--default_role="*" --disk_watch_interval="1mins" --docker="docker" --docker_kill_orphans="true"
--docker_registry="https://registry-1.docker.io" --docker_remove_delay="6hrs" --docker_socket="/var/run/docker.sock"
--docker_stop_timeout="0ns" --docker_store_dir="/tmp/mesos/store/docker" --docker_volume_checkpoint_dir="/var/run/mesos/isolators/docker/volume"
--enforce_container_disk_quota="false" --executor_registration_timeout="1mins" --executor_shutdown_grace_period="5secs"
--fetcher_cache_dir="/tmp/Endpoint_SlaveEndpointTest_UnauthorizedRequest_2_EJdNf6/fetch" --fetcher_cache_size="2GB"
--frameworks_home="" --gc_delay="1weeks" --gc_disk_headroom="0.1" --hadoop_home="" --help="false"
--hostname_lookup="true" --http_authenticators="basic" --http_command_executor="false" --http_credentials="/tmp/Endpoint_SlaveEndpointTest_UnauthorizedRequest_2_EJdNf6/http_credentials"
--image_provisioner_backend="copy" --initialize_driver_logging="true" --isolation="posix/cpu,posix/mem"
--launcher_dir="/mesos/mesos-1.0.0/_build/src" --logbufsecs="0" --logging_level="INFO" --oversubscribed_resources_interval="15secs"
--perf_duration="10secs" --perf_interval="1mins" --qos_correction_interval_min="0ns" --quiet="false"
--recover="reconnect" --recovery_timeout="15mins" --registration_backoff_factor="10ms" --resources="cpus:2;gpus:0;mem:1024;disk:1024;ports:[31000-32000]"
--revocable_cpu_low_priority="true" --sandbox_directory="/mnt/mesos/sandbox" --strict="true"
--switch_user="true" --systemd_enable_support="true" --systemd_runtime_directory="/run/systemd/system"
--version="false" --work_dir="/tmp/Endpoint_SlaveEndpointTest_UnauthorizedRequest_2_EJdNf6"
I0706 00:43:13.096022 29445 credentials.hpp:86] Loading credential for authentication from
'/tmp/Endpoint_SlaveEndpointTest_UnauthorizedRequest_2_EJdNf6/credential'
I0706 00:43:13.096189 29445 slave.cpp:341] Agent using credential for: test-principal
I0706 00:43:13.096221 29445 credentials.hpp:37] Loading credentials for authentication from
'/tmp/Endpoint_SlaveEndpointTest_UnauthorizedRequest_2_EJdNf6/http_credentials'
I0706 00:43:13.096530 29445 slave.cpp:393] Using default 'basic' HTTP authenticator
I0706 00:43:13.096789 29445 resources.cpp:572] Parsing resources as JSON failed: cpus:2;gpus:0;mem:1024;disk:1024;ports:[31000-32000]
Trying semicolon-delimited string format instead
I0706 00:43:13.097170 29445 resources.cpp:572] Parsing resources as JSON failed: cpus:2;gpus:0;mem:1024;disk:1024;ports:[31000-32000]
Trying semicolon-delimited string format instead
I0706 00:43:13.098649 29445 slave.cpp:592] Agent resources: cpus(*):2; mem(*):1024; disk(*):1024;
ports(*):[31000-32000]
I0706 00:43:13.098721 29445 slave.cpp:600] Agent attributes: [  ]
I0706 00:43:13.098734 29445 slave.cpp:605] Agent hostname: 2f46df2c7820
I0706 00:43:13.100584 29454 state.cpp:57] Recovering state from '/tmp/Endpoint_SlaveEndpointTest_UnauthorizedRequest_2_EJdNf6/meta'
I0706 00:43:13.101115 29454 status_update_manager.cpp:200] Recovering status update manager
I0706 00:43:13.101251 29454 containerizer.cpp:522] Recovering containerizer
I0706 00:43:13.103050 29454 provisioner.cpp:253] Provisioner recovery complete
I0706 00:43:13.104266 29454 slave.cpp:4839] Finished recovery
I0706 00:43:13.105749 29454 slave.cpp:5011] Querying resource estimator for oversubscribable
resources
I0706 00:43:13.106637 29454 process.cpp:3322] Handling HTTP event for process 'slave(546)'
with path: '/slave(546)/containers'
I0706 00:43:13.108496 29454 slave.cpp:5025] Received oversubscribable resources  from the
resource estimator
I0706 00:43:13.109076 29457 http.cpp:765] Authorizing principal 'test-principal' to GET the
'/containers' endpoint
I0706 00:43:13.112541 29451 slave.cpp:839] Agent terminating
[       OK ] Endpoint/SlaveEndpointTest.UnauthorizedRequest/2 (39 ms)
[ RUN      ] Endpoint/SlaveEndpointTest.NoAuthorizer/0
I0706 00:43:13.124271 29426 containerizer.cpp:196] Using isolation: posix/cpu,posix/mem,filesystem/posix,network/cni
W0706 00:43:13.124969 29426 backend.cpp:75] Failed to create 'aufs' backend: AufsBackend requires
root privileges, but is running as user mesos
W0706 00:43:13.125100 29426 backend.cpp:75] Failed to create 'bind' backend: BindBackend requires
root privileges
I0706 00:43:13.126399 29426 cluster.cpp:432] Creating default 'local' authorizer
I0706 00:43:13.129957 29455 slave.cpp:203] Agent started on 547)@172.17.0.7:36960
I0706 00:43:13.129987 29455 slave.cpp:204] Flags at startup: --acls="" --appc_simple_discovery_uri_prefix="http://"
--appc_store_dir="/tmp/mesos/store/appc" --authenticate_http="true" --authenticatee="crammd5"
--authorizer="local" --cgroups_cpu_enable_pids_and_tids_count="false" --cgroups_enable_cfs="false"
--cgroups_hierarchy="/sys/fs/cgroup" --cgroups_limit_swap="false" --cgroups_root="mesos" --container_disk_watch_interval="15secs"
--containerizers="mesos" --credential="/tmp/Endpoint_SlaveEndpointTest_NoAuthorizer_0_yvyZXJ/credential"
--default_role="*" --disk_watch_interval="1mins" --docker="docker" --docker_kill_orphans="true"
--docker_registry="https://registry-1.docker.io" --docker_remove_delay="6hrs" --docker_socket="/var/run/docker.sock"
--docker_stop_timeout="0ns" --docker_store_dir="/tmp/mesos/store/docker" --docker_volume_checkpoint_dir="/var/run/mesos/isolators/docker/volume"
--enforce_container_disk_quota="false" --executor_registration_timeout="1mins" --executor_shutdown_grace_period="5secs"
--fetcher_cache_dir="/tmp/Endpoint_SlaveEndpointTest_NoAuthorizer_0_yvyZXJ/fetch" --fetcher_cache_size="2GB"
--frameworks_home="" --gc_delay="1weeks" --gc_disk_headroom="0.1" --hadoop_home="" --help="false"
--hostname_lookup="true" --http_authenticators="basic" --http_command_executor="false" --http_credentials="/tmp/Endpoint_SlaveEndpointTest_NoAuthorizer_0_yvyZXJ/http_credentials"
--image_provisioner_backend="copy" --initialize_driver_logging="true" --isolation="posix/cpu,posix/mem"
--launcher_dir="/mesos/mesos-1.0.0/_build/src" --logbufsecs="0" --logging_level="INFO" --oversubscribed_resources_interval="15secs"
--perf_duration="10secs" --perf_interval="1mins" --qos_correction_interval_min="0ns" --quiet="false"
--recover="reconnect" --recovery_timeout="15mins" --registration_backoff_factor="10ms" --resources="cpus:2;gpus:0;mem:1024;disk:1024;ports:[31000-32000]"
--revocable_cpu_low_priority="true" --sandbox_directory="/mnt/mesos/sandbox" --strict="true"
--switch_user="true" --systemd_enable_support="true" --systemd_runtime_directory="/run/systemd/system"
--version="false" --work_dir="/tmp/Endpoint_SlaveEndpointTest_NoAuthorizer_0_yvyZXJ"
I0706 00:43:13.130693 29455 credentials.hpp:86] Loading credential for authentication from
'/tmp/Endpoint_SlaveEndpointTest_NoAuthorizer_0_yvyZXJ/credential'
I0706 00:43:13.130908 29455 slave.cpp:341] Agent using credential for: test-principal
I0706 00:43:13.130946 29455 credentials.hpp:37] Loading credentials for authentication from
'/tmp/Endpoint_SlaveEndpointTest_NoAuthorizer_0_yvyZXJ/http_credentials'
I0706 00:43:13.131237 29455 slave.cpp:393] Using default 'basic' HTTP authenticator
I0706 00:43:13.131863 29455 resources.cpp:572] Parsing resources as JSON failed: cpus:2;gpus:0;mem:1024;disk:1024;ports:[31000-32000]
Trying semicolon-delimited string format instead
I0706 00:43:13.132324 29455 resources.cpp:572] Parsing resources as JSON failed: cpus:2;gpus:0;mem:1024;disk:1024;ports:[31000-32000]
Trying semicolon-delimited string format instead
I0706 00:43:13.132912 29455 slave.cpp:592] Agent resources: cpus(*):2; mem(*):1024; disk(*):1024;
ports(*):[31000-32000]
I0706 00:43:13.132994 29455 slave.cpp:600] Agent attributes: [  ]
I0706 00:43:13.133013 29455 slave.cpp:605] Agent hostname: 2f46df2c7820
I0706 00:43:13.134627 29457 state.cpp:57] Recovering state from '/tmp/Endpoint_SlaveEndpointTest_NoAuthorizer_0_yvyZXJ/meta'
I0706 00:43:13.135126 29457 status_update_manager.cpp:200] Recovering status update manager
I0706 00:43:13.135526 29457 containerizer.cpp:522] Recovering containerizer
I0706 00:43:13.137282 29457 provisioner.cpp:253] Provisioner recovery complete
I0706 00:43:13.137996 29445 slave.cpp:4839] Finished recovery
I0706 00:43:13.138772 29445 slave.cpp:5011] Querying resource estimator for oversubscribable
resources
I0706 00:43:13.139973 29445 process.cpp:3322] Handling HTTP event for process 'slave(547)'
with path: '/slave(547)/monitor/statistics'
I0706 00:43:13.140280 29445 slave.cpp:5025] Received oversubscribable resources  from the
resource estimator
I0706 00:43:13.141113 29454 http.cpp:765] Authorizing principal 'test-principal' to GET the
'/monitor/statistics' endpoint
I0706 00:43:13.146011 29426 slave.cpp:839] Agent terminating
[       OK ] Endpoint/SlaveEndpointTest.NoAuthorizer/0 (39 ms)
[ RUN      ] Endpoint/SlaveEndpointTest.NoAuthorizer/1
I0706 00:43:13.164230 29426 containerizer.cpp:196] Using isolation: posix/cpu,posix/mem,filesystem/posix,network/cni
W0706 00:43:13.165218 29426 backend.cpp:75] Failed to create 'aufs' backend: AufsBackend requires
root privileges, but is running as user mesos
W0706 00:43:13.165402 29426 backend.cpp:75] Failed to create 'bind' backend: BindBackend requires
root privileges
I0706 00:43:13.167515 29426 cluster.cpp:432] Creating default 'local' authorizer
I0706 00:43:13.170203 29456 slave.cpp:203] Agent started on 548)@172.17.0.7:36960
I0706 00:43:13.170235 29456 slave.cpp:204] Flags at startup: --acls="" --appc_simple_discovery_uri_prefix="http://"
--appc_store_dir="/tmp/mesos/store/appc" --authenticate_http="true" --authenticatee="crammd5"
--authorizer="local" --cgroups_cpu_enable_pids_and_tids_count="false" --cgroups_enable_cfs="false"
--cgroups_hierarchy="/sys/fs/cgroup" --cgroups_limit_swap="false" --cgroups_root="mesos" --container_disk_watch_interval="15secs"
--containerizers="mesos" --credential="/tmp/Endpoint_SlaveEndpointTest_NoAuthorizer_1_z27iYn/credential"
--default_role="*" --disk_watch_interval="1mins" --docker="docker" --docker_kill_orphans="true"
--docker_registry="https://registry-1.docker.io" --docker_remove_delay="6hrs" --docker_socket="/var/run/docker.sock"
--docker_stop_timeout="0ns" --docker_store_dir="/tmp/mesos/store/docker" --docker_volume_checkpoint_dir="/var/run/mesos/isolators/docker/volume"
--enforce_container_disk_quota="false" --executor_registration_timeout="1mins" --executor_shutdown_grace_period="5secs"
--fetcher_cache_dir="/tmp/Endpoint_SlaveEndpointTest_NoAuthorizer_1_z27iYn/fetch" --fetcher_cache_size="2GB"
--frameworks_home="" --gc_delay="1weeks" --gc_disk_headroom="0.1" --hadoop_home="" --help="false"
--hostname_lookup="true" --http_authenticators="basic" --http_command_executor="false" --http_credentials="/tmp/Endpoint_SlaveEndpointTest_NoAuthorizer_1_z27iYn/http_credentials"
--image_provisioner_backend="copy" --initialize_driver_logging="true" --isolation="posix/cpu,posix/mem"
--launcher_dir="/mesos/mesos-1.0.0/_build/src" --logbufsecs="0" --logging_level="INFO" --oversubscribed_resources_interval="15secs"
--perf_duration="10secs" --perf_interval="1mins" --qos_correction_interval_min="0ns" --quiet="false"
--recover="reconnect" --recovery_timeout="15mins" --registration_backoff_factor="10ms" --resources="cpus:2;gpus:0;mem:1024;disk:1024;ports:[31000-32000]"
--revocable_cpu_low_priority="true" --sandbox_directory="/mnt/mesos/sandbox" --strict="true"
--switch_user="true" --systemd_enable_support="true" --systemd_runtime_directory="/run/systemd/system"
--version="false" --work_dir="/tmp/Endpoint_SlaveEndpointTest_NoAuthorizer_1_z27iYn"
I0706 00:43:13.171090 29456 credentials.hpp:86] Loading credential for authentication from
'/tmp/Endpoint_SlaveEndpointTest_NoAuthorizer_1_z27iYn/credential'
I0706 00:43:13.171330 29456 slave.cpp:341] Agent using credential for: test-principal
I0706 00:43:13.171368 29456 credentials.hpp:37] Loading credentials for authentication from
'/tmp/Endpoint_SlaveEndpointTest_NoAuthorizer_1_z27iYn/http_credentials'
I0706 00:43:13.171674 29456 slave.cpp:393] Using default 'basic' HTTP authenticator
I0706 00:43:13.171958 29456 resources.cpp:572] Parsing resources as JSON failed: cpus:2;gpus:0;mem:1024;disk:1024;ports:[31000-32000]
Trying semicolon-delimited string format instead
I0706 00:43:13.172616 29456 resources.cpp:572] Parsing resources as JSON failed: cpus:2;gpus:0;mem:1024;disk:1024;ports:[31000-32000]
Trying semicolon-delimited string format instead
I0706 00:43:13.173182 29456 slave.cpp:592] Agent resources: cpus(*):2; mem(*):1024; disk(*):1024;
ports(*):[31000-32000]
I0706 00:43:13.173265 29456 slave.cpp:600] Agent attributes: [  ]
I0706 00:43:13.173285 29456 slave.cpp:605] Agent hostname: 2f46df2c7820
I0706 00:43:13.175915 29450 state.cpp:57] Recovering state from '/tmp/Endpoint_SlaveEndpointTest_NoAuthorizer_1_z27iYn/meta'
I0706 00:43:13.175992 29456 process.cpp:3322] Handling HTTP event for process 'slave(548)'
with path: '/slave(548)/monitor/statistics.json'
I0706 00:43:13.176651 29449 status_update_manager.cpp:200] Recovering status update manager
I0706 00:43:13.177500 29449 http.cpp:765] Authorizing principal 'test-principal' to GET the
'/monitor/statistics.json' endpoint
I0706 00:43:13.177503 29455 containerizer.cpp:522] Recovering containerizer
I0706 00:43:13.180032 29455 provisioner.cpp:253] Provisioner recovery complete
I0706 00:43:13.182011 29458 slave.cpp:4839] Finished recovery
I0706 00:43:13.182734 29458 slave.cpp:5011] Querying resource estimator for oversubscribable
resources
I0706 00:43:13.183230 29458 slave.cpp:5025] Received oversubscribable resources  from the
resource estimator
I0706 00:43:13.184783 29451 slave.cpp:839] Agent terminating
[       OK ] Endpoint/SlaveEndpointTest.NoAuthorizer/1 (47 ms)
[ RUN      ] Endpoint/SlaveEndpointTest.NoAuthorizer/2
I0706 00:43:13.212368 29426 containerizer.cpp:196] Using isolation: posix/cpu,posix/mem,filesystem/posix,network/cni
W0706 00:43:13.213543 29426 backend.cpp:75] Failed to create 'aufs' backend: AufsBackend requires
root privileges, but is running as user mesos
W0706 00:43:13.213768 29426 backend.cpp:75] Failed to create 'bind' backend: BindBackend requires
root privileges
I0706 00:43:13.215765 29426 cluster.cpp:432] Creating default 'local' authorizer
I0706 00:43:13.218344 29448 slave.cpp:203] Agent started on 549)@172.17.0.7:36960
I0706 00:43:13.218372 29448 slave.cpp:204] Flags at startup: --acls="" --appc_simple_discovery_uri_prefix="http://"
--appc_store_dir="/tmp/mesos/store/appc" --authenticate_http="true" --authenticatee="crammd5"
--authorizer="local" --cgroups_cpu_enable_pids_and_tids_count="false" --cgroups_enable_cfs="false"
--cgroups_hierarchy="/sys/fs/cgroup" --cgroups_limit_swap="false" --cgroups_root="mesos" --container_disk_watch_interval="15secs"
--containerizers="mesos" --credential="/tmp/Endpoint_SlaveEndpointTest_NoAuthorizer_2_CTJbf1/credential"
--default_role="*" --disk_watch_interval="1mins" --docker="docker" --docker_kill_orphans="true"
--docker_registry="https://registry-1.docker.io" --docker_remove_delay="6hrs" --docker_socket="/var/run/docker.sock"
--docker_stop_timeout="0ns" --docker_store_dir="/tmp/mesos/store/docker" --docker_volume_checkpoint_dir="/var/run/mesos/isolators/docker/volume"
--enforce_container_disk_quota="false" --executor_registration_timeout="1mins" --executor_shutdown_grace_period="5secs"
--fetcher_cache_dir="/tmp/Endpoint_SlaveEndpointTest_NoAuthorizer_2_CTJbf1/fetch" --fetcher_cache_size="2GB"
--frameworks_home="" --gc_delay="1weeks" --gc_disk_headroom="0.1" --hadoop_home="" --help="false"
--hostname_lookup="true" --http_authenticators="basic" --http_command_executor="false" --http_credentials="/tmp/Endpoint_SlaveEndpointTest_NoAuthorizer_2_CTJbf1/http_credentials"
--image_provisioner_backend="copy" --initialize_driver_logging="true" --isolation="posix/cpu,posix/mem"
--launcher_dir="/mesos/mesos-1.0.0/_build/src" --logbufsecs="0" --logging_level="INFO" --oversubscribed_resources_interval="15secs"
--perf_duration="10secs" --perf_interval="1mins" --qos_correction_interval_min="0ns" --quiet="false"
--recover="reconnect" --recovery_timeout="15mins" --registration_backoff_factor="10ms" --resources="cpus:2;gpus:0;mem:1024;disk:1024;ports:[31000-32000]"
--revocable_cpu_low_priority="true" --sandbox_directory="/mnt/mesos/sandbox" --strict="true"
--switch_user="true" --systemd_enable_support="true" --systemd_runtime_directory="/run/systemd/system"
--version="false" --work_dir="/tmp/Endpoint_SlaveEndpointTest_NoAuthorizer_2_CTJbf1"
I0706 00:43:13.219012 29448 credentials.hpp:86] Loading credential for authentication from
'/tmp/Endpoint_SlaveEndpointTest_NoAuthorizer_2_CTJbf1/credential'
I0706 00:43:13.219244 29448 slave.cpp:341] Agent using credential for: test-principal
I0706 00:43:13.219280 29448 credentials.hpp:37] Loading credentials for authentication from
'/tmp/Endpoint_SlaveEndpointTest_NoAuthorizer_2_CTJbf1/http_credentials'
I0706 00:43:13.220405 29448 slave.cpp:393] Using default 'basic' HTTP authenticator
I0706 00:43:13.221551 29448 resources.cpp:572] Parsing resources as JSON failed: cpus:2;gpus:0;mem:1024;disk:1024;ports:[31000-32000]
Trying semicolon-delimited string format instead
I0706 00:43:13.221949 29448 resources.cpp:572] Parsing resources as JSON failed: cpus:2;gpus:0;mem:1024;disk:1024;ports:[31000-32000]
Trying semicolon-delimited string format instead
I0706 00:43:13.222908 29448 slave.cpp:592] Agent resources: cpus(*):2; mem(*):1024; disk(*):1024;
ports(*):[31000-32000]
I0706 00:43:13.222982 29448 slave.cpp:600] Agent attributes: [  ]
I0706 00:43:13.222996 29448 slave.cpp:605] Agent hostname: 2f46df2c7820
I0706 00:43:13.224638 29456 state.cpp:57] Recovering state from '/tmp/Endpoint_SlaveEndpointTest_NoAuthorizer_2_CTJbf1/meta'
I0706 00:43:13.224730 29448 process.cpp:3322] Handling HTTP event for process 'slave(549)'
with path: '/slave(549)/containers'
I0706 00:43:13.226002 29456 status_update_manager.cpp:200] Recovering status update manager
I0706 00:43:13.226016 29450 http.cpp:765] Authorizing principal 'test-principal' to GET the
'/containers' endpoint
I0706 00:43:13.226613 29450 containerizer.cpp:522] Recovering containerizer
I0706 00:43:13.228066 29459 provisioner.cpp:253] Provisioner recovery complete
I0706 00:43:13.229090 29454 slave.cpp:4839] Finished recovery
I0706 00:43:13.229655 29454 slave.cpp:5011] Querying resource estimator for oversubscribable
resources
I0706 00:43:13.229934 29458 slave.cpp:5025] Received oversubscribable resources  from the
resource estimator
I0706 00:43:13.238178 29456 slave.cpp:839] Agent terminating
[       OK ] Endpoint/SlaveEndpointTest.NoAuthorizer/2 (39 ms)
[----------] 9 tests from Endpoint/SlaveEndpointTest (795 ms total)

[----------] Global test environment tear-down
[==========] 1224 tests from 139 test cases ran. (1003346 ms total)
[  PASSED  ] 1223 tests.
[  FAILED  ] 1 test, listed below:
[  FAILED  ] DiskQuotaTest.SlaveRecovery

 1 FAILED TEST
  YOU HAVE 6 DISABLED TESTS

make[4]: *** [check-local] Error 1
make[4]: Leaving directory `/mesos/mesos-1.0.0/_build/src'
make[3]: *** [check-am] Error 2
make[3]: Leaving directory `/mesos/mesos-1.0.0/_build/src'
make[2]: *** [check] Error 2
make[2]: Leaving directory `/mesos/mesos-1.0.0/_build/src'
make[1]: *** [check-recursive] Error 1
make[1]: Leaving directory `/mesos/mesos-1.0.0/_build'
make: *** [distcheck] Error 1
+ docker rmi mesos-1467760485-8078
Untagged: mesos-1467760485-8078:latest
Deleted: 20b609ee44aa82421508a8de74c26b401c4e79b28688cf44780e3ce6b18401ff
Deleted: c6e28e5845bfd21f56334e88f61889242634388ae4c62306d4bd5b6941da469d
Deleted: 8028c8e1657c203f9144b0512a90558c8b01ea39c40c1b0684bf84bf664bd536
Deleted: 00c44447eea1ae7b3f7672146d0da2f6480f77bb4caceb15c86a46f756ec483a
Deleted: 935aa4d2f6febd97fa65f824db511fab374ee35a170a1270282b9d73ec854e19
Deleted: e71e9728881d221417dadbb7b0075cc55c0a5014f28a01efabeb9b8cf27adf5a
Deleted: 748264da743b52893acf69b2aba1937840d73c7c5f3ded4f90616f6609de7707
Deleted: 24d5b22bbb268a6dfea2757664e06cc093fc2474594651de6b89b1b2e923ae71
Deleted: 0c87c91d30be9505481b8e4d4d34fc9f8675422563464a05408e10c5fa8dd2a8
Deleted: e60b0518389b7b7e6fc115621c530e8b2255421ff5097bcdefe14c3f4835eb79
Deleted: 001ee02195b478250195b42547ab91d2f29331ab964b4aaf4f0327e099551efe
Deleted: 2cad4d0b61561a73e4b9a7bd5f756a737d8dac339dec5c74c1de8877c6b0e7e4
Deleted: abc0660cfb8644d619a51dfa79df16778fba504b13bf7de39c0953a061342f35
Deleted: 06fd522aa4b258c86f971e058029a9a21379ad6b7eb68136db33117ef7389491
Deleted: 5f828693c1e798fba4f90e19275a6b64f1f86653d2cb04e9f3a3f07676cbc59a
Build step 'Execute shell' marked build as failure

Mime
View raw message