mesos-builds mailing list archives

Site index · List index
Message view « Date » · « Thread »
Top « Date » · « Thread »
From Apache Jenkins Server <jenk...@builds.apache.org>
Subject Build failed in Jenkins: Mesos » autotools,gcc,--verbose,GLOG_v=1 MESOS_VERBOSE=1,centos:7,(docker||Hadoop)&&(!ubuntu-us1)&&(!ubuntu-6) #2459
Date Thu, 07 Jul 2016 01:10:58 GMT
See <https://builds.apache.org/job/Mesos/BUILDTOOL=autotools,COMPILER=gcc,CONFIGURATION=--verbose,ENVIRONMENT=GLOG_v=1%20MESOS_VERBOSE=1,OS=centos%3A7,label_exp=(docker%7C%7CHadoop)&&(!ubuntu-us1)&&(!ubuntu-6)/2459/changes>

Changes:

[idownes] Add Ian Downes to contributors.

[yujie.jay] Increased the timeout in DiskQuotaTest.SlaveRecovery.

------------------------------------------
[...truncated 194417 lines...]
I0707 01:10:53.248822 29168 slave.cpp:607] Agent hostname: 1fb1553c913d
I0707 01:10:53.249968 29165 state.cpp:57] Recovering state from '/tmp/Endpoint_SlaveEndpointTest_AuthorizedRequest_1_ivjqS8/meta'
I0707 01:10:53.249990 29168 process.cpp:3322] Handling HTTP event for process 'slave(544)'
with path: '/slave(544)/monitor/statistics.json'
I0707 01:10:53.250634 29164 status_update_manager.cpp:200] Recovering status update manager
I0707 01:10:53.250919 29175 containerizer.cpp:522] Recovering containerizer
I0707 01:10:53.251366 29176 http.cpp:767] Authorizing principal 'test-principal' to GET the
'/monitor/statistics.json' endpoint
I0707 01:10:53.252686 29165 provisioner.cpp:253] Provisioner recovery complete
I0707 01:10:53.253367 29176 slave.cpp:4856] Finished recovery
I0707 01:10:53.253988 29176 slave.cpp:5028] Querying resource estimator for oversubscribable
resources
I0707 01:10:53.254236 29168 slave.cpp:5042] Received oversubscribable resources  from the
resource estimator
I0707 01:10:53.255535 29161 slave.cpp:841] Agent terminating
[       OK ] Endpoint/SlaveEndpointTest.AuthorizedRequest/1 (24 ms)
[ RUN      ] Endpoint/SlaveEndpointTest.AuthorizedRequest/2
I0707 01:10:53.265741 29142 containerizer.cpp:196] Using isolation: posix/cpu,posix/mem,filesystem/posix,network/cni
W0707 01:10:53.266544 29142 backend.cpp:75] Failed to create 'aufs' backend: AufsBackend requires
root privileges, but is running as user mesos
W0707 01:10:53.266715 29142 backend.cpp:75] Failed to create 'bind' backend: BindBackend requires
root privileges
I0707 01:10:53.269634 29169 slave.cpp:205] Agent started on 545)@172.17.0.2:40571
I0707 01:10:53.269664 29169 slave.cpp:206] Flags at startup: --acls="" --appc_simple_discovery_uri_prefix="http://"
--appc_store_dir="/tmp/mesos/store/appc" --authenticate_http="true" --authenticatee="crammd5"
--authentication_backoff_factor="1secs" --authorizer="local" --cgroups_cpu_enable_pids_and_tids_count="false"
--cgroups_enable_cfs="false" --cgroups_hierarchy="/sys/fs/cgroup" --cgroups_limit_swap="false"
--cgroups_root="mesos" --container_disk_watch_interval="15secs" --containerizers="mesos" --credential="/tmp/Endpoint_SlaveEndpointTest_AuthorizedRequest_2_EblJ4c/credential"
--default_role="*" --disk_watch_interval="1mins" --docker="docker" --docker_kill_orphans="true"
--docker_registry="https://registry-1.docker.io" --docker_remove_delay="6hrs" --docker_socket="/var/run/docker.sock"
--docker_stop_timeout="0ns" --docker_store_dir="/tmp/mesos/store/docker" --docker_volume_checkpoint_dir="/var/run/mesos/isolators/docker/volume"
--enforce_container_disk_quota="false" --executor_registration_timeout="1mins" --executor_shutdown_grace_period="5secs"
--fetcher_cache_dir="/tmp/Endpoint_SlaveEndpointTest_AuthorizedRequest_2_EblJ4c/fetch" --fetcher_cache_size="2GB"
--frameworks_home="" --gc_delay="1weeks" --gc_disk_headroom="0.1" --hadoop_home="" --help="true"
--hostname_lookup="true" --http_authenticators="basic" --http_command_executor="false" --http_credentials="/tmp/Endpoint_SlaveEndpointTest_AuthorizedRequest_2_EblJ4c/http_credentials"
--image_provisioner_backend="copy" --initialize_driver_logging="true" --isolation="posix/cpu,posix/mem"
--launcher_dir="/mesos/mesos-1.0.0/_build/src" --logbufsecs="0" --logging_level="INFO" --oversubscribed_resources_interval="15secs"
--perf_duration="10secs" --perf_interval="1mins" --qos_correction_interval_min="0ns" --quiet="false"
--recover="reconnect" --recovery_timeout="15mins" --registration_backoff_factor="10ms" --resources="cpus:2;gpus:0;mem:1024;disk:1024;ports:[31000-32000]"
--revocable_cpu_low_priority="true" --sandbox_directory="/mnt/mesos/sandbox" --strict="true"
--switch_user="true" --systemd_enable_support="true" --systemd_runtime_directory="/run/systemd/system"
--version="false" --work_dir="/tmp/Endpoint_SlaveEndpointTest_AuthorizedRequest_2_EblJ4c"
I0707 01:10:53.270386 29169 credentials.hpp:86] Loading credential for authentication from
'/tmp/Endpoint_SlaveEndpointTest_AuthorizedRequest_2_EblJ4c/credential'
I0707 01:10:53.270622 29169 slave.cpp:343] Agent using credential for: test-principal
I0707 01:10:53.270658 29169 credentials.hpp:37] Loading credentials for authentication from
'/tmp/Endpoint_SlaveEndpointTest_AuthorizedRequest_2_EblJ4c/http_credentials'
I0707 01:10:53.270967 29169 slave.cpp:395] Using default 'basic' HTTP authenticator
I0707 01:10:53.271456 29169 resources.cpp:572] Parsing resources as JSON failed: cpus:2;gpus:0;mem:1024;disk:1024;ports:[31000-32000]
Trying semicolon-delimited string format instead
I0707 01:10:53.271827 29169 resources.cpp:572] Parsing resources as JSON failed: cpus:2;gpus:0;mem:1024;disk:1024;ports:[31000-32000]
Trying semicolon-delimited string format instead
I0707 01:10:53.272305 29169 slave.cpp:594] Agent resources: cpus(*):2; mem(*):1024; disk(*):1024;
ports(*):[31000-32000]
I0707 01:10:53.272380 29169 slave.cpp:602] Agent attributes: [  ]
I0707 01:10:53.272394 29169 slave.cpp:607] Agent hostname: 1fb1553c913d
I0707 01:10:53.273957 29169 process.cpp:3322] Handling HTTP event for process 'slave(545)'
with path: '/slave(545)/containers'
I0707 01:10:53.273958 29175 state.cpp:57] Recovering state from '/tmp/Endpoint_SlaveEndpointTest_AuthorizedRequest_2_EblJ4c/meta'
I0707 01:10:53.274731 29167 status_update_manager.cpp:200] Recovering status update manager
I0707 01:10:53.275032 29172 containerizer.cpp:522] Recovering containerizer
I0707 01:10:53.275177 29166 http.cpp:767] Authorizing principal 'test-principal' to GET the
'/containers' endpoint
I0707 01:10:53.276721 29164 provisioner.cpp:253] Provisioner recovery complete
I0707 01:10:53.277218 29166 slave.cpp:4856] Finished recovery
I0707 01:10:53.277827 29166 slave.cpp:5028] Querying resource estimator for oversubscribable
resources
I0707 01:10:53.278092 29169 slave.cpp:5042] Received oversubscribable resources  from the
resource estimator
I0707 01:10:53.279424 29163 slave.cpp:841] Agent terminating
[       OK ] Endpoint/SlaveEndpointTest.AuthorizedRequest/2 (24 ms)
[ RUN      ] Endpoint/SlaveEndpointTest.UnauthorizedRequest/0
I0707 01:10:53.289718 29142 containerizer.cpp:196] Using isolation: posix/cpu,posix/mem,filesystem/posix,network/cni
W0707 01:10:53.290478 29142 backend.cpp:75] Failed to create 'aufs' backend: AufsBackend requires
root privileges, but is running as user mesos
W0707 01:10:53.290633 29142 backend.cpp:75] Failed to create 'bind' backend: BindBackend requires
root privileges
I0707 01:10:53.294553 29167 slave.cpp:205] Agent started on 546)@172.17.0.2:40571
I0707 01:10:53.294576 29167 slave.cpp:206] Flags at startup: --acls="" --appc_simple_discovery_uri_prefix="http://"
--appc_store_dir="/tmp/mesos/store/appc" --authenticate_http="true" --authenticatee="crammd5"
--authentication_backoff_factor="1secs" --authorizer="local" --cgroups_cpu_enable_pids_and_tids_count="false"
--cgroups_enable_cfs="false" --cgroups_hierarchy="/sys/fs/cgroup" --cgroups_limit_swap="false"
--cgroups_root="mesos" --container_disk_watch_interval="15secs" --containerizers="mesos" --credential="/tmp/Endpoint_SlaveEndpointTest_UnauthorizedRequest_0_9alJsh/credential"
--default_role="*" --disk_watch_interval="1mins" --docker="docker" --docker_kill_orphans="true"
--docker_registry="https://registry-1.docker.io" --docker_remove_delay="6hrs" --docker_socket="/var/run/docker.sock"
--docker_stop_timeout="0ns" --docker_store_dir="/tmp/mesos/store/docker" --docker_volume_checkpoint_dir="/var/run/mesos/isolators/docker/volume"
--enforce_container_disk_quota="false" --executor_registration_timeout="1mins" --executor_shutdown_grace_period="5secs"
--fetcher_cache_dir="/tmp/Endpoint_SlaveEndpointTest_UnauthorizedRequest_0_9alJsh/fetch" --fetcher_cache_size="2GB"
--frameworks_home="" --gc_delay="1weeks" --gc_disk_headroom="0.1" --hadoop_home="" --help="true"
--hostname_lookup="true" --http_authenticators="basic" --http_command_executor="false" --http_credentials="/tmp/Endpoint_SlaveEndpointTest_UnauthorizedRequest_0_9alJsh/http_credentials"
--image_provisioner_backend="copy" --initialize_driver_logging="true" --isolation="posix/cpu,posix/mem"
--launcher_dir="/mesos/mesos-1.0.0/_build/src" --logbufsecs="0" --logging_level="INFO" --oversubscribed_resources_interval="15secs"
--perf_duration="10secs" --perf_interval="1mins" --qos_correction_interval_min="0ns" --quiet="false"
--recover="reconnect" --recovery_timeout="15mins" --registration_backoff_factor="10ms" --resources="cpus:2;gpus:0;mem:1024;disk:1024;ports:[31000-32000]"
--revocable_cpu_low_priority="true" --sandbox_directory="/mnt/mesos/sandbox" --strict="true"
--switch_user="true" --systemd_enable_support="true" --systemd_runtime_directory="/run/systemd/system"
--version="false" --work_dir="/tmp/Endpoint_SlaveEndpointTest_UnauthorizedRequest_0_9alJsh"
I0707 01:10:53.295127 29167 credentials.hpp:86] Loading credential for authentication from
'/tmp/Endpoint_SlaveEndpointTest_UnauthorizedRequest_0_9alJsh/credential'
I0707 01:10:53.295330 29167 slave.cpp:343] Agent using credential for: test-principal
I0707 01:10:53.295372 29167 credentials.hpp:37] Loading credentials for authentication from
'/tmp/Endpoint_SlaveEndpointTest_UnauthorizedRequest_0_9alJsh/http_credentials'
I0707 01:10:53.295703 29167 slave.cpp:395] Using default 'basic' HTTP authenticator
I0707 01:10:53.296228 29167 resources.cpp:572] Parsing resources as JSON failed: cpus:2;gpus:0;mem:1024;disk:1024;ports:[31000-32000]
Trying semicolon-delimited string format instead
I0707 01:10:53.296584 29167 resources.cpp:572] Parsing resources as JSON failed: cpus:2;gpus:0;mem:1024;disk:1024;ports:[31000-32000]
Trying semicolon-delimited string format instead
I0707 01:10:53.297112 29167 slave.cpp:594] Agent resources: cpus(*):2; mem(*):1024; disk(*):1024;
ports(*):[31000-32000]
I0707 01:10:53.297181 29167 slave.cpp:602] Agent attributes: [  ]
I0707 01:10:53.297191 29167 slave.cpp:607] Agent hostname: 1fb1553c913d
I0707 01:10:53.298315 29173 state.cpp:57] Recovering state from '/tmp/Endpoint_SlaveEndpointTest_UnauthorizedRequest_0_9alJsh/meta'
I0707 01:10:53.298346 29167 process.cpp:3322] Handling HTTP event for process 'slave(546)'
with path: '/slave(546)/monitor/statistics'
I0707 01:10:53.298877 29165 status_update_manager.cpp:200] Recovering status update manager
I0707 01:10:53.299079 29162 containerizer.cpp:522] Recovering containerizer
I0707 01:10:53.299496 29168 http.cpp:767] Authorizing principal 'test-principal' to GET the
'/monitor/statistics' endpoint
I0707 01:10:53.300613 29169 provisioner.cpp:253] Provisioner recovery complete
I0707 01:10:53.300941 29164 slave.cpp:4856] Finished recovery
I0707 01:10:53.301740 29164 slave.cpp:5028] Querying resource estimator for oversubscribable
resources
I0707 01:10:53.302002 29166 slave.cpp:5042] Received oversubscribable resources  from the
resource estimator
I0707 01:10:53.302419 29166 slave.cpp:841] Agent terminating
[       OK ] Endpoint/SlaveEndpointTest.UnauthorizedRequest/0 (21 ms)
[ RUN      ] Endpoint/SlaveEndpointTest.UnauthorizedRequest/1
I0707 01:10:53.310040 29142 containerizer.cpp:196] Using isolation: posix/cpu,posix/mem,filesystem/posix,network/cni
W0707 01:10:53.310818 29142 backend.cpp:75] Failed to create 'aufs' backend: AufsBackend requires
root privileges, but is running as user mesos
W0707 01:10:53.310993 29142 backend.cpp:75] Failed to create 'bind' backend: BindBackend requires
root privileges
I0707 01:10:53.315032 29166 slave.cpp:205] Agent started on 547)@172.17.0.2:40571
I0707 01:10:53.315076 29166 slave.cpp:206] Flags at startup: --acls="" --appc_simple_discovery_uri_prefix="http://"
--appc_store_dir="/tmp/mesos/store/appc" --authenticate_http="true" --authenticatee="crammd5"
--authentication_backoff_factor="1secs" --authorizer="local" --cgroups_cpu_enable_pids_and_tids_count="false"
--cgroups_enable_cfs="false" --cgroups_hierarchy="/sys/fs/cgroup" --cgroups_limit_swap="false"
--cgroups_root="mesos" --container_disk_watch_interval="15secs" --containerizers="mesos" --credential="/tmp/Endpoint_SlaveEndpointTest_UnauthorizedRequest_1_JThi1l/credential"
--default_role="*" --disk_watch_interval="1mins" --docker="docker" --docker_kill_orphans="true"
--docker_registry="https://registry-1.docker.io" --docker_remove_delay="6hrs" --docker_socket="/var/run/docker.sock"
--docker_stop_timeout="0ns" --docker_store_dir="/tmp/mesos/store/docker" --docker_volume_checkpoint_dir="/var/run/mesos/isolators/docker/volume"
--enforce_container_disk_quota="false" --executor_registration_timeout="1mins" --executor_shutdown_grace_period="5secs"
--fetcher_cache_dir="/tmp/Endpoint_SlaveEndpointTest_UnauthorizedRequest_1_JThi1l/fetch" --fetcher_cache_size="2GB"
--frameworks_home="" --gc_delay="1weeks" --gc_disk_headroom="0.1" --hadoop_home="" --help="true"
--hostname_lookup="true" --http_authenticators="basic" --http_command_executor="false" --http_credentials="/tmp/Endpoint_SlaveEndpointTest_UnauthorizedRequest_1_JThi1l/http_credentials"
--image_provisioner_backend="copy" --initialize_driver_logging="true" --isolation="posix/cpu,posix/mem"
--launcher_dir="/mesos/mesos-1.0.0/_build/src" --logbufsecs="0" --logging_level="INFO" --oversubscribed_resources_interval="15secs"
--perf_duration="10secs" --perf_interval="1mins" --qos_correction_interval_min="0ns" --quiet="false"
--recover="reconnect" --recovery_timeout="15mins" --registration_backoff_factor="10ms" --resources="cpus:2;gpus:0;mem:1024;disk:1024;ports:[31000-32000]"
--revocable_cpu_low_priority="true" --sandbox_directory="/mnt/mesos/sandbox" --strict="true"
--switch_user="true" --systemd_enable_support="true" --systemd_runtime_directory="/run/systemd/system"
--version="false" --work_dir="/tmp/Endpoint_SlaveEndpointTest_UnauthorizedRequest_1_JThi1l"
I0707 01:10:53.315696 29166 credentials.hpp:86] Loading credential for authentication from
'/tmp/Endpoint_SlaveEndpointTest_UnauthorizedRequest_1_JThi1l/credential'
I0707 01:10:53.315922 29166 slave.cpp:343] Agent using credential for: test-principal
I0707 01:10:53.315961 29166 credentials.hpp:37] Loading credentials for authentication from
'/tmp/Endpoint_SlaveEndpointTest_UnauthorizedRequest_1_JThi1l/http_credentials'
I0707 01:10:53.316324 29166 slave.cpp:395] Using default 'basic' HTTP authenticator
I0707 01:10:53.316849 29166 resources.cpp:572] Parsing resources as JSON failed: cpus:2;gpus:0;mem:1024;disk:1024;ports:[31000-32000]
Trying semicolon-delimited string format instead
I0707 01:10:53.317224 29166 resources.cpp:572] Parsing resources as JSON failed: cpus:2;gpus:0;mem:1024;disk:1024;ports:[31000-32000]
Trying semicolon-delimited string format instead
I0707 01:10:53.317566 29166 slave.cpp:594] Agent resources: cpus(*):2; mem(*):1024; disk(*):1024;
ports(*):[31000-32000]
I0707 01:10:53.317637 29166 slave.cpp:602] Agent attributes: [  ]
I0707 01:10:53.317651 29166 slave.cpp:607] Agent hostname: 1fb1553c913d
I0707 01:10:53.319031 29173 state.cpp:57] Recovering state from '/tmp/Endpoint_SlaveEndpointTest_UnauthorizedRequest_1_JThi1l/meta'
I0707 01:10:53.319125 29166 process.cpp:3322] Handling HTTP event for process 'slave(547)'
with path: '/slave(547)/monitor/statistics.json'
I0707 01:10:53.319736 29165 status_update_manager.cpp:200] Recovering status update manager
I0707 01:10:53.320077 29176 containerizer.cpp:522] Recovering containerizer
I0707 01:10:53.320166 29173 http.cpp:767] Authorizing principal 'test-principal' to GET the
'/monitor/statistics.json' endpoint
I0707 01:10:53.321409 29173 provisioner.cpp:253] Provisioner recovery complete
I0707 01:10:53.321835 29161 slave.cpp:4856] Finished recovery
I0707 01:10:53.322386 29161 slave.cpp:5028] Querying resource estimator for oversubscribable
resources
I0707 01:10:53.322670 29165 slave.cpp:841] Agent terminating
[       OK ] Endpoint/SlaveEndpointTest.UnauthorizedRequest/1 (21 ms)
[ RUN      ] Endpoint/SlaveEndpointTest.UnauthorizedRequest/2
I0707 01:10:53.332104 29142 containerizer.cpp:196] Using isolation: posix/cpu,posix/mem,filesystem/posix,network/cni
W0707 01:10:53.332902 29142 backend.cpp:75] Failed to create 'aufs' backend: AufsBackend requires
root privileges, but is running as user mesos
W0707 01:10:53.333092 29142 backend.cpp:75] Failed to create 'bind' backend: BindBackend requires
root privileges
I0707 01:10:53.336771 29167 slave.cpp:205] Agent started on 548)@172.17.0.2:40571
I0707 01:10:53.336804 29167 slave.cpp:206] Flags at startup: --acls="" --appc_simple_discovery_uri_prefix="http://"
--appc_store_dir="/tmp/mesos/store/appc" --authenticate_http="true" --authenticatee="crammd5"
--authentication_backoff_factor="1secs" --authorizer="local" --cgroups_cpu_enable_pids_and_tids_count="false"
--cgroups_enable_cfs="false" --cgroups_hierarchy="/sys/fs/cgroup" --cgroups_limit_swap="false"
--cgroups_root="mesos" --container_disk_watch_interval="15secs" --containerizers="mesos" --credential="/tmp/Endpoint_SlaveEndpointTest_UnauthorizedRequest_2_H6KgKq/credential"
--default_role="*" --disk_watch_interval="1mins" --docker="docker" --docker_kill_orphans="true"
--docker_registry="https://registry-1.docker.io" --docker_remove_delay="6hrs" --docker_socket="/var/run/docker.sock"
--docker_stop_timeout="0ns" --docker_store_dir="/tmp/mesos/store/docker" --docker_volume_checkpoint_dir="/var/run/mesos/isolators/docker/volume"
--enforce_container_disk_quota="false" --executor_registration_timeout="1mins" --executor_shutdown_grace_period="5secs"
--fetcher_cache_dir="/tmp/Endpoint_SlaveEndpointTest_UnauthorizedRequest_2_H6KgKq/fetch" --fetcher_cache_size="2GB"
--frameworks_home="" --gc_delay="1weeks" --gc_disk_headroom="0.1" --hadoop_home="" --help="true"
--hostname_lookup="true" --http_authenticators="basic" --http_command_executor="false" --http_credentials="/tmp/Endpoint_SlaveEndpointTest_UnauthorizedRequest_2_H6KgKq/http_credentials"
--image_provisioner_backend="copy" --initialize_driver_logging="true" --isolation="posix/cpu,posix/mem"
--launcher_dir="/mesos/mesos-1.0.0/_build/src" --logbufsecs="0" --logging_level="INFO" --oversubscribed_resources_interval="15secs"
--perf_duration="10secs" --perf_interval="1mins" --qos_correction_interval_min="0ns" --quiet="false"
--recover="reconnect" --recovery_timeout="15mins" --registration_backoff_factor="10ms" --resources="cpus:2;gpus:0;mem:1024;disk:1024;ports:[31000-32000]"
--revocable_cpu_low_priority="true" --sandbox_directory="/mnt/mesos/sandbox" --strict="true"
--switch_user="true" --systemd_enable_support="true" --systemd_runtime_directory="/run/systemd/system"
--version="false" --work_dir="/tmp/Endpoint_SlaveEndpointTest_UnauthorizedRequest_2_H6KgKq"
I0707 01:10:53.337620 29167 credentials.hpp:86] Loading credential for authentication from
'/tmp/Endpoint_SlaveEndpointTest_UnauthorizedRequest_2_H6KgKq/credential'
I0707 01:10:53.337803 29167 slave.cpp:343] Agent using credential for: test-principal
I0707 01:10:53.337839 29167 credentials.hpp:37] Loading credentials for authentication from
'/tmp/Endpoint_SlaveEndpointTest_UnauthorizedRequest_2_H6KgKq/http_credentials'
I0707 01:10:53.338134 29167 slave.cpp:395] Using default 'basic' HTTP authenticator
I0707 01:10:53.338909 29167 resources.cpp:572] Parsing resources as JSON failed: cpus:2;gpus:0;mem:1024;disk:1024;ports:[31000-32000]
Trying semicolon-delimited string format instead
I0707 01:10:53.339316 29167 resources.cpp:572] Parsing resources as JSON failed: cpus:2;gpus:0;mem:1024;disk:1024;ports:[31000-32000]
Trying semicolon-delimited string format instead
I0707 01:10:53.339768 29167 slave.cpp:594] Agent resources: cpus(*):2; mem(*):1024; disk(*):1024;
ports(*):[31000-32000]
I0707 01:10:53.339843 29167 slave.cpp:602] Agent attributes: [  ]
I0707 01:10:53.339856 29167 slave.cpp:607] Agent hostname: 1fb1553c913d
I0707 01:10:53.341565 29172 state.cpp:57] Recovering state from '/tmp/Endpoint_SlaveEndpointTest_UnauthorizedRequest_2_H6KgKq/meta'
I0707 01:10:53.341627 29167 process.cpp:3322] Handling HTTP event for process 'slave(548)'
with path: '/slave(548)/containers'
I0707 01:10:53.342412 29174 status_update_manager.cpp:200] Recovering status update manager
I0707 01:10:53.342599 29174 containerizer.cpp:522] Recovering containerizer
I0707 01:10:53.343204 29168 http.cpp:767] Authorizing principal 'test-principal' to GET the
'/containers' endpoint
I0707 01:10:53.344358 29169 provisioner.cpp:253] Provisioner recovery complete
I0707 01:10:53.344612 29163 slave.cpp:4856] Finished recovery
I0707 01:10:53.345029 29163 slave.cpp:5028] Querying resource estimator for oversubscribable
resources
I0707 01:10:53.345260 29162 slave.cpp:5042] Received oversubscribable resources  from the
resource estimator
I0707 01:10:53.345785 29174 slave.cpp:841] Agent terminating
[       OK ] Endpoint/SlaveEndpointTest.UnauthorizedRequest/2 (22 ms)
[ RUN      ] Endpoint/SlaveEndpointTest.NoAuthorizer/0
I0707 01:10:53.352756 29142 containerizer.cpp:196] Using isolation: posix/cpu,posix/mem,filesystem/posix,network/cni
W0707 01:10:53.353353 29142 backend.cpp:75] Failed to create 'aufs' backend: AufsBackend requires
root privileges, but is running as user mesos
W0707 01:10:53.353489 29142 backend.cpp:75] Failed to create 'bind' backend: BindBackend requires
root privileges
I0707 01:10:53.354919 29142 cluster.cpp:432] Creating default 'local' authorizer
I0707 01:10:53.356614 29175 slave.cpp:205] Agent started on 549)@172.17.0.2:40571
I0707 01:10:53.356642 29175 slave.cpp:206] Flags at startup: --acls="" --appc_simple_discovery_uri_prefix="http://"
--appc_store_dir="/tmp/mesos/store/appc" --authenticate_http="true" --authenticatee="crammd5"
--authentication_backoff_factor="1secs" --authorizer="local" --cgroups_cpu_enable_pids_and_tids_count="false"
--cgroups_enable_cfs="false" --cgroups_hierarchy="/sys/fs/cgroup" --cgroups_limit_swap="false"
--cgroups_root="mesos" --container_disk_watch_interval="15secs" --containerizers="mesos" --credential="/tmp/Endpoint_SlaveEndpointTest_NoAuthorizer_0_LU1TDv/credential"
--default_role="*" --disk_watch_interval="1mins" --docker="docker" --docker_kill_orphans="true"
--docker_registry="https://registry-1.docker.io" --docker_remove_delay="6hrs" --docker_socket="/var/run/docker.sock"
--docker_stop_timeout="0ns" --docker_store_dir="/tmp/mesos/store/docker" --docker_volume_checkpoint_dir="/var/run/mesos/isolators/docker/volume"
--enforce_container_disk_quota="false" --executor_registration_timeout="1mins" --executor_shutdown_grace_period="5secs"
--fetcher_cache_dir="/tmp/Endpoint_SlaveEndpointTest_NoAuthorizer_0_LU1TDv/fetch" --fetcher_cache_size="2GB"
--frameworks_home="" --gc_delay="1weeks" --gc_disk_headroom="0.1" --hadoop_home="" --help="false"
--hostname_lookup="true" --http_authenticators="basic" --http_command_executor="false" --http_credentials="/tmp/Endpoint_SlaveEndpointTest_NoAuthorizer_0_LU1TDv/http_credentials"
--image_provisioner_backend="copy" --initialize_driver_logging="true" --isolation="posix/cpu,posix/mem"
--launcher_dir="/mesos/mesos-1.0.0/_build/src" --logbufsecs="0" --logging_level="INFO" --oversubscribed_resources_interval="15secs"
--perf_duration="10secs" --perf_interval="1mins" --qos_correction_interval_min="0ns" --quiet="false"
--recover="reconnect" --recovery_timeout="15mins" --registration_backoff_factor="10ms" --resources="cpus:2;gpus:0;mem:1024;disk:1024;ports:[31000-32000]"
--revocable_cpu_low_priority="true" --sandbox_directory="/mnt/mesos/sandbox" --strict="true"
--switch_user="true" --systemd_enable_support="true" --systemd_runtime_directory="/run/systemd/system"
--version="false" --work_dir="/tmp/Endpoint_SlaveEndpointTest_NoAuthorizer_0_LU1TDv"
I0707 01:10:53.357272 29175 credentials.hpp:86] Loading credential for authentication from
'/tmp/Endpoint_SlaveEndpointTest_NoAuthorizer_0_LU1TDv/credential'
I0707 01:10:53.357496 29175 slave.cpp:343] Agent using credential for: test-principal
I0707 01:10:53.357532 29175 credentials.hpp:37] Loading credentials for authentication from
'/tmp/Endpoint_SlaveEndpointTest_NoAuthorizer_0_LU1TDv/http_credentials'
I0707 01:10:53.357821 29175 slave.cpp:395] Using default 'basic' HTTP authenticator
I0707 01:10:53.358170 29175 resources.cpp:572] Parsing resources as JSON failed: cpus:2;gpus:0;mem:1024;disk:1024;ports:[31000-32000]
Trying semicolon-delimited string format instead
I0707 01:10:53.358532 29175 resources.cpp:572] Parsing resources as JSON failed: cpus:2;gpus:0;mem:1024;disk:1024;ports:[31000-32000]
Trying semicolon-delimited string format instead
I0707 01:10:53.358878 29175 slave.cpp:594] Agent resources: cpus(*):2; mem(*):1024; disk(*):1024;
ports(*):[31000-32000]
I0707 01:10:53.358934 29175 slave.cpp:602] Agent attributes: [  ]
I0707 01:10:53.358945 29175 slave.cpp:607] Agent hostname: 1fb1553c913d
I0707 01:10:53.360337 29176 state.cpp:57] Recovering state from '/tmp/Endpoint_SlaveEndpointTest_NoAuthorizer_0_LU1TDv/meta'
I0707 01:10:53.360368 29175 process.cpp:3322] Handling HTTP event for process 'slave(549)'
with path: '/slave(549)/monitor/statistics'
I0707 01:10:53.360864 29174 status_update_manager.cpp:200] Recovering status update manager
I0707 01:10:53.361063 29173 containerizer.cpp:522] Recovering containerizer
I0707 01:10:53.361459 29162 http.cpp:767] Authorizing principal 'test-principal' to GET the
'/monitor/statistics' endpoint
I0707 01:10:53.362507 29172 provisioner.cpp:253] Provisioner recovery complete
I0707 01:10:53.363277 29175 slave.cpp:4856] Finished recovery
I0707 01:10:53.363842 29175 slave.cpp:5028] Querying resource estimator for oversubscribable
resources
I0707 01:10:53.364303 29173 slave.cpp:5042] Received oversubscribable resources  from the
resource estimator
I0707 01:10:53.365388 29171 slave.cpp:841] Agent terminating
[       OK ] Endpoint/SlaveEndpointTest.NoAuthorizer/0 (20 ms)
[ RUN      ] Endpoint/SlaveEndpointTest.NoAuthorizer/1
I0707 01:10:53.374923 29142 containerizer.cpp:196] Using isolation: posix/cpu,posix/mem,filesystem/posix,network/cni
W0707 01:10:53.375777 29142 backend.cpp:75] Failed to create 'aufs' backend: AufsBackend requires
root privileges, but is running as user mesos
W0707 01:10:53.375967 29142 backend.cpp:75] Failed to create 'bind' backend: BindBackend requires
root privileges
I0707 01:10:53.377632 29142 cluster.cpp:432] Creating default 'local' authorizer
I0707 01:10:53.379276 29161 slave.cpp:205] Agent started on 550)@172.17.0.2:40571
I0707 01:10:53.379300 29161 slave.cpp:206] Flags at startup: --acls="" --appc_simple_discovery_uri_prefix="http://"
--appc_store_dir="/tmp/mesos/store/appc" --authenticate_http="true" --authenticatee="crammd5"
--authentication_backoff_factor="1secs" --authorizer="local" --cgroups_cpu_enable_pids_and_tids_count="false"
--cgroups_enable_cfs="false" --cgroups_hierarchy="/sys/fs/cgroup" --cgroups_limit_swap="false"
--cgroups_root="mesos" --container_disk_watch_interval="15secs" --containerizers="mesos" --credential="/tmp/Endpoint_SlaveEndpointTest_NoAuthorizer_1_h0pnHA/credential"
--default_role="*" --disk_watch_interval="1mins" --docker="docker" --docker_kill_orphans="true"
--docker_registry="https://registry-1.docker.io" --docker_remove_delay="6hrs" --docker_socket="/var/run/docker.sock"
--docker_stop_timeout="0ns" --docker_store_dir="/tmp/mesos/store/docker" --docker_volume_checkpoint_dir="/var/run/mesos/isolators/docker/volume"
--enforce_container_disk_quota="false" --executor_registration_timeout="1mins" --executor_shutdown_grace_period="5secs"
--fetcher_cache_dir="/tmp/Endpoint_SlaveEndpointTest_NoAuthorizer_1_h0pnHA/fetch" --fetcher_cache_size="2GB"
--frameworks_home="" --gc_delay="1weeks" --gc_disk_headroom="0.1" --hadoop_home="" --help="false"
--hostname_lookup="true" --http_authenticators="basic" --http_command_executor="false" --http_credentials="/tmp/Endpoint_SlaveEndpointTest_NoAuthorizer_1_h0pnHA/http_credentials"
--image_provisioner_backend="copy" --initialize_driver_logging="true" --isolation="posix/cpu,posix/mem"
--launcher_dir="/mesos/mesos-1.0.0/_build/src" --logbufsecs="0" --logging_level="INFO" --oversubscribed_resources_interval="15secs"
--perf_duration="10secs" --perf_interval="1mins" --qos_correction_interval_min="0ns" --quiet="false"
--recover="reconnect" --recovery_timeout="15mins" --registration_backoff_factor="10ms" --resources="cpus:2;gpus:0;mem:1024;disk:1024;ports:[31000-32000]"
--revocable_cpu_low_priority="true" --sandbox_directory="/mnt/mesos/sandbox" --strict="true"
--switch_user="true" --systemd_enable_support="true" --systemd_runtime_directory="/run/systemd/system"
--version="false" --work_dir="/tmp/Endpoint_SlaveEndpointTest_NoAuthorizer_1_h0pnHA"
I0707 01:10:53.379875 29161 credentials.hpp:86] Loading credential for authentication from
'/tmp/Endpoint_SlaveEndpointTest_NoAuthorizer_1_h0pnHA/credential'
I0707 01:10:53.380071 29161 slave.cpp:343] Agent using credential for: test-principal
I0707 01:10:53.380107 29161 credentials.hpp:37] Loading credentials for authentication from
'/tmp/Endpoint_SlaveEndpointTest_NoAuthorizer_1_h0pnHA/http_credentials'
I0707 01:10:53.380373 29161 slave.cpp:395] Using default 'basic' HTTP authenticator
I0707 01:10:53.380849 29161 resources.cpp:572] Parsing resources as JSON failed: cpus:2;gpus:0;mem:1024;disk:1024;ports:[31000-32000]
Trying semicolon-delimited string format instead
I0707 01:10:53.381247 29161 resources.cpp:572] Parsing resources as JSON failed: cpus:2;gpus:0;mem:1024;disk:1024;ports:[31000-32000]
Trying semicolon-delimited string format instead
I0707 01:10:53.381697 29161 slave.cpp:594] Agent resources: cpus(*):2; mem(*):1024; disk(*):1024;
ports(*):[31000-32000]
I0707 01:10:53.381769 29161 slave.cpp:602] Agent attributes: [  ]
I0707 01:10:53.381783 29161 slave.cpp:607] Agent hostname: 1fb1553c913d
I0707 01:10:53.383527 29168 state.cpp:57] Recovering state from '/tmp/Endpoint_SlaveEndpointTest_NoAuthorizer_1_h0pnHA/meta'
I0707 01:10:53.383628 29161 process.cpp:3322] Handling HTTP event for process 'slave(550)'
with path: '/slave(550)/monitor/statistics.json'
I0707 01:10:53.384352 29167 status_update_manager.cpp:200] Recovering status update manager
I0707 01:10:53.384644 29176 containerizer.cpp:522] Recovering containerizer
I0707 01:10:53.384696 29161 http.cpp:767] Authorizing principal 'test-principal' to GET the
'/monitor/statistics.json' endpoint
I0707 01:10:53.386354 29172 provisioner.cpp:253] Provisioner recovery complete
I0707 01:10:53.386579 29165 slave.cpp:4856] Finished recovery
I0707 01:10:53.387043 29165 slave.cpp:5028] Querying resource estimator for oversubscribable
resources
I0707 01:10:53.387293 29161 slave.cpp:5042] Received oversubscribable resources  from the
resource estimator
I0707 01:10:53.388484 29169 slave.cpp:841] Agent terminating
[       OK ] Endpoint/SlaveEndpointTest.NoAuthorizer/1 (23 ms)
[ RUN      ] Endpoint/SlaveEndpointTest.NoAuthorizer/2
I0707 01:10:53.398365 29142 containerizer.cpp:196] Using isolation: posix/cpu,posix/mem,filesystem/posix,network/cni
W0707 01:10:53.399145 29142 backend.cpp:75] Failed to create 'aufs' backend: AufsBackend requires
root privileges, but is running as user mesos
W0707 01:10:53.399304 29142 backend.cpp:75] Failed to create 'bind' backend: BindBackend requires
root privileges
I0707 01:10:53.401336 29142 cluster.cpp:432] Creating default 'local' authorizer
I0707 01:10:53.403532 29174 slave.cpp:205] Agent started on 551)@172.17.0.2:40571
I0707 01:10:53.403565 29174 slave.cpp:206] Flags at startup: --acls="" --appc_simple_discovery_uri_prefix="http://"
--appc_store_dir="/tmp/mesos/store/appc" --authenticate_http="true" --authenticatee="crammd5"
--authentication_backoff_factor="1secs" --authorizer="local" --cgroups_cpu_enable_pids_and_tids_count="false"
--cgroups_enable_cfs="false" --cgroups_hierarchy="/sys/fs/cgroup" --cgroups_limit_swap="false"
--cgroups_root="mesos" --container_disk_watch_interval="15secs" --containerizers="mesos" --credential="/tmp/Endpoint_SlaveEndpointTest_NoAuthorizer_2_XpYjWF/credential"
--default_role="*" --disk_watch_interval="1mins" --docker="docker" --docker_kill_orphans="true"
--docker_registry="https://registry-1.docker.io" --docker_remove_delay="6hrs" --docker_socket="/var/run/docker.sock"
--docker_stop_timeout="0ns" --docker_store_dir="/tmp/mesos/store/docker" --docker_volume_checkpoint_dir="/var/run/mesos/isolators/docker/volume"
--enforce_container_disk_quota="false" --executor_registration_timeout="1mins" --executor_shutdown_grace_period="5secs"
--fetcher_cache_dir="/tmp/Endpoint_SlaveEndpointTest_NoAuthorizer_2_XpYjWF/fetch" --fetcher_cache_size="2GB"
--frameworks_home="" --gc_delay="1weeks" --gc_disk_headroom="0.1" --hadoop_home="" --help="false"
--hostname_lookup="true" --http_authenticators="basic" --http_command_executor="false" --http_credentials="/tmp/Endpoint_SlaveEndpointTest_NoAuthorizer_2_XpYjWF/http_credentials"
--image_provisioner_backend="copy" --initialize_driver_logging="true" --isolation="posix/cpu,posix/mem"
--launcher_dir="/mesos/mesos-1.0.0/_build/src" --logbufsecs="0" --logging_level="INFO" --oversubscribed_resources_interval="15secs"
--perf_duration="10secs" --perf_interval="1mins" --qos_correction_interval_min="0ns" --quiet="false"
--recover="reconnect" --recovery_timeout="15mins" --registration_backoff_factor="10ms" --resources="cpus:2;gpus:0;mem:1024;disk:1024;ports:[31000-32000]"
--revocable_cpu_low_priority="true" --sandbox_directory="/mnt/mesos/sandbox" --strict="true"
--switch_user="true" --systemd_enable_support="true" --systemd_runtime_directory="/run/systemd/system"
--version="false" --work_dir="/tmp/Endpoint_SlaveEndpointTest_NoAuthorizer_2_XpYjWF"
I0707 01:10:53.404428 29174 credentials.hpp:86] Loading credential for authentication from
'/tmp/Endpoint_SlaveEndpointTest_NoAuthorizer_2_XpYjWF/credential'
I0707 01:10:53.404685 29174 slave.cpp:343] Agent using credential for: test-principal
I0707 01:10:53.404731 29174 credentials.hpp:37] Loading credentials for authentication from
'/tmp/Endpoint_SlaveEndpointTest_NoAuthorizer_2_XpYjWF/http_credentials'
I0707 01:10:53.405017 29174 slave.cpp:395] Using default 'basic' HTTP authenticator
I0707 01:10:53.405392 29174 resources.cpp:572] Parsing resources as JSON failed: cpus:2;gpus:0;mem:1024;disk:1024;ports:[31000-32000]
Trying semicolon-delimited string format instead
I0707 01:10:53.405757 29174 resources.cpp:572] Parsing resources as JSON failed: cpus:2;gpus:0;mem:1024;disk:1024;ports:[31000-32000]
Trying semicolon-delimited string format instead
I0707 01:10:53.406256 29174 slave.cpp:594] Agent resources: cpus(*):2; mem(*):1024; disk(*):1024;
ports(*):[31000-32000]
I0707 01:10:53.406329 29174 slave.cpp:602] Agent attributes: [  ]
I0707 01:10:53.406342 29174 slave.cpp:607] Agent hostname: 1fb1553c913d
I0707 01:10:53.407758 29164 state.cpp:57] Recovering state from '/tmp/Endpoint_SlaveEndpointTest_NoAuthorizer_2_XpYjWF/meta'
I0707 01:10:53.407805 29174 process.cpp:3322] Handling HTTP event for process 'slave(551)'
with path: '/slave(551)/containers'
I0707 01:10:53.408320 29165 status_update_manager.cpp:200] Recovering status update manager
I0707 01:10:53.408545 29166 containerizer.cpp:522] Recovering containerizer
I0707 01:10:53.408632 29163 http.cpp:767] Authorizing principal 'test-principal' to GET the
'/containers' endpoint
I0707 01:10:53.409970 29162 provisioner.cpp:253] Provisioner recovery complete
I0707 01:10:53.410539 29174 slave.cpp:4856] Finished recovery
I0707 01:10:53.411165 29174 slave.cpp:5028] Querying resource estimator for oversubscribable
resources
I0707 01:10:53.411512 29161 slave.cpp:5042] Received oversubscribable resources  from the
resource estimator
I0707 01:10:53.412906 29166 slave.cpp:841] Agent terminating
[       OK ] Endpoint/SlaveEndpointTest.NoAuthorizer/2 (23 ms)
[----------] 9 tests from Endpoint/SlaveEndpointTest (206 ms total)

[----------] Global test environment tear-down
[==========] 1229 tests from 140 test cases ran. (389986 ms total)
[  PASSED  ] 1228 tests.
[  FAILED  ] 1 test, listed below:
[  FAILED  ] DiskQuotaTest.SlaveRecovery

 1 FAILED TEST
  YOU HAVE 6 DISABLED TESTS

make[4]: *** [check-local] Error 1
make[4]: Leaving directory `/mesos/mesos-1.0.0/_build/src'
make[3]: *** [check-am] Error 2
make[3]: Leaving directory `/mesos/mesos-1.0.0/_build/src'
make[2]: *** [check] Error 2
make[2]: Leaving directory `/mesos/mesos-1.0.0/_build/src'
make[1]: *** [check-recursive] Error 1
make[1]: Leaving directory `/mesos/mesos-1.0.0/_build'
make: *** [distcheck] Error 1
+ docker rmi mesos-1467852129-16462
Untagged: mesos-1467852129-16462:latest
Deleted: 96f2aba10a2d13033848a6503f8315fc8a3b29ef65f34de9c98ad6ac6ad501ec
Deleted: bbcb9cf53e8f596b6728563a349e8f4acb6803becd4dd26ea8848306ff016dc7
Deleted: 58739681ec7aee8e1bea806ee745c983cf92fd9f9c401be0b29af9f88fba3b0a
Deleted: 31631dedafbe01838e2730d71168cf1541b8b1a7beb5356c88adf747dc0d084a
Deleted: 3f3891164300e3c01de9122f63275c2202ac924526e9a0fb1010c4127438509f
Deleted: 28497759f848c8590a2d9bc665e6ac3d0d0e56dd16c284f1a5256907d04609a5
Deleted: 524a17598b08d7c7863e9205d4cdd07feb89e9253d3024504be17b8840d88396
Deleted: 5989cf29981e3883074595aa3e68801b2e7a74c579bad5e8cbdd78477fcb41d3
Deleted: 6069091c36621e7ac9707a5e863b790e4c74ed03c1b57292140891d06512f6e1
Deleted: e55154662e37de883617e3742e58d3b869e332f188087fc35d14dc542af898a3
Deleted: 5c3972b1ffa80fcc3d51c660b0e62bd1cf37447ec2381e0d0164602c6c1b692d
Deleted: c3dfde9c6fa84ef5c37d14ab75ab78b8b019eac3e0409d378a26a1be35e94813
Deleted: adcbbf15f3074a3dfc536c53700ce3d594d40ecc5b266007591e68d901addb23
Deleted: 520cc2036eef78a97ab1bc14a30a7a69df6f1bcbb3d6e258b41138f8cc25b96e
Deleted: 1c2a476432e1d79c9d66715179b80afa4e1ebe107b74514e9521d7785425d6f5
Deleted: 9329b03fb2f28aaa32a599fe62f437322c96b1fd9d7c9e4b0a1d1f787c4815f2
Build step 'Execute shell' marked build as failure

Mime
View raw message