mesos-builds mailing list archives

Site index · List index
Message view « Date » · « Thread »
Top « Date » · « Thread »
From Apache Jenkins Server <jenk...@builds.apache.org>
Subject Build failed in Jenkins: mesos-reviewbot #14333
Date Fri, 15 Jul 2016 21:37:00 GMT
See <https://builds.apache.org/job/mesos-reviewbot/14333/changes>

Changes:

[josephwu] CMake: Added scripts to build some agent modules.

[josephwu] CMake: Configured a single output folder.

------------------------------------------
[...truncated 203069 lines...]
I0715 21:30:17.578117 28487 provisioner.cpp:253] Provisioner recovery complete
I0715 21:30:17.578928 28485 slave.cpp:4856] Finished recovery
I0715 21:30:17.579552 28485 slave.cpp:5028] Querying resource estimator for oversubscribable
resources
I0715 21:30:17.580281 28485 slave.cpp:841] Agent terminating
[       OK ] Endpoint/SlaveEndpointTest.AuthorizedRequest/1 (22 ms)
[ RUN      ] Endpoint/SlaveEndpointTest.AuthorizedRequest/2
I0715 21:30:17.592871 28463 containerizer.cpp:196] Using isolation: posix/cpu,posix/mem,filesystem/posix,network/cni
W0715 21:30:17.593595 28463 backend.cpp:75] Failed to create 'aufs' backend: AufsBackend requires
root privileges, but is running as user mesos
W0715 21:30:17.593740 28463 backend.cpp:75] Failed to create 'bind' backend: BindBackend requires
root privileges
I0715 21:30:17.596876 28484 slave.cpp:205] Agent started on 563)@172.17.0.2:41188
I0715 21:30:17.596913 28484 slave.cpp:206] Flags at startup: --acls="" --appc_simple_discovery_uri_prefix="http://"
--appc_store_dir="/tmp/mesos/store/appc" --authenticate_http="true" --authenticatee="crammd5"
--authentication_backoff_factor="1secs" --authorizer="local" --cgroups_cpu_enable_pids_and_tids_count="false"
--cgroups_enable_cfs="false" --cgroups_hierarchy="/sys/fs/cgroup" --cgroups_limit_swap="false"
--cgroups_root="mesos" --container_disk_watch_interval="15secs" --containerizers="mesos" --credential="/tmp/Endpoint_SlaveEndpointTest_AuthorizedRequest_2_jfKdEn/credential"
--default_role="*" --disk_watch_interval="1mins" --docker="docker" --docker_kill_orphans="true"
--docker_registry="https://registry-1.docker.io" --docker_remove_delay="6hrs" --docker_socket="/var/run/docker.sock"
--docker_stop_timeout="0ns" --docker_store_dir="/tmp/mesos/store/docker" --docker_volume_checkpoint_dir="/var/run/mesos/isolators/docker/volume"
--enforce_container_disk_quota="false" --executor_registration_timeout="1mins" --executor_shutdown_grace_period="5secs"
--fetcher_cache_dir="/tmp/Endpoint_SlaveEndpointTest_AuthorizedRequest_2_jfKdEn/fetch" --fetcher_cache_size="2GB"
--frameworks_home="" --gc_delay="1weeks" --gc_disk_headroom="0.1" --hadoop_home="" --help="false"
--hostname_lookup="true" --http_authenticators="basic" --http_command_executor="false" --http_credentials="/tmp/Endpoint_SlaveEndpointTest_AuthorizedRequest_2_jfKdEn/http_credentials"
--image_provisioner_backend="copy" --initialize_driver_logging="true" --isolation="posix/cpu,posix/mem"
--launcher_dir="/mesos/mesos-1.1.0/_build/src" --logbufsecs="0" --logging_level="INFO" --oversubscribed_resources_interval="15secs"
--perf_duration="10secs" --perf_interval="1mins" --qos_correction_interval_min="0ns" --quiet="false"
--recover="reconnect" --recovery_timeout="15mins" --registration_backoff_factor="10ms" --resources="cpus:2;gpus:0;mem:1024;disk:1024;ports:[31000-32000]"
--revocable_cpu_low_priority="true" --sandbox_directory="/mnt/mesos/sandbox" --strict="true"
--switch_user="true" --systemd_enable_support="true" --systemd_runtime_directory="/run/systemd/system"
--version="false" --work_dir="/tmp/Endpoint_SlaveEndpointTest_AuthorizedRequest_2_jfKdEn"
I0715 21:30:17.597549 28484 credentials.hpp:86] Loading credential for authentication from
'/tmp/Endpoint_SlaveEndpointTest_AuthorizedRequest_2_jfKdEn/credential'
I0715 21:30:17.597825 28484 slave.cpp:343] Agent using credential for: test-principal
I0715 21:30:17.597862 28484 credentials.hpp:37] Loading credentials for authentication from
'/tmp/Endpoint_SlaveEndpointTest_AuthorizedRequest_2_jfKdEn/http_credentials'
I0715 21:30:17.598129 28484 slave.cpp:395] Using default 'basic' HTTP authenticator
I0715 21:30:17.598523 28484 resources.cpp:572] Parsing resources as JSON failed: cpus:2;gpus:0;mem:1024;disk:1024;ports:[31000-32000]
Trying semicolon-delimited string format instead
I0715 21:30:17.598971 28484 resources.cpp:572] Parsing resources as JSON failed: cpus:2;gpus:0;mem:1024;disk:1024;ports:[31000-32000]
Trying semicolon-delimited string format instead
I0715 21:30:17.599344 28484 slave.cpp:594] Agent resources: cpus(*):2; mem(*):1024; disk(*):1024;
ports(*):[31000-32000]
I0715 21:30:17.599411 28484 slave.cpp:602] Agent attributes: [  ]
I0715 21:30:17.599429 28484 slave.cpp:607] Agent hostname: 4cc2f2fe9cf5
I0715 21:30:17.601308 28484 process.cpp:3354] Handling HTTP event for process 'slave(563)'
with path: '/slave(563)/containers'
I0715 21:30:17.601841 28482 state.cpp:57] Recovering state from '/tmp/Endpoint_SlaveEndpointTest_AuthorizedRequest_2_jfKdEn/meta'
I0715 21:30:17.602051 28497 status_update_manager.cpp:200] Recovering status update manager
I0715 21:30:17.602272 28496 containerizer.cpp:522] Recovering containerizer
I0715 21:30:17.602320 28493 http.cpp:829] Authorizing principal 'test-principal' to GET the
'/containers' endpoint
I0715 21:30:17.603976 28493 provisioner.cpp:253] Provisioner recovery complete
I0715 21:30:17.604348 28492 slave.cpp:4856] Finished recovery
I0715 21:30:17.604923 28492 slave.cpp:5028] Querying resource estimator for oversubscribable
resources
I0715 21:30:17.605420 28496 slave.cpp:5042] Received oversubscribable resources  from the
resource estimator
I0715 21:30:17.606704 28490 slave.cpp:841] Agent terminating
[       OK ] Endpoint/SlaveEndpointTest.AuthorizedRequest/2 (22 ms)
[ RUN      ] Endpoint/SlaveEndpointTest.UnauthorizedRequest/0
I0715 21:30:17.623908 28463 containerizer.cpp:196] Using isolation: posix/cpu,posix/mem,filesystem/posix,network/cni
W0715 21:30:17.624706 28463 backend.cpp:75] Failed to create 'aufs' backend: AufsBackend requires
root privileges, but is running as user mesos
W0715 21:30:17.624884 28463 backend.cpp:75] Failed to create 'bind' backend: BindBackend requires
root privileges
I0715 21:30:17.628070 28493 slave.cpp:205] Agent started on 564)@172.17.0.2:41188
I0715 21:30:17.628103 28493 slave.cpp:206] Flags at startup: --acls="" --appc_simple_discovery_uri_prefix="http://"
--appc_store_dir="/tmp/mesos/store/appc" --authenticate_http="true" --authenticatee="crammd5"
--authentication_backoff_factor="1secs" --authorizer="local" --cgroups_cpu_enable_pids_and_tids_count="false"
--cgroups_enable_cfs="false" --cgroups_hierarchy="/sys/fs/cgroup" --cgroups_limit_swap="false"
--cgroups_root="mesos" --container_disk_watch_interval="15secs" --containerizers="mesos" --credential="/tmp/Endpoint_SlaveEndpointTest_UnauthorizedRequest_0_2emrpR/credential"
--default_role="*" --disk_watch_interval="1mins" --docker="docker" --docker_kill_orphans="true"
--docker_registry="https://registry-1.docker.io" --docker_remove_delay="6hrs" --docker_socket="/var/run/docker.sock"
--docker_stop_timeout="0ns" --docker_store_dir="/tmp/mesos/store/docker" --docker_volume_checkpoint_dir="/var/run/mesos/isolators/docker/volume"
--enforce_container_disk_quota="false" --executor_registration_timeout="1mins" --executor_shutdown_grace_period="5secs"
--fetcher_cache_dir="/tmp/Endpoint_SlaveEndpointTest_UnauthorizedRequest_0_2emrpR/fetch" --fetcher_cache_size="2GB"
--frameworks_home="" --gc_delay="1weeks" --gc_disk_headroom="0.1" --hadoop_home="" --help="false"
--hostname_lookup="true" --http_authenticators="basic" --http_command_executor="false" --http_credentials="/tmp/Endpoint_SlaveEndpointTest_UnauthorizedRequest_0_2emrpR/http_credentials"
--image_provisioner_backend="copy" --initialize_driver_logging="true" --isolation="posix/cpu,posix/mem"
--launcher_dir="/mesos/mesos-1.1.0/_build/src" --logbufsecs="0" --logging_level="INFO" --oversubscribed_resources_interval="15secs"
--perf_duration="10secs" --perf_interval="1mins" --qos_correction_interval_min="0ns" --quiet="false"
--recover="reconnect" --recovery_timeout="15mins" --registration_backoff_factor="10ms" --resources="cpus:2;gpus:0;mem:1024;disk:1024;ports:[31000-32000]"
--revocable_cpu_low_priority="true" --sandbox_directory="/mnt/mesos/sandbox" --strict="true"
--switch_user="true" --systemd_enable_support="true" --systemd_runtime_directory="/run/systemd/system"
--version="false" --work_dir="/tmp/Endpoint_SlaveEndpointTest_UnauthorizedRequest_0_2emrpR"
I0715 21:30:17.628576 28493 credentials.hpp:86] Loading credential for authentication from
'/tmp/Endpoint_SlaveEndpointTest_UnauthorizedRequest_0_2emrpR/credential'
I0715 21:30:17.628787 28493 slave.cpp:343] Agent using credential for: test-principal
I0715 21:30:17.628820 28493 credentials.hpp:37] Loading credentials for authentication from
'/tmp/Endpoint_SlaveEndpointTest_UnauthorizedRequest_0_2emrpR/http_credentials'
I0715 21:30:17.629108 28493 slave.cpp:395] Using default 'basic' HTTP authenticator
I0715 21:30:17.629518 28493 resources.cpp:572] Parsing resources as JSON failed: cpus:2;gpus:0;mem:1024;disk:1024;ports:[31000-32000]
Trying semicolon-delimited string format instead
I0715 21:30:17.629868 28493 resources.cpp:572] Parsing resources as JSON failed: cpus:2;gpus:0;mem:1024;disk:1024;ports:[31000-32000]
Trying semicolon-delimited string format instead
I0715 21:30:17.630244 28493 slave.cpp:594] Agent resources: cpus(*):2; mem(*):1024; disk(*):1024;
ports(*):[31000-32000]
I0715 21:30:17.630318 28493 slave.cpp:602] Agent attributes: [  ]
I0715 21:30:17.630362 28493 slave.cpp:607] Agent hostname: 4cc2f2fe9cf5
I0715 21:30:17.631845 28484 state.cpp:57] Recovering state from '/tmp/Endpoint_SlaveEndpointTest_UnauthorizedRequest_0_2emrpR/meta'
I0715 21:30:17.631855 28493 process.cpp:3354] Handling HTTP event for process 'slave(564)'
with path: '/slave(564)/monitor/statistics'
I0715 21:30:17.632565 28485 status_update_manager.cpp:200] Recovering status update manager
I0715 21:30:17.632799 28497 containerizer.cpp:522] Recovering containerizer
I0715 21:30:17.633219 28495 http.cpp:829] Authorizing principal 'test-principal' to GET the
'/monitor/statistics' endpoint
I0715 21:30:17.634629 28486 provisioner.cpp:253] Provisioner recovery complete
I0715 21:30:17.634924 28487 slave.cpp:4856] Finished recovery
I0715 21:30:17.635486 28487 slave.cpp:5028] Querying resource estimator for oversubscribable
resources
I0715 21:30:17.636020 28492 slave.cpp:5042] Received oversubscribable resources  from the
resource estimator
I0715 21:30:17.636117 28492 slave.cpp:841] Agent terminating
[       OK ] Endpoint/SlaveEndpointTest.UnauthorizedRequest/0 (21 ms)
[ RUN      ] Endpoint/SlaveEndpointTest.UnauthorizedRequest/1
I0715 21:30:17.654147 28463 containerizer.cpp:196] Using isolation: posix/cpu,posix/mem,filesystem/posix,network/cni
W0715 21:30:17.654991 28463 backend.cpp:75] Failed to create 'aufs' backend: AufsBackend requires
root privileges, but is running as user mesos
W0715 21:30:17.655141 28463 backend.cpp:75] Failed to create 'bind' backend: BindBackend requires
root privileges
I0715 21:30:17.658421 28483 slave.cpp:205] Agent started on 565)@172.17.0.2:41188
I0715 21:30:17.658452 28483 slave.cpp:206] Flags at startup: --acls="" --appc_simple_discovery_uri_prefix="http://"
--appc_store_dir="/tmp/mesos/store/appc" --authenticate_http="true" --authenticatee="crammd5"
--authentication_backoff_factor="1secs" --authorizer="local" --cgroups_cpu_enable_pids_and_tids_count="false"
--cgroups_enable_cfs="false" --cgroups_hierarchy="/sys/fs/cgroup" --cgroups_limit_swap="false"
--cgroups_root="mesos" --container_disk_watch_interval="15secs" --containerizers="mesos" --credential="/tmp/Endpoint_SlaveEndpointTest_UnauthorizedRequest_1_j6Mppl/credential"
--default_role="*" --disk_watch_interval="1mins" --docker="docker" --docker_kill_orphans="true"
--docker_registry="https://registry-1.docker.io" --docker_remove_delay="6hrs" --docker_socket="/var/run/docker.sock"
--docker_stop_timeout="0ns" --docker_store_dir="/tmp/mesos/store/docker" --docker_volume_checkpoint_dir="/var/run/mesos/isolators/docker/volume"
--enforce_container_disk_quota="false" --executor_registration_timeout="1mins" --executor_shutdown_grace_period="5secs"
--fetcher_cache_dir="/tmp/Endpoint_SlaveEndpointTest_UnauthorizedRequest_1_j6Mppl/fetch" --fetcher_cache_size="2GB"
--frameworks_home="" --gc_delay="1weeks" --gc_disk_headroom="0.1" --hadoop_home="" --help="false"
--hostname_lookup="true" --http_authenticators="basic" --http_command_executor="false" --http_credentials="/tmp/Endpoint_SlaveEndpointTest_UnauthorizedRequest_1_j6Mppl/http_credentials"
--image_provisioner_backend="copy" --initialize_driver_logging="true" --isolation="posix/cpu,posix/mem"
--launcher_dir="/mesos/mesos-1.1.0/_build/src" --logbufsecs="0" --logging_level="INFO" --oversubscribed_resources_interval="15secs"
--perf_duration="10secs" --perf_interval="1mins" --qos_correction_interval_min="0ns" --quiet="false"
--recover="reconnect" --recovery_timeout="15mins" --registration_backoff_factor="10ms" --resources="cpus:2;gpus:0;mem:1024;disk:1024;ports:[31000-32000]"
--revocable_cpu_low_priority="true" --sandbox_directory="/mnt/mesos/sandbox" --strict="true"
--switch_user="true" --systemd_enable_support="true" --systemd_runtime_directory="/run/systemd/system"
--version="false" --work_dir="/tmp/Endpoint_SlaveEndpointTest_UnauthorizedRequest_1_j6Mppl"
I0715 21:30:17.659041 28483 credentials.hpp:86] Loading credential for authentication from
'/tmp/Endpoint_SlaveEndpointTest_UnauthorizedRequest_1_j6Mppl/credential'
I0715 21:30:17.659243 28483 slave.cpp:343] Agent using credential for: test-principal
I0715 21:30:17.659312 28483 credentials.hpp:37] Loading credentials for authentication from
'/tmp/Endpoint_SlaveEndpointTest_UnauthorizedRequest_1_j6Mppl/http_credentials'
I0715 21:30:17.659556 28483 slave.cpp:395] Using default 'basic' HTTP authenticator
I0715 21:30:17.660022 28483 resources.cpp:572] Parsing resources as JSON failed: cpus:2;gpus:0;mem:1024;disk:1024;ports:[31000-32000]
Trying semicolon-delimited string format instead
I0715 21:30:17.660490 28483 resources.cpp:572] Parsing resources as JSON failed: cpus:2;gpus:0;mem:1024;disk:1024;ports:[31000-32000]
Trying semicolon-delimited string format instead
I0715 21:30:17.661046 28483 slave.cpp:594] Agent resources: cpus(*):2; mem(*):1024; disk(*):1024;
ports(*):[31000-32000]
I0715 21:30:17.661128 28483 slave.cpp:602] Agent attributes: [  ]
I0715 21:30:17.661144 28483 slave.cpp:607] Agent hostname: 4cc2f2fe9cf5
I0715 21:30:17.663024 28489 state.cpp:57] Recovering state from '/tmp/Endpoint_SlaveEndpointTest_UnauthorizedRequest_1_j6Mppl/meta'
I0715 21:30:17.663105 28483 process.cpp:3354] Handling HTTP event for process 'slave(565)'
with path: '/slave(565)/monitor/statistics.json'
I0715 21:30:17.664104 28492 status_update_manager.cpp:200] Recovering status update manager
I0715 21:30:17.664360 28492 containerizer.cpp:522] Recovering containerizer
I0715 21:30:17.664522 28493 http.cpp:829] Authorizing principal 'test-principal' to GET the
'/monitor/statistics.json' endpoint
I0715 21:30:17.665843 28494 provisioner.cpp:253] Provisioner recovery complete
I0715 21:30:17.666069 28492 slave.cpp:4856] Finished recovery
I0715 21:30:17.666642 28492 slave.cpp:5028] Querying resource estimator for oversubscribable
resources
I0715 21:30:17.667008 28488 slave.cpp:5042] Received oversubscribable resources  from the
resource estimator
I0715 21:30:17.667333 28488 slave.cpp:841] Agent terminating
[       OK ] Endpoint/SlaveEndpointTest.UnauthorizedRequest/1 (23 ms)
[ RUN      ] Endpoint/SlaveEndpointTest.UnauthorizedRequest/2
I0715 21:30:17.680717 28463 containerizer.cpp:196] Using isolation: posix/cpu,posix/mem,filesystem/posix,network/cni
W0715 21:30:17.681511 28463 backend.cpp:75] Failed to create 'aufs' backend: AufsBackend requires
root privileges, but is running as user mesos
W0715 21:30:17.681660 28463 backend.cpp:75] Failed to create 'bind' backend: BindBackend requires
root privileges
I0715 21:30:17.685461 28495 slave.cpp:205] Agent started on 566)@172.17.0.2:41188
I0715 21:30:17.685637 28495 slave.cpp:206] Flags at startup: --acls="" --appc_simple_discovery_uri_prefix="http://"
--appc_store_dir="/tmp/mesos/store/appc" --authenticate_http="true" --authenticatee="crammd5"
--authentication_backoff_factor="1secs" --authorizer="local" --cgroups_cpu_enable_pids_and_tids_count="false"
--cgroups_enable_cfs="false" --cgroups_hierarchy="/sys/fs/cgroup" --cgroups_limit_swap="false"
--cgroups_root="mesos" --container_disk_watch_interval="15secs" --containerizers="mesos" --credential="/tmp/Endpoint_SlaveEndpointTest_UnauthorizedRequest_2_MCx9CP/credential"
--default_role="*" --disk_watch_interval="1mins" --docker="docker" --docker_kill_orphans="true"
--docker_registry="https://registry-1.docker.io" --docker_remove_delay="6hrs" --docker_socket="/var/run/docker.sock"
--docker_stop_timeout="0ns" --docker_store_dir="/tmp/mesos/store/docker" --docker_volume_checkpoint_dir="/var/run/mesos/isolators/docker/volume"
--enforce_container_disk_quota="false" --executor_registration_timeout="1mins" --executor_shutdown_grace_period="5secs"
--fetcher_cache_dir="/tmp/Endpoint_SlaveEndpointTest_UnauthorizedRequest_2_MCx9CP/fetch" --fetcher_cache_size="2GB"
--frameworks_home="" --gc_delay="1weeks" --gc_disk_headroom="0.1" --hadoop_home="" --help="false"
--hostname_lookup="true" --http_authenticators="basic" --http_command_executor="false" --http_credentials="/tmp/Endpoint_SlaveEndpointTest_UnauthorizedRequest_2_MCx9CP/http_credentials"
--image_provisioner_backend="copy" --initialize_driver_logging="true" --isolation="posix/cpu,posix/mem"
--launcher_dir="/mesos/mesos-1.1.0/_build/src" --logbufsecs="0" --logging_level="INFO" --oversubscribed_resources_interval="15secs"
--perf_duration="10secs" --perf_interval="1mins" --qos_correction_interval_min="0ns" --quiet="false"
--recover="reconnect" --recovery_timeout="15mins" --registration_backoff_factor="10ms" --resources="cpus:2;gpus:0;mem:1024;disk:1024;ports:[31000-32000]"
--revocable_cpu_low_priority="true" --sandbox_directory="/mnt/mesos/sandbox" --strict="true"
--switch_user="true" --systemd_enable_support="true" --systemd_runtime_directory="/run/systemd/system"
--version="false" --work_dir="/tmp/Endpoint_SlaveEndpointTest_UnauthorizedRequest_2_MCx9CP"
I0715 21:30:17.686421 28495 credentials.hpp:86] Loading credential for authentication from
'/tmp/Endpoint_SlaveEndpointTest_UnauthorizedRequest_2_MCx9CP/credential'
I0715 21:30:17.686668 28495 slave.cpp:343] Agent using credential for: test-principal
I0715 21:30:17.686709 28495 credentials.hpp:37] Loading credentials for authentication from
'/tmp/Endpoint_SlaveEndpointTest_UnauthorizedRequest_2_MCx9CP/http_credentials'
I0715 21:30:17.687044 28495 slave.cpp:395] Using default 'basic' HTTP authenticator
I0715 21:30:17.687331 28495 resources.cpp:572] Parsing resources as JSON failed: cpus:2;gpus:0;mem:1024;disk:1024;ports:[31000-32000]
Trying semicolon-delimited string format instead
I0715 21:30:17.687690 28495 resources.cpp:572] Parsing resources as JSON failed: cpus:2;gpus:0;mem:1024;disk:1024;ports:[31000-32000]
Trying semicolon-delimited string format instead
I0715 21:30:17.688175 28495 slave.cpp:594] Agent resources: cpus(*):2; mem(*):1024; disk(*):1024;
ports(*):[31000-32000]
I0715 21:30:17.688258 28495 slave.cpp:602] Agent attributes: [  ]
I0715 21:30:17.688285 28495 slave.cpp:607] Agent hostname: 4cc2f2fe9cf5
I0715 21:30:17.689729 28482 state.cpp:57] Recovering state from '/tmp/Endpoint_SlaveEndpointTest_UnauthorizedRequest_2_MCx9CP/meta'
I0715 21:30:17.689837 28495 process.cpp:3354] Handling HTTP event for process 'slave(566)'
with path: '/slave(566)/containers'
I0715 21:30:17.690214 28488 status_update_manager.cpp:200] Recovering status update manager
I0715 21:30:17.690531 28487 containerizer.cpp:522] Recovering containerizer
I0715 21:30:17.690709 28489 http.cpp:829] Authorizing principal 'test-principal' to GET the
'/containers' endpoint
I0715 21:30:17.691854 28485 provisioner.cpp:253] Provisioner recovery complete
I0715 21:30:17.692181 28495 slave.cpp:4856] Finished recovery
I0715 21:30:17.692756 28495 slave.cpp:5028] Querying resource estimator for oversubscribable
resources
I0715 21:30:17.693049 28495 slave.cpp:5042] Received oversubscribable resources  from the
resource estimator
I0715 21:30:17.693444 28492 slave.cpp:841] Agent terminating
[       OK ] Endpoint/SlaveEndpointTest.UnauthorizedRequest/2 (21 ms)
[ RUN      ] Endpoint/SlaveEndpointTest.NoAuthorizer/0
I0715 21:30:17.706593 28463 containerizer.cpp:196] Using isolation: posix/cpu,posix/mem,filesystem/posix,network/cni
W0715 21:30:17.707479 28463 backend.cpp:75] Failed to create 'aufs' backend: AufsBackend requires
root privileges, but is running as user mesos
W0715 21:30:17.707638 28463 backend.cpp:75] Failed to create 'bind' backend: BindBackend requires
root privileges
I0715 21:30:17.709326 28463 cluster.cpp:432] Creating default 'local' authorizer
I0715 21:30:17.711386 28483 slave.cpp:205] Agent started on 567)@172.17.0.2:41188
I0715 21:30:17.711412 28483 slave.cpp:206] Flags at startup: --acls="" --appc_simple_discovery_uri_prefix="http://"
--appc_store_dir="/tmp/mesos/store/appc" --authenticate_http="true" --authenticatee="crammd5"
--authentication_backoff_factor="1secs" --authorizer="local" --cgroups_cpu_enable_pids_and_tids_count="false"
--cgroups_enable_cfs="false" --cgroups_hierarchy="/sys/fs/cgroup" --cgroups_limit_swap="false"
--cgroups_root="mesos" --container_disk_watch_interval="15secs" --containerizers="mesos" --credential="/tmp/Endpoint_SlaveEndpointTest_NoAuthorizer_0_2Q9k3j/credential"
--default_role="*" --disk_watch_interval="1mins" --docker="docker" --docker_kill_orphans="true"
--docker_registry="https://registry-1.docker.io" --docker_remove_delay="6hrs" --docker_socket="/var/run/docker.sock"
--docker_stop_timeout="0ns" --docker_store_dir="/tmp/mesos/store/docker" --docker_volume_checkpoint_dir="/var/run/mesos/isolators/docker/volume"
--enforce_container_disk_quota="false" --executor_registration_timeout="1mins" --executor_shutdown_grace_period="5secs"
--fetcher_cache_dir="/tmp/Endpoint_SlaveEndpointTest_NoAuthorizer_0_2Q9k3j/fetch" --fetcher_cache_size="2GB"
--frameworks_home="" --gc_delay="1weeks" --gc_disk_headroom="0.1" --hadoop_home="" --help="false"
--hostname_lookup="true" --http_authenticators="basic" --http_command_executor="false" --http_credentials="/tmp/Endpoint_SlaveEndpointTest_NoAuthorizer_0_2Q9k3j/http_credentials"
--image_provisioner_backend="copy" --initialize_driver_logging="true" --isolation="posix/cpu,posix/mem"
--launcher_dir="/mesos/mesos-1.1.0/_build/src" --logbufsecs="0" --logging_level="INFO" --oversubscribed_resources_interval="15secs"
--perf_duration="10secs" --perf_interval="1mins" --qos_correction_interval_min="0ns" --quiet="false"
--recover="reconnect" --recovery_timeout="15mins" --registration_backoff_factor="10ms" --resources="cpus:2;gpus:0;mem:1024;disk:1024;ports:[31000-32000]"
--revocable_cpu_low_priority="true" --sandbox_directory="/mnt/mesos/sandbox" --strict="true"
--switch_user="true" --systemd_enable_support="true" --systemd_runtime_directory="/run/systemd/system"
--version="false" --work_dir="/tmp/Endpoint_SlaveEndpointTest_NoAuthorizer_0_2Q9k3j"
I0715 21:30:17.711973 28483 credentials.hpp:86] Loading credential for authentication from
'/tmp/Endpoint_SlaveEndpointTest_NoAuthorizer_0_2Q9k3j/credential'
I0715 21:30:17.712265 28483 slave.cpp:343] Agent using credential for: test-principal
I0715 21:30:17.712451 28483 credentials.hpp:37] Loading credentials for authentication from
'/tmp/Endpoint_SlaveEndpointTest_NoAuthorizer_0_2Q9k3j/http_credentials'
I0715 21:30:17.712855 28483 slave.cpp:395] Using default 'basic' HTTP authenticator
I0715 21:30:17.713309 28483 resources.cpp:572] Parsing resources as JSON failed: cpus:2;gpus:0;mem:1024;disk:1024;ports:[31000-32000]
Trying semicolon-delimited string format instead
I0715 21:30:17.713719 28483 resources.cpp:572] Parsing resources as JSON failed: cpus:2;gpus:0;mem:1024;disk:1024;ports:[31000-32000]
Trying semicolon-delimited string format instead
I0715 21:30:17.714184 28483 slave.cpp:594] Agent resources: cpus(*):2; mem(*):1024; disk(*):1024;
ports(*):[31000-32000]
I0715 21:30:17.714249 28483 slave.cpp:602] Agent attributes: [  ]
I0715 21:30:17.714269 28483 slave.cpp:607] Agent hostname: 4cc2f2fe9cf5
I0715 21:30:17.715796 28489 state.cpp:57] Recovering state from '/tmp/Endpoint_SlaveEndpointTest_NoAuthorizer_0_2Q9k3j/meta'
I0715 21:30:17.715905 28483 process.cpp:3354] Handling HTTP event for process 'slave(567)'
with path: '/slave(567)/monitor/statistics'
I0715 21:30:17.716478 28493 status_update_manager.cpp:200] Recovering status update manager
I0715 21:30:17.716812 28488 containerizer.cpp:522] Recovering containerizer
I0715 21:30:17.716964 28483 http.cpp:829] Authorizing principal 'test-principal' to GET the
'/monitor/statistics' endpoint
I0715 21:30:17.718080 28492 provisioner.cpp:253] Provisioner recovery complete
I0715 21:30:17.718519 28488 slave.cpp:4856] Finished recovery
I0715 21:30:17.719105 28488 slave.cpp:5028] Querying resource estimator for oversubscribable
resources
I0715 21:30:17.719326 28491 slave.cpp:5042] Received oversubscribable resources  from the
resource estimator
I0715 21:30:17.720619 28485 slave.cpp:841] Agent terminating
[       OK ] Endpoint/SlaveEndpointTest.NoAuthorizer/0 (23 ms)
[ RUN      ] Endpoint/SlaveEndpointTest.NoAuthorizer/1
I0715 21:30:17.733973 28463 containerizer.cpp:196] Using isolation: posix/cpu,posix/mem,filesystem/posix,network/cni
W0715 21:30:17.734864 28463 backend.cpp:75] Failed to create 'aufs' backend: AufsBackend requires
root privileges, but is running as user mesos
W0715 21:30:17.735041 28463 backend.cpp:75] Failed to create 'bind' backend: BindBackend requires
root privileges
I0715 21:30:17.736944 28463 cluster.cpp:432] Creating default 'local' authorizer
I0715 21:30:17.739641 28484 slave.cpp:205] Agent started on 568)@172.17.0.2:41188
I0715 21:30:17.739677 28484 slave.cpp:206] Flags at startup: --acls="" --appc_simple_discovery_uri_prefix="http://"
--appc_store_dir="/tmp/mesos/store/appc" --authenticate_http="true" --authenticatee="crammd5"
--authentication_backoff_factor="1secs" --authorizer="local" --cgroups_cpu_enable_pids_and_tids_count="false"
--cgroups_enable_cfs="false" --cgroups_hierarchy="/sys/fs/cgroup" --cgroups_limit_swap="false"
--cgroups_root="mesos" --container_disk_watch_interval="15secs" --containerizers="mesos" --credential="/tmp/Endpoint_SlaveEndpointTest_NoAuthorizer_1_3k3AGO/credential"
--default_role="*" --disk_watch_interval="1mins" --docker="docker" --docker_kill_orphans="true"
--docker_registry="https://registry-1.docker.io" --docker_remove_delay="6hrs" --docker_socket="/var/run/docker.sock"
--docker_stop_timeout="0ns" --docker_store_dir="/tmp/mesos/store/docker" --docker_volume_checkpoint_dir="/var/run/mesos/isolators/docker/volume"
--enforce_container_disk_quota="false" --executor_registration_timeout="1mins" --executor_shutdown_grace_period="5secs"
--fetcher_cache_dir="/tmp/Endpoint_SlaveEndpointTest_NoAuthorizer_1_3k3AGO/fetch" --fetcher_cache_size="2GB"
--frameworks_home="" --gc_delay="1weeks" --gc_disk_headroom="0.1" --hadoop_home="" --help="false"
--hostname_lookup="true" --http_authenticators="basic" --http_command_executor="false" --http_credentials="/tmp/Endpoint_SlaveEndpointTest_NoAuthorizer_1_3k3AGO/http_credentials"
--image_provisioner_backend="copy" --initialize_driver_logging="true" --isolation="posix/cpu,posix/mem"
--launcher_dir="/mesos/mesos-1.1.0/_build/src" --logbufsecs="0" --logging_level="INFO" --oversubscribed_resources_interval="15secs"
--perf_duration="10secs" --perf_interval="1mins" --qos_correction_interval_min="0ns" --quiet="false"
--recover="reconnect" --recovery_timeout="15mins" --registration_backoff_factor="10ms" --resources="cpus:2;gpus:0;mem:1024;disk:1024;ports:[31000-32000]"
--revocable_cpu_low_priority="true" --sandbox_directory="/mnt/mesos/sandbox" --strict="true"
--switch_user="true" --systemd_enable_support="true" --systemd_runtime_directory="/run/systemd/system"
--version="false" --work_dir="/tmp/Endpoint_SlaveEndpointTest_NoAuthorizer_1_3k3AGO"
I0715 21:30:17.740285 28484 credentials.hpp:86] Loading credential for authentication from
'/tmp/Endpoint_SlaveEndpointTest_NoAuthorizer_1_3k3AGO/credential'
I0715 21:30:17.740488 28484 slave.cpp:343] Agent using credential for: test-principal
I0715 21:30:17.740532 28484 credentials.hpp:37] Loading credentials for authentication from
'/tmp/Endpoint_SlaveEndpointTest_NoAuthorizer_1_3k3AGO/http_credentials'
I0715 21:30:17.740903 28484 slave.cpp:395] Using default 'basic' HTTP authenticator
I0715 21:30:17.741324 28484 resources.cpp:572] Parsing resources as JSON failed: cpus:2;gpus:0;mem:1024;disk:1024;ports:[31000-32000]
Trying semicolon-delimited string format instead
I0715 21:30:17.741730 28484 resources.cpp:572] Parsing resources as JSON failed: cpus:2;gpus:0;mem:1024;disk:1024;ports:[31000-32000]
Trying semicolon-delimited string format instead
I0715 21:30:17.742259 28484 slave.cpp:594] Agent resources: cpus(*):2; mem(*):1024; disk(*):1024;
ports(*):[31000-32000]
I0715 21:30:17.742342 28484 slave.cpp:602] Agent attributes: [  ]
I0715 21:30:17.742369 28484 slave.cpp:607] Agent hostname: 4cc2f2fe9cf5
I0715 21:30:17.744078 28487 state.cpp:57] Recovering state from '/tmp/Endpoint_SlaveEndpointTest_NoAuthorizer_1_3k3AGO/meta'
I0715 21:30:17.744177 28484 process.cpp:3354] Handling HTTP event for process 'slave(568)'
with path: '/slave(568)/monitor/statistics.json'
I0715 21:30:17.744732 28494 status_update_manager.cpp:200] Recovering status update manager
I0715 21:30:17.745018 28489 containerizer.cpp:522] Recovering containerizer
I0715 21:30:17.745148 28487 http.cpp:829] Authorizing principal 'test-principal' to GET the
'/monitor/statistics.json' endpoint
I0715 21:30:17.746407 28486 provisioner.cpp:253] Provisioner recovery complete
I0715 21:30:17.746754 28492 slave.cpp:4856] Finished recovery
I0715 21:30:17.747452 28492 slave.cpp:5028] Querying resource estimator for oversubscribable
resources
I0715 21:30:17.747805 28483 slave.cpp:5042] Received oversubscribable resources  from the
resource estimator
I0715 21:30:17.748900 28483 slave.cpp:841] Agent terminating
[       OK ] Endpoint/SlaveEndpointTest.NoAuthorizer/1 (24 ms)
[ RUN      ] Endpoint/SlaveEndpointTest.NoAuthorizer/2
I0715 21:30:17.763022 28463 containerizer.cpp:196] Using isolation: posix/cpu,posix/mem,filesystem/posix,network/cni
W0715 21:30:17.763788 28463 backend.cpp:75] Failed to create 'aufs' backend: AufsBackend requires
root privileges, but is running as user mesos
W0715 21:30:17.763933 28463 backend.cpp:75] Failed to create 'bind' backend: BindBackend requires
root privileges
I0715 21:30:17.765322 28463 cluster.cpp:432] Creating default 'local' authorizer
I0715 21:30:17.767923 28497 slave.cpp:205] Agent started on 569)@172.17.0.2:41188
I0715 21:30:17.767951 28497 slave.cpp:206] Flags at startup: --acls="" --appc_simple_discovery_uri_prefix="http://"
--appc_store_dir="/tmp/mesos/store/appc" --authenticate_http="true" --authenticatee="crammd5"
--authentication_backoff_factor="1secs" --authorizer="local" --cgroups_cpu_enable_pids_and_tids_count="false"
--cgroups_enable_cfs="false" --cgroups_hierarchy="/sys/fs/cgroup" --cgroups_limit_swap="false"
--cgroups_root="mesos" --container_disk_watch_interval="15secs" --containerizers="mesos" --credential="/tmp/Endpoint_SlaveEndpointTest_NoAuthorizer_2_sh7cyj/credential"
--default_role="*" --disk_watch_interval="1mins" --docker="docker" --docker_kill_orphans="true"
--docker_registry="https://registry-1.docker.io" --docker_remove_delay="6hrs" --docker_socket="/var/run/docker.sock"
--docker_stop_timeout="0ns" --docker_store_dir="/tmp/mesos/store/docker" --docker_volume_checkpoint_dir="/var/run/mesos/isolators/docker/volume"
--enforce_container_disk_quota="false" --executor_registration_timeout="1mins" --executor_shutdown_grace_period="5secs"
--fetcher_cache_dir="/tmp/Endpoint_SlaveEndpointTest_NoAuthorizer_2_sh7cyj/fetch" --fetcher_cache_size="2GB"
--frameworks_home="" --gc_delay="1weeks" --gc_disk_headroom="0.1" --hadoop_home="" --help="false"
--hostname_lookup="true" --http_authenticators="basic" --http_command_executor="false" --http_credentials="/tmp/Endpoint_SlaveEndpointTest_NoAuthorizer_2_sh7cyj/http_credentials"
--image_provisioner_backend="copy" --initialize_driver_logging="true" --isolation="posix/cpu,posix/mem"
--launcher_dir="/mesos/mesos-1.1.0/_build/src" --logbufsecs="0" --logging_level="INFO" --oversubscribed_resources_interval="15secs"
--perf_duration="10secs" --perf_interval="1mins" --qos_correction_interval_min="0ns" --quiet="false"
--recover="reconnect" --recovery_timeout="15mins" --registration_backoff_factor="10ms" --resources="cpus:2;gpus:0;mem:1024;disk:1024;ports:[31000-32000]"
--revocable_cpu_low_priority="true" --sandbox_directory="/mnt/mesos/sandbox" --strict="true"
--switch_user="true" --systemd_enable_support="true" --systemd_runtime_directory="/run/systemd/system"
--version="false" --work_dir="/tmp/Endpoint_SlaveEndpointTest_NoAuthorizer_2_sh7cyj"
I0715 21:30:17.768497 28497 credentials.hpp:86] Loading credential for authentication from
'/tmp/Endpoint_SlaveEndpointTest_NoAuthorizer_2_sh7cyj/credential'
I0715 21:30:17.768792 28497 slave.cpp:343] Agent using credential for: test-principal
I0715 21:30:17.768831 28497 credentials.hpp:37] Loading credentials for authentication from
'/tmp/Endpoint_SlaveEndpointTest_NoAuthorizer_2_sh7cyj/http_credentials'
I0715 21:30:17.769078 28497 slave.cpp:395] Using default 'basic' HTTP authenticator
I0715 21:30:17.769426 28497 resources.cpp:572] Parsing resources as JSON failed: cpus:2;gpus:0;mem:1024;disk:1024;ports:[31000-32000]
Trying semicolon-delimited string format instead
I0715 21:30:17.769909 28497 resources.cpp:572] Parsing resources as JSON failed: cpus:2;gpus:0;mem:1024;disk:1024;ports:[31000-32000]
Trying semicolon-delimited string format instead
I0715 21:30:17.770274 28497 slave.cpp:594] Agent resources: cpus(*):2; mem(*):1024; disk(*):1024;
ports(*):[31000-32000]
I0715 21:30:17.770339 28497 slave.cpp:602] Agent attributes: [  ]
I0715 21:30:17.770359 28497 slave.cpp:607] Agent hostname: 4cc2f2fe9cf5
I0715 21:30:17.772672 28494 state.cpp:57] Recovering state from '/tmp/Endpoint_SlaveEndpointTest_NoAuthorizer_2_sh7cyj/meta'
I0715 21:30:17.772825 28497 process.cpp:3354] Handling HTTP event for process 'slave(569)'
with path: '/slave(569)/containers'
I0715 21:30:17.773798 28483 status_update_manager.cpp:200] Recovering status update manager
I0715 21:30:17.773969 28490 containerizer.cpp:522] Recovering containerizer
I0715 21:30:17.775214 28497 http.cpp:829] Authorizing principal 'test-principal' to GET the
'/containers' endpoint
I0715 21:30:17.775270 28488 provisioner.cpp:253] Provisioner recovery complete
I0715 21:30:17.776262 28488 slave.cpp:4856] Finished recovery
I0715 21:30:17.776917 28488 slave.cpp:5028] Querying resource estimator for oversubscribable
resources
I0715 21:30:17.778666 28488 slave.cpp:5042] Received oversubscribable resources  from the
resource estimator
I0715 21:30:17.779753 28463 slave.cpp:841] Agent terminating
[       OK ] Endpoint/SlaveEndpointTest.NoAuthorizer/2 (25 ms)
[----------] 9 tests from Endpoint/SlaveEndpointTest (254 ms total)

[----------] Global test environment tear-down
[==========] 1256 tests from 139 test cases ran. (911768 ms total)
[  PASSED  ] 1255 tests.
[  FAILED  ] 1 test, listed below:
[  FAILED  ] ProvisionerDockerLocalStoreTest.MetadataManagerInitialization

 1 FAILED TEST
  YOU HAVE 6 DISABLED TESTS

make[4]: *** [check-local] Error 1
make[4]: Leaving directory `/mesos/mesos-1.1.0/_build/src'
make[3]: *** [check-am] Error 2
make[3]: Leaving directory `/mesos/mesos-1.1.0/_build/src'
make[2]: *** [check] Error 2
make[2]: Leaving directory `/mesos/mesos-1.1.0/_build/src'
make[1]: *** [check-recursive] Error 1
make[1]: Leaving directory `/mesos/mesos-1.1.0/_build'
make: *** [distcheck] Error 1
+ docker rmi mesos-1468614888-23488
Untagged: mesos-1468614888-23488:latest
Deleted: sha256:5fe6786cac52284c5301da968275a2d7d94fc8536bee9969182e46e7e1e0df7f
Deleted: sha256:3efa03090cc3277f7d66c60023787312dccffc8e6d43ccdccdc93714b909514f
Deleted: sha256:fa38a92e6b5293a77849ea53ed13affe2ce6c3fb9ef8a5591765d699ea1a2e6f
Deleted: sha256:ce8293c5f422815914e83f116854e249c8743a486fe1dd0a4b879fcc0ac9d0e6
Deleted: sha256:b8d1f05451c7eacdfd93d39dd2ba8b8c7b28de3019dfd5a271f359a5c808c78a
Deleted: sha256:2ca3eec914cdd9bd1ad5b518ae46423d5d9279a3f39c612469c28cce6b63b7f6
Deleted: sha256:77bcf8976af7c0c8788fe79d38af150a3fb53e16c92bf0db25f83b2ae6475e51
Deleted: sha256:0d8e5a30e8bc08f2d0bf152d228da04cf7714e114057c5cff40b3595901774ee
Deleted: sha256:cb6063b61518f00e5cae38ae63d6279fba47268411250ba3ac2fb5ec6f601b0a
Deleted: sha256:a58538da76760ddb67f2e514dfa320dd1a601d0d880c89ac73de8c4cb0ce0631
Deleted: sha256:2affa1795292b553c7e16847f9930bded07bcf8fa5d2338eb748c62929502239
Deleted: sha256:6d64d5383475a0f5adeed25ae260b6e9555838213b97c95b0bb938b2f8d7acae
Deleted: sha256:0cd649f954cade004184465d553926e26075282c500ea42e1db8b39085186e4e
Deleted: sha256:651dba28015be906366353e65c9167eb1cf7760d2a47b8809144ed81bfc16767
Deleted: sha256:1753936af75f56bfa005665e1abb763bb22c7f7192071321c8ca2bdf2803fd6e
Deleted: sha256:97f9c0523b2eb1e4fdab61240654c87d2a8f4f9c59cff7c11ecc1be689fbb350
Deleted: sha256:5d23e81044f6bd9705834c82ae8efc984fe8cd2892a9422476181af3ef8e231c
Deleted: sha256:db0de0f4dcf0e708a82da84f415abbae9f3261842f560e31cc320e23606d10c3
Deleted: sha256:6464a28a9ce039b0cee8c1d6665e4074ee3d69d97e9a2c2c34d40fc41e521fc6
Deleted: sha256:24c0d49398a4e4b70b18052f059a17b8dffb7942c32c5d80ae81776f69cdf465
Deleted: sha256:b321498da7879e03a31b5c0fbf0047b292e108dc96ceb679ef7dfecc9f5f9f45
Deleted: sha256:9cdafeb05a362813f04a577016510f16a0603bb5fed2f891bd7f3b60576c5b27
Build step 'Execute shell' marked build as failure

Mime
View raw message