mesos-builds mailing list archives

Site index · List index
Message view « Date » · « Thread »
Top « Date » · « Thread »
From Apache Jenkins Server <jenk...@builds.apache.org>
Subject Build failed in Jenkins: Mesos » autotools,clang,--verbose,GLOG_v=1 MESOS_VERBOSE=1,ubuntu:14.04,(docker||Hadoop)&&(!ubuntu-us1)&&(!ubuntu-6) #2447
Date Tue, 05 Jul 2016 23:53:37 GMT
See <https://builds.apache.org/job/Mesos/BUILDTOOL=autotools,COMPILER=clang,CONFIGURATION=--verbose,ENVIRONMENT=GLOG_v=1%20MESOS_VERBOSE=1,OS=ubuntu%3A14.04,label_exp=(docker%7C%7CHadoop)&&(!ubuntu-us1)&&(!ubuntu-6)/2447/changes>

Changes:

[vinodkone] Fixed variable name in reconciliation tests.

[bmahler] Implemented 'shouldInject()' in the 'NvidiaVolume' component.

------------------------------------------
[...truncated 194412 lines...]
I0705 23:53:32.818639 26695 slave.cpp:605] Agent hostname: 7122dbf28553
I0705 23:53:32.820017 26691 state.cpp:57] Recovering state from '/tmp/Endpoint_SlaveEndpointTest_AuthorizedRequest_1_ZKQhBS/meta'
I0705 23:53:32.820132 26695 process.cpp:3322] Handling HTTP event for process 'slave(542)'
with path: '/slave(542)/monitor/statistics.json'
I0705 23:53:32.820606 26698 status_update_manager.cpp:200] Recovering status update manager
I0705 23:53:32.820735 26698 containerizer.cpp:522] Recovering containerizer
I0705 23:53:32.821125 26692 http.cpp:765] Authorizing principal 'test-principal' to GET the
'/monitor/statistics.json' endpoint
I0705 23:53:32.822449 26693 provisioner.cpp:253] Provisioner recovery complete
I0705 23:53:32.823487 26692 slave.cpp:4839] Finished recovery
I0705 23:53:32.824038 26692 slave.cpp:5011] Querying resource estimator for oversubscribable
resources
I0705 23:53:32.824414 26692 slave.cpp:5025] Received oversubscribable resources  from the
resource estimator
I0705 23:53:32.825984 26695 slave.cpp:839] Agent terminating
[       OK ] Endpoint/SlaveEndpointTest.AuthorizedRequest/1 (23 ms)
[ RUN      ] Endpoint/SlaveEndpointTest.AuthorizedRequest/2
I0705 23:53:32.834944 26666 containerizer.cpp:196] Using isolation: posix/cpu,posix/mem,filesystem/posix,network/cni
W0705 23:53:32.835711 26666 backend.cpp:75] Failed to create 'aufs' backend: AufsBackend requires
root privileges, but is running as user mesos
W0705 23:53:32.835875 26666 backend.cpp:75] Failed to create 'bind' backend: BindBackend requires
root privileges
I0705 23:53:32.839736 26698 slave.cpp:203] Agent started on 543)@172.17.0.3:55947
I0705 23:53:32.839788 26698 slave.cpp:204] Flags at startup: --acls="" --appc_simple_discovery_uri_prefix="http://"
--appc_store_dir="/tmp/mesos/store/appc" --authenticate_http="true" --authenticatee="crammd5"
--authorizer="local" --cgroups_cpu_enable_pids_and_tids_count="false" --cgroups_enable_cfs="false"
--cgroups_hierarchy="/sys/fs/cgroup" --cgroups_limit_swap="false" --cgroups_root="mesos" --container_disk_watch_interval="15secs"
--containerizers="mesos" --credential="/tmp/Endpoint_SlaveEndpointTest_AuthorizedRequest_2_BlTc6E/credential"
--default_role="*" --disk_watch_interval="1mins" --docker="docker" --docker_kill_orphans="true"
--docker_registry="https://registry-1.docker.io" --docker_remove_delay="6hrs" --docker_socket="/var/run/docker.sock"
--docker_stop_timeout="0ns" --docker_store_dir="/tmp/mesos/store/docker" --docker_volume_checkpoint_dir="/var/run/mesos/isolators/docker/volume"
--enforce_container_disk_quota="false" --executor_registration_timeout="1mins" --executor_shutdown_grace_period="5secs"
--fetcher_cache_dir="/tmp/Endpoint_SlaveEndpointTest_AuthorizedRequest_2_BlTc6E/fetch" --fetcher_cache_size="2GB"
--frameworks_home="" --gc_delay="1weeks" --gc_disk_headroom="0.1" --hadoop_home="" --help="false"
--hostname_lookup="true" --http_authenticators="basic" --http_command_executor="false" --http_credentials="/tmp/Endpoint_SlaveEndpointTest_AuthorizedRequest_2_BlTc6E/http_credentials"
--image_provisioner_backend="copy" --initialize_driver_logging="true" --isolation="posix/cpu,posix/mem"
--launcher_dir="/mesos/mesos-1.0.0/_build/src" --logbufsecs="0" --logging_level="INFO" --oversubscribed_resources_interval="15secs"
--perf_duration="10secs" --perf_interval="1mins" --qos_correction_interval_min="0ns" --quiet="false"
--recover="reconnect" --recovery_timeout="15mins" --registration_backoff_factor="10ms" --resources="cpus:2;gpus:0;mem:1024;disk:1024;ports:[31000-32000]"
--revocable_cpu_low_priority="true" --sandbox_directory="/mnt/mesos/sandbox" --strict="true"
--switch_user="true" --systemd_enable_support="true" --systemd_runtime_directory="/run/systemd/system"
--version="false" --work_dir="/tmp/Endpoint_SlaveEndpointTest_AuthorizedRequest_2_BlTc6E"
I0705 23:53:32.840445 26698 credentials.hpp:86] Loading credential for authentication from
'/tmp/Endpoint_SlaveEndpointTest_AuthorizedRequest_2_BlTc6E/credential'
I0705 23:53:32.840673 26698 slave.cpp:341] Agent using credential for: test-principal
I0705 23:53:32.840713 26698 credentials.hpp:37] Loading credentials for authentication from
'/tmp/Endpoint_SlaveEndpointTest_AuthorizedRequest_2_BlTc6E/http_credentials'
I0705 23:53:32.840986 26698 slave.cpp:393] Using default 'basic' HTTP authenticator
I0705 23:53:32.841305 26698 resources.cpp:572] Parsing resources as JSON failed: cpus:2;gpus:0;mem:1024;disk:1024;ports:[31000-32000]
Trying semicolon-delimited string format instead
I0705 23:53:32.841773 26698 resources.cpp:572] Parsing resources as JSON failed: cpus:2;gpus:0;mem:1024;disk:1024;ports:[31000-32000]
Trying semicolon-delimited string format instead
I0705 23:53:32.842360 26698 slave.cpp:592] Agent resources: cpus(*):2; mem(*):1024; disk(*):1024;
ports(*):[31000-32000]
I0705 23:53:32.842525 26698 slave.cpp:600] Agent attributes: [  ]
I0705 23:53:32.842644 26698 slave.cpp:605] Agent hostname: 7122dbf28553
I0705 23:53:32.844533 26688 state.cpp:57] Recovering state from '/tmp/Endpoint_SlaveEndpointTest_AuthorizedRequest_2_BlTc6E/meta'
I0705 23:53:32.844651 26698 process.cpp:3322] Handling HTTP event for process 'slave(543)'
with path: '/slave(543)/containers'
I0705 23:53:32.845247 26694 status_update_manager.cpp:200] Recovering status update manager
I0705 23:53:32.845662 26687 containerizer.cpp:522] Recovering containerizer
I0705 23:53:32.845701 26697 http.cpp:765] Authorizing principal 'test-principal' to GET the
'/containers' endpoint
I0705 23:53:32.847089 26687 provisioner.cpp:253] Provisioner recovery complete
I0705 23:53:32.847579 26697 slave.cpp:4839] Finished recovery
I0705 23:53:32.848166 26697 slave.cpp:5011] Querying resource estimator for oversubscribable
resources
I0705 23:53:32.848384 26687 slave.cpp:5025] Received oversubscribable resources  from the
resource estimator
I0705 23:53:32.849453 26697 slave.cpp:839] Agent terminating
[       OK ] Endpoint/SlaveEndpointTest.AuthorizedRequest/2 (25 ms)
[ RUN      ] Endpoint/SlaveEndpointTest.UnauthorizedRequest/0
I0705 23:53:32.859097 26666 containerizer.cpp:196] Using isolation: posix/cpu,posix/mem,filesystem/posix,network/cni
W0705 23:53:32.859807 26666 backend.cpp:75] Failed to create 'aufs' backend: AufsBackend requires
root privileges, but is running as user mesos
W0705 23:53:32.859951 26666 backend.cpp:75] Failed to create 'bind' backend: BindBackend requires
root privileges
I0705 23:53:32.862872 26689 slave.cpp:203] Agent started on 544)@172.17.0.3:55947
I0705 23:53:32.862917 26689 slave.cpp:204] Flags at startup: --acls="" --appc_simple_discovery_uri_prefix="http://"
--appc_store_dir="/tmp/mesos/store/appc" --authenticate_http="true" --authenticatee="crammd5"
--authorizer="local" --cgroups_cpu_enable_pids_and_tids_count="false" --cgroups_enable_cfs="false"
--cgroups_hierarchy="/sys/fs/cgroup" --cgroups_limit_swap="false" --cgroups_root="mesos" --container_disk_watch_interval="15secs"
--containerizers="mesos" --credential="/tmp/Endpoint_SlaveEndpointTest_UnauthorizedRequest_0_LUK1Mr/credential"
--default_role="*" --disk_watch_interval="1mins" --docker="docker" --docker_kill_orphans="true"
--docker_registry="https://registry-1.docker.io" --docker_remove_delay="6hrs" --docker_socket="/var/run/docker.sock"
--docker_stop_timeout="0ns" --docker_store_dir="/tmp/mesos/store/docker" --docker_volume_checkpoint_dir="/var/run/mesos/isolators/docker/volume"
--enforce_container_disk_quota="false" --executor_registration_timeout="1mins" --executor_shutdown_grace_period="5secs"
--fetcher_cache_dir="/tmp/Endpoint_SlaveEndpointTest_UnauthorizedRequest_0_LUK1Mr/fetch" --fetcher_cache_size="2GB"
--frameworks_home="" --gc_delay="1weeks" --gc_disk_headroom="0.1" --hadoop_home="" --help="false"
--hostname_lookup="true" --http_authenticators="basic" --http_command_executor="false" --http_credentials="/tmp/Endpoint_SlaveEndpointTest_UnauthorizedRequest_0_LUK1Mr/http_credentials"
--image_provisioner_backend="copy" --initialize_driver_logging="true" --isolation="posix/cpu,posix/mem"
--launcher_dir="/mesos/mesos-1.0.0/_build/src" --logbufsecs="0" --logging_level="INFO" --oversubscribed_resources_interval="15secs"
--perf_duration="10secs" --perf_interval="1mins" --qos_correction_interval_min="0ns" --quiet="false"
--recover="reconnect" --recovery_timeout="15mins" --registration_backoff_factor="10ms" --resources="cpus:2;gpus:0;mem:1024;disk:1024;ports:[31000-32000]"
--revocable_cpu_low_priority="true" --sandbox_directory="/mnt/mesos/sandbox" --strict="true"
--switch_user="true" --systemd_enable_support="true" --systemd_runtime_directory="/run/systemd/system"
--version="false" --work_dir="/tmp/Endpoint_SlaveEndpointTest_UnauthorizedRequest_0_LUK1Mr"
I0705 23:53:32.863356 26689 credentials.hpp:86] Loading credential for authentication from
'/tmp/Endpoint_SlaveEndpointTest_UnauthorizedRequest_0_LUK1Mr/credential'
I0705 23:53:32.863548 26689 slave.cpp:341] Agent using credential for: test-principal
I0705 23:53:32.863585 26689 credentials.hpp:37] Loading credentials for authentication from
'/tmp/Endpoint_SlaveEndpointTest_UnauthorizedRequest_0_LUK1Mr/http_credentials'
I0705 23:53:32.863816 26689 slave.cpp:393] Using default 'basic' HTTP authenticator
I0705 23:53:32.864105 26689 resources.cpp:572] Parsing resources as JSON failed: cpus:2;gpus:0;mem:1024;disk:1024;ports:[31000-32000]
Trying semicolon-delimited string format instead
I0705 23:53:32.864562 26689 resources.cpp:572] Parsing resources as JSON failed: cpus:2;gpus:0;mem:1024;disk:1024;ports:[31000-32000]
Trying semicolon-delimited string format instead
I0705 23:53:32.865017 26689 slave.cpp:592] Agent resources: cpus(*):2; mem(*):1024; disk(*):1024;
ports(*):[31000-32000]
I0705 23:53:32.865077 26689 slave.cpp:600] Agent attributes: [  ]
I0705 23:53:32.865088 26689 slave.cpp:605] Agent hostname: 7122dbf28553
I0705 23:53:32.866348 26691 state.cpp:57] Recovering state from '/tmp/Endpoint_SlaveEndpointTest_UnauthorizedRequest_0_LUK1Mr/meta'
I0705 23:53:32.866456 26689 process.cpp:3322] Handling HTTP event for process 'slave(544)'
with path: '/slave(544)/monitor/statistics'
I0705 23:53:32.867123 26690 status_update_manager.cpp:200] Recovering status update manager
I0705 23:53:32.867270 26690 containerizer.cpp:522] Recovering containerizer
I0705 23:53:32.869010 26688 provisioner.cpp:253] Provisioner recovery complete
I0705 23:53:32.869362 26684 slave.cpp:4839] Finished recovery
I0705 23:53:32.869942 26684 slave.cpp:5011] Querying resource estimator for oversubscribable
resources
I0705 23:53:32.870087 26684 http.cpp:765] Authorizing principal 'test-principal' to GET the
'/monitor/statistics' endpoint
I0705 23:53:32.870344 26684 slave.cpp:5025] Received oversubscribable resources  from the
resource estimator
I0705 23:53:32.873642 26685 slave.cpp:839] Agent terminating
[       OK ] Endpoint/SlaveEndpointTest.UnauthorizedRequest/0 (23 ms)
[ RUN      ] Endpoint/SlaveEndpointTest.UnauthorizedRequest/1
I0705 23:53:32.883009 26666 containerizer.cpp:196] Using isolation: posix/cpu,posix/mem,filesystem/posix,network/cni
W0705 23:53:32.883765 26666 backend.cpp:75] Failed to create 'aufs' backend: AufsBackend requires
root privileges, but is running as user mesos
W0705 23:53:32.883916 26666 backend.cpp:75] Failed to create 'bind' backend: BindBackend requires
root privileges
I0705 23:53:32.887969 26691 slave.cpp:203] Agent started on 545)@172.17.0.3:55947
I0705 23:53:32.888108 26691 slave.cpp:204] Flags at startup: --acls="" --appc_simple_discovery_uri_prefix="http://"
--appc_store_dir="/tmp/mesos/store/appc" --authenticate_http="true" --authenticatee="crammd5"
--authorizer="local" --cgroups_cpu_enable_pids_and_tids_count="false" --cgroups_enable_cfs="false"
--cgroups_hierarchy="/sys/fs/cgroup" --cgroups_limit_swap="false" --cgroups_root="mesos" --container_disk_watch_interval="15secs"
--containerizers="mesos" --credential="/tmp/Endpoint_SlaveEndpointTest_UnauthorizedRequest_1_NqV7Ee/credential"
--default_role="*" --disk_watch_interval="1mins" --docker="docker" --docker_kill_orphans="true"
--docker_registry="https://registry-1.docker.io" --docker_remove_delay="6hrs" --docker_socket="/var/run/docker.sock"
--docker_stop_timeout="0ns" --docker_store_dir="/tmp/mesos/store/docker" --docker_volume_checkpoint_dir="/var/run/mesos/isolators/docker/volume"
--enforce_container_disk_quota="false" --executor_registration_timeout="1mins" --executor_shutdown_grace_period="5secs"
--fetcher_cache_dir="/tmp/Endpoint_SlaveEndpointTest_UnauthorizedRequest_1_NqV7Ee/fetch" --fetcher_cache_size="2GB"
--frameworks_home="" --gc_delay="1weeks" --gc_disk_headroom="0.1" --hadoop_home="" --help="false"
--hostname_lookup="true" --http_authenticators="basic" --http_command_executor="false" --http_credentials="/tmp/Endpoint_SlaveEndpointTest_UnauthorizedRequest_1_NqV7Ee/http_credentials"
--image_provisioner_backend="copy" --initialize_driver_logging="true" --isolation="posix/cpu,posix/mem"
--launcher_dir="/mesos/mesos-1.0.0/_build/src" --logbufsecs="0" --logging_level="INFO" --oversubscribed_resources_interval="15secs"
--perf_duration="10secs" --perf_interval="1mins" --qos_correction_interval_min="0ns" --quiet="false"
--recover="reconnect" --recovery_timeout="15mins" --registration_backoff_factor="10ms" --resources="cpus:2;gpus:0;mem:1024;disk:1024;ports:[31000-32000]"
--revocable_cpu_low_priority="true" --sandbox_directory="/mnt/mesos/sandbox" --strict="true"
--switch_user="true" --systemd_enable_support="true" --systemd_runtime_directory="/run/systemd/system"
--version="false" --work_dir="/tmp/Endpoint_SlaveEndpointTest_UnauthorizedRequest_1_NqV7Ee"
I0705 23:53:32.888875 26691 credentials.hpp:86] Loading credential for authentication from
'/tmp/Endpoint_SlaveEndpointTest_UnauthorizedRequest_1_NqV7Ee/credential'
I0705 23:53:32.889154 26691 slave.cpp:341] Agent using credential for: test-principal
I0705 23:53:32.889252 26691 credentials.hpp:37] Loading credentials for authentication from
'/tmp/Endpoint_SlaveEndpointTest_UnauthorizedRequest_1_NqV7Ee/http_credentials'
I0705 23:53:32.889617 26691 slave.cpp:393] Using default 'basic' HTTP authenticator
I0705 23:53:32.889971 26691 resources.cpp:572] Parsing resources as JSON failed: cpus:2;gpus:0;mem:1024;disk:1024;ports:[31000-32000]
Trying semicolon-delimited string format instead
I0705 23:53:32.890600 26691 resources.cpp:572] Parsing resources as JSON failed: cpus:2;gpus:0;mem:1024;disk:1024;ports:[31000-32000]
Trying semicolon-delimited string format instead
I0705 23:53:32.891218 26691 slave.cpp:592] Agent resources: cpus(*):2; mem(*):1024; disk(*):1024;
ports(*):[31000-32000]
I0705 23:53:32.891427 26691 slave.cpp:600] Agent attributes: [  ]
I0705 23:53:32.891557 26691 slave.cpp:605] Agent hostname: 7122dbf28553
I0705 23:53:32.893571 26686 state.cpp:57] Recovering state from '/tmp/Endpoint_SlaveEndpointTest_UnauthorizedRequest_1_NqV7Ee/meta'
I0705 23:53:32.894032 26691 process.cpp:3322] Handling HTTP event for process 'slave(545)'
with path: '/slave(545)/monitor/statistics.json'
I0705 23:53:32.894939 26688 status_update_manager.cpp:200] Recovering status update manager
I0705 23:53:32.895423 26691 containerizer.cpp:522] Recovering containerizer
I0705 23:53:32.895591 26686 http.cpp:765] Authorizing principal 'test-principal' to GET the
'/monitor/statistics.json' endpoint
I0705 23:53:32.897723 26687 provisioner.cpp:253] Provisioner recovery complete
I0705 23:53:32.898258 26694 slave.cpp:4839] Finished recovery
I0705 23:53:32.898808 26694 slave.cpp:5011] Querying resource estimator for oversubscribable
resources
I0705 23:53:32.898988 26695 slave.cpp:5025] Received oversubscribable resources  from the
resource estimator
I0705 23:53:32.899634 26666 slave.cpp:839] Agent terminating
[       OK ] Endpoint/SlaveEndpointTest.UnauthorizedRequest/1 (25 ms)
[ RUN      ] Endpoint/SlaveEndpointTest.UnauthorizedRequest/2
I0705 23:53:32.909155 26666 containerizer.cpp:196] Using isolation: posix/cpu,posix/mem,filesystem/posix,network/cni
W0705 23:53:32.909971 26666 backend.cpp:75] Failed to create 'aufs' backend: AufsBackend requires
root privileges, but is running as user mesos
W0705 23:53:32.910162 26666 backend.cpp:75] Failed to create 'bind' backend: BindBackend requires
root privileges
I0705 23:53:32.914609 26690 slave.cpp:203] Agent started on 546)@172.17.0.3:55947
I0705 23:53:32.914659 26690 slave.cpp:204] Flags at startup: --acls="" --appc_simple_discovery_uri_prefix="http://"
--appc_store_dir="/tmp/mesos/store/appc" --authenticate_http="true" --authenticatee="crammd5"
--authorizer="local" --cgroups_cpu_enable_pids_and_tids_count="false" --cgroups_enable_cfs="false"
--cgroups_hierarchy="/sys/fs/cgroup" --cgroups_limit_swap="false" --cgroups_root="mesos" --container_disk_watch_interval="15secs"
--containerizers="mesos" --credential="/tmp/Endpoint_SlaveEndpointTest_UnauthorizedRequest_2_nebnK1/credential"
--default_role="*" --disk_watch_interval="1mins" --docker="docker" --docker_kill_orphans="true"
--docker_registry="https://registry-1.docker.io" --docker_remove_delay="6hrs" --docker_socket="/var/run/docker.sock"
--docker_stop_timeout="0ns" --docker_store_dir="/tmp/mesos/store/docker" --docker_volume_checkpoint_dir="/var/run/mesos/isolators/docker/volume"
--enforce_container_disk_quota="false" --executor_registration_timeout="1mins" --executor_shutdown_grace_period="5secs"
--fetcher_cache_dir="/tmp/Endpoint_SlaveEndpointTest_UnauthorizedRequest_2_nebnK1/fetch" --fetcher_cache_size="2GB"
--frameworks_home="" --gc_delay="1weeks" --gc_disk_headroom="0.1" --hadoop_home="" --help="false"
--hostname_lookup="true" --http_authenticators="basic" --http_command_executor="false" --http_credentials="/tmp/Endpoint_SlaveEndpointTest_UnauthorizedRequest_2_nebnK1/http_credentials"
--image_provisioner_backend="copy" --initialize_driver_logging="true" --isolation="posix/cpu,posix/mem"
--launcher_dir="/mesos/mesos-1.0.0/_build/src" --logbufsecs="0" --logging_level="INFO" --oversubscribed_resources_interval="15secs"
--perf_duration="10secs" --perf_interval="1mins" --qos_correction_interval_min="0ns" --quiet="false"
--recover="reconnect" --recovery_timeout="15mins" --registration_backoff_factor="10ms" --resources="cpus:2;gpus:0;mem:1024;disk:1024;ports:[31000-32000]"
--revocable_cpu_low_priority="true" --sandbox_directory="/mnt/mesos/sandbox" --strict="true"
--switch_user="true" --systemd_enable_support="true" --systemd_runtime_directory="/run/systemd/system"
--version="false" --work_dir="/tmp/Endpoint_SlaveEndpointTest_UnauthorizedRequest_2_nebnK1"
I0705 23:53:32.915216 26690 credentials.hpp:86] Loading credential for authentication from
'/tmp/Endpoint_SlaveEndpointTest_UnauthorizedRequest_2_nebnK1/credential'
I0705 23:53:32.915434 26690 slave.cpp:341] Agent using credential for: test-principal
I0705 23:53:32.915560 26690 credentials.hpp:37] Loading credentials for authentication from
'/tmp/Endpoint_SlaveEndpointTest_UnauthorizedRequest_2_nebnK1/http_credentials'
I0705 23:53:32.915925 26690 slave.cpp:393] Using default 'basic' HTTP authenticator
I0705 23:53:32.916260 26690 resources.cpp:572] Parsing resources as JSON failed: cpus:2;gpus:0;mem:1024;disk:1024;ports:[31000-32000]
Trying semicolon-delimited string format instead
I0705 23:53:32.916962 26690 resources.cpp:572] Parsing resources as JSON failed: cpus:2;gpus:0;mem:1024;disk:1024;ports:[31000-32000]
Trying semicolon-delimited string format instead
I0705 23:53:32.917630 26690 slave.cpp:592] Agent resources: cpus(*):2; mem(*):1024; disk(*):1024;
ports(*):[31000-32000]
I0705 23:53:32.917848 26690 slave.cpp:600] Agent attributes: [  ]
I0705 23:53:32.918023 26690 slave.cpp:605] Agent hostname: 7122dbf28553
I0705 23:53:32.920086 26689 state.cpp:57] Recovering state from '/tmp/Endpoint_SlaveEndpointTest_UnauthorizedRequest_2_nebnK1/meta'
I0705 23:53:32.920325 26690 process.cpp:3322] Handling HTTP event for process 'slave(546)'
with path: '/slave(546)/containers'
I0705 23:53:32.920959 26689 status_update_manager.cpp:200] Recovering status update manager
I0705 23:53:32.921120 26689 containerizer.cpp:522] Recovering containerizer
I0705 23:53:32.922113 26689 http.cpp:765] Authorizing principal 'test-principal' to GET the
'/containers' endpoint
I0705 23:53:32.922854 26690 provisioner.cpp:253] Provisioner recovery complete
I0705 23:53:32.924347 26698 slave.cpp:4839] Finished recovery
I0705 23:53:32.924901 26698 slave.cpp:5011] Querying resource estimator for oversubscribable
resources
I0705 23:53:32.925204 26693 slave.cpp:5025] Received oversubscribable resources  from the
resource estimator
I0705 23:53:32.926079 26666 slave.cpp:839] Agent terminating
[       OK ] Endpoint/SlaveEndpointTest.UnauthorizedRequest/2 (35 ms)
[ RUN      ] Endpoint/SlaveEndpointTest.NoAuthorizer/0
I0705 23:53:32.944833 26666 containerizer.cpp:196] Using isolation: posix/cpu,posix/mem,filesystem/posix,network/cni
W0705 23:53:32.945688 26666 backend.cpp:75] Failed to create 'aufs' backend: AufsBackend requires
root privileges, but is running as user mesos
W0705 23:53:32.945899 26666 backend.cpp:75] Failed to create 'bind' backend: BindBackend requires
root privileges
I0705 23:53:32.947384 26666 cluster.cpp:432] Creating default 'local' authorizer
I0705 23:53:32.948997 26695 slave.cpp:203] Agent started on 547)@172.17.0.3:55947
I0705 23:53:32.949036 26695 slave.cpp:204] Flags at startup: --acls="" --appc_simple_discovery_uri_prefix="http://"
--appc_store_dir="/tmp/mesos/store/appc" --authenticate_http="true" --authenticatee="crammd5"
--authorizer="local" --cgroups_cpu_enable_pids_and_tids_count="false" --cgroups_enable_cfs="false"
--cgroups_hierarchy="/sys/fs/cgroup" --cgroups_limit_swap="false" --cgroups_root="mesos" --container_disk_watch_interval="15secs"
--containerizers="mesos" --credential="/tmp/Endpoint_SlaveEndpointTest_NoAuthorizer_0_dORs5O/credential"
--default_role="*" --disk_watch_interval="1mins" --docker="docker" --docker_kill_orphans="true"
--docker_registry="https://registry-1.docker.io" --docker_remove_delay="6hrs" --docker_socket="/var/run/docker.sock"
--docker_stop_timeout="0ns" --docker_store_dir="/tmp/mesos/store/docker" --docker_volume_checkpoint_dir="/var/run/mesos/isolators/docker/volume"
--enforce_container_disk_quota="false" --executor_registration_timeout="1mins" --executor_shutdown_grace_period="5secs"
--fetcher_cache_dir="/tmp/Endpoint_SlaveEndpointTest_NoAuthorizer_0_dORs5O/fetch" --fetcher_cache_size="2GB"
--frameworks_home="" --gc_delay="1weeks" --gc_disk_headroom="0.1" --hadoop_home="" --help="false"
--hostname_lookup="true" --http_authenticators="basic" --http_command_executor="false" --http_credentials="/tmp/Endpoint_SlaveEndpointTest_NoAuthorizer_0_dORs5O/http_credentials"
--image_provisioner_backend="copy" --initialize_driver_logging="true" --isolation="posix/cpu,posix/mem"
--launcher_dir="/mesos/mesos-1.0.0/_build/src" --logbufsecs="0" --logging_level="INFO" --oversubscribed_resources_interval="15secs"
--perf_duration="10secs" --perf_interval="1mins" --qos_correction_interval_min="0ns" --quiet="false"
--recover="reconnect" --recovery_timeout="15mins" --registration_backoff_factor="10ms" --resources="cpus:2;gpus:0;mem:1024;disk:1024;ports:[31000-32000]"
--revocable_cpu_low_priority="true" --sandbox_directory="/mnt/mesos/sandbox" --strict="true"
--switch_user="true" --systemd_enable_support="true" --systemd_runtime_directory="/run/systemd/system"
--version="false" --work_dir="/tmp/Endpoint_SlaveEndpointTest_NoAuthorizer_0_dORs5O"
I0705 23:53:32.949537 26695 credentials.hpp:86] Loading credential for authentication from
'/tmp/Endpoint_SlaveEndpointTest_NoAuthorizer_0_dORs5O/credential'
I0705 23:53:32.949757 26695 slave.cpp:341] Agent using credential for: test-principal
I0705 23:53:32.949806 26695 credentials.hpp:37] Loading credentials for authentication from
'/tmp/Endpoint_SlaveEndpointTest_NoAuthorizer_0_dORs5O/http_credentials'
I0705 23:53:32.950129 26695 slave.cpp:393] Using default 'basic' HTTP authenticator
I0705 23:53:32.950489 26695 resources.cpp:572] Parsing resources as JSON failed: cpus:2;gpus:0;mem:1024;disk:1024;ports:[31000-32000]
Trying semicolon-delimited string format instead
I0705 23:53:32.951117 26695 resources.cpp:572] Parsing resources as JSON failed: cpus:2;gpus:0;mem:1024;disk:1024;ports:[31000-32000]
Trying semicolon-delimited string format instead
I0705 23:53:32.951675 26695 slave.cpp:592] Agent resources: cpus(*):2; mem(*):1024; disk(*):1024;
ports(*):[31000-32000]
I0705 23:53:32.951762 26695 slave.cpp:600] Agent attributes: [  ]
I0705 23:53:32.951781 26695 slave.cpp:605] Agent hostname: 7122dbf28553
I0705 23:53:32.953315 26684 state.cpp:57] Recovering state from '/tmp/Endpoint_SlaveEndpointTest_NoAuthorizer_0_dORs5O/meta'
I0705 23:53:32.953419 26695 process.cpp:3322] Handling HTTP event for process 'slave(547)'
with path: '/slave(547)/monitor/statistics'
I0705 23:53:32.953908 26689 status_update_manager.cpp:200] Recovering status update manager
I0705 23:53:32.954174 26691 containerizer.cpp:522] Recovering containerizer
I0705 23:53:32.954450 26697 http.cpp:765] Authorizing principal 'test-principal' to GET the
'/monitor/statistics' endpoint
I0705 23:53:32.955425 26698 provisioner.cpp:253] Provisioner recovery complete
I0705 23:53:32.956975 26685 slave.cpp:4839] Finished recovery
I0705 23:53:32.957571 26685 slave.cpp:5011] Querying resource estimator for oversubscribable
resources
I0705 23:53:32.957962 26685 slave.cpp:5025] Received oversubscribable resources  from the
resource estimator
I0705 23:53:32.958644 26688 slave.cpp:839] Agent terminating
[       OK ] Endpoint/SlaveEndpointTest.NoAuthorizer/0 (23 ms)
[ RUN      ] Endpoint/SlaveEndpointTest.NoAuthorizer/1
I0705 23:53:32.968041 26666 containerizer.cpp:196] Using isolation: posix/cpu,posix/mem,filesystem/posix,network/cni
W0705 23:53:32.968709 26666 backend.cpp:75] Failed to create 'aufs' backend: AufsBackend requires
root privileges, but is running as user mesos
W0705 23:53:32.968858 26666 backend.cpp:75] Failed to create 'bind' backend: BindBackend requires
root privileges
I0705 23:53:32.970269 26666 cluster.cpp:432] Creating default 'local' authorizer
I0705 23:53:32.972393 26687 slave.cpp:203] Agent started on 548)@172.17.0.3:55947
I0705 23:53:32.972435 26687 slave.cpp:204] Flags at startup: --acls="" --appc_simple_discovery_uri_prefix="http://"
--appc_store_dir="/tmp/mesos/store/appc" --authenticate_http="true" --authenticatee="crammd5"
--authorizer="local" --cgroups_cpu_enable_pids_and_tids_count="false" --cgroups_enable_cfs="false"
--cgroups_hierarchy="/sys/fs/cgroup" --cgroups_limit_swap="false" --cgroups_root="mesos" --container_disk_watch_interval="15secs"
--containerizers="mesos" --credential="/tmp/Endpoint_SlaveEndpointTest_NoAuthorizer_1_hQluDC/credential"
--default_role="*" --disk_watch_interval="1mins" --docker="docker" --docker_kill_orphans="true"
--docker_registry="https://registry-1.docker.io" --docker_remove_delay="6hrs" --docker_socket="/var/run/docker.sock"
--docker_stop_timeout="0ns" --docker_store_dir="/tmp/mesos/store/docker" --docker_volume_checkpoint_dir="/var/run/mesos/isolators/docker/volume"
--enforce_container_disk_quota="false" --executor_registration_timeout="1mins" --executor_shutdown_grace_period="5secs"
--fetcher_cache_dir="/tmp/Endpoint_SlaveEndpointTest_NoAuthorizer_1_hQluDC/fetch" --fetcher_cache_size="2GB"
--frameworks_home="" --gc_delay="1weeks" --gc_disk_headroom="0.1" --hadoop_home="" --help="false"
--hostname_lookup="true" --http_authenticators="basic" --http_command_executor="false" --http_credentials="/tmp/Endpoint_SlaveEndpointTest_NoAuthorizer_1_hQluDC/http_credentials"
--image_provisioner_backend="copy" --initialize_driver_logging="true" --isolation="posix/cpu,posix/mem"
--launcher_dir="/mesos/mesos-1.0.0/_build/src" --logbufsecs="0" --logging_level="INFO" --oversubscribed_resources_interval="15secs"
--perf_duration="10secs" --perf_interval="1mins" --qos_correction_interval_min="0ns" --quiet="false"
--recover="reconnect" --recovery_timeout="15mins" --registration_backoff_factor="10ms" --resources="cpus:2;gpus:0;mem:1024;disk:1024;ports:[31000-32000]"
--revocable_cpu_low_priority="true" --sandbox_directory="/mnt/mesos/sandbox" --strict="true"
--switch_user="true" --systemd_enable_support="true" --systemd_runtime_directory="/run/systemd/system"
--version="false" --work_dir="/tmp/Endpoint_SlaveEndpointTest_NoAuthorizer_1_hQluDC"
I0705 23:53:32.973064 26687 credentials.hpp:86] Loading credential for authentication from
'/tmp/Endpoint_SlaveEndpointTest_NoAuthorizer_1_hQluDC/credential'
I0705 23:53:32.973261 26687 slave.cpp:341] Agent using credential for: test-principal
I0705 23:53:32.973318 26687 credentials.hpp:37] Loading credentials for authentication from
'/tmp/Endpoint_SlaveEndpointTest_NoAuthorizer_1_hQluDC/http_credentials'
I0705 23:53:32.973593 26687 slave.cpp:393] Using default 'basic' HTTP authenticator
I0705 23:53:32.973866 26687 resources.cpp:572] Parsing resources as JSON failed: cpus:2;gpus:0;mem:1024;disk:1024;ports:[31000-32000]
Trying semicolon-delimited string format instead
I0705 23:53:32.974331 26687 resources.cpp:572] Parsing resources as JSON failed: cpus:2;gpus:0;mem:1024;disk:1024;ports:[31000-32000]
Trying semicolon-delimited string format instead
I0705 23:53:32.974915 26687 slave.cpp:592] Agent resources: cpus(*):2; mem(*):1024; disk(*):1024;
ports(*):[31000-32000]
I0705 23:53:32.975005 26687 slave.cpp:600] Agent attributes: [  ]
I0705 23:53:32.975024 26687 slave.cpp:605] Agent hostname: 7122dbf28553
I0705 23:53:32.976938 26685 state.cpp:57] Recovering state from '/tmp/Endpoint_SlaveEndpointTest_NoAuthorizer_1_hQluDC/meta'
I0705 23:53:32.977051 26687 process.cpp:3322] Handling HTTP event for process 'slave(548)'
with path: '/slave(548)/monitor/statistics.json'
I0705 23:53:32.977623 26694 status_update_manager.cpp:200] Recovering status update manager
I0705 23:53:32.978034 26695 containerizer.cpp:522] Recovering containerizer
I0705 23:53:32.978070 26687 http.cpp:765] Authorizing principal 'test-principal' to GET the
'/monitor/statistics.json' endpoint
I0705 23:53:32.981127 26692 provisioner.cpp:253] Provisioner recovery complete
I0705 23:53:32.981627 26692 slave.cpp:4839] Finished recovery
I0705 23:53:32.982761 26692 slave.cpp:5011] Querying resource estimator for oversubscribable
resources
I0705 23:53:32.983003 26694 slave.cpp:5025] Received oversubscribable resources  from the
resource estimator
I0705 23:53:32.984158 26666 slave.cpp:839] Agent terminating
[       OK ] Endpoint/SlaveEndpointTest.NoAuthorizer/1 (23 ms)
[ RUN      ] Endpoint/SlaveEndpointTest.NoAuthorizer/2
I0705 23:53:32.993212 26666 containerizer.cpp:196] Using isolation: posix/cpu,posix/mem,filesystem/posix,network/cni
W0705 23:53:32.994108 26666 backend.cpp:75] Failed to create 'aufs' backend: AufsBackend requires
root privileges, but is running as user mesos
W0705 23:53:32.994289 26666 backend.cpp:75] Failed to create 'bind' backend: BindBackend requires
root privileges
I0705 23:53:32.996121 26666 cluster.cpp:432] Creating default 'local' authorizer
I0705 23:53:32.999480 26686 slave.cpp:203] Agent started on 549)@172.17.0.3:55947
I0705 23:53:32.999564 26686 slave.cpp:204] Flags at startup: --acls="" --appc_simple_discovery_uri_prefix="http://"
--appc_store_dir="/tmp/mesos/store/appc" --authenticate_http="true" --authenticatee="crammd5"
--authorizer="local" --cgroups_cpu_enable_pids_and_tids_count="false" --cgroups_enable_cfs="false"
--cgroups_hierarchy="/sys/fs/cgroup" --cgroups_limit_swap="false" --cgroups_root="mesos" --container_disk_watch_interval="15secs"
--containerizers="mesos" --credential="/tmp/Endpoint_SlaveEndpointTest_NoAuthorizer_2_531lnq/credential"
--default_role="*" --disk_watch_interval="1mins" --docker="docker" --docker_kill_orphans="true"
--docker_registry="https://registry-1.docker.io" --docker_remove_delay="6hrs" --docker_socket="/var/run/docker.sock"
--docker_stop_timeout="0ns" --docker_store_dir="/tmp/mesos/store/docker" --docker_volume_checkpoint_dir="/var/run/mesos/isolators/docker/volume"
--enforce_container_disk_quota="false" --executor_registration_timeout="1mins" --executor_shutdown_grace_period="5secs"
--fetcher_cache_dir="/tmp/Endpoint_SlaveEndpointTest_NoAuthorizer_2_531lnq/fetch" --fetcher_cache_size="2GB"
--frameworks_home="" --gc_delay="1weeks" --gc_disk_headroom="0.1" --hadoop_home="" --help="false"
--hostname_lookup="true" --http_authenticators="basic" --http_command_executor="false" --http_credentials="/tmp/Endpoint_SlaveEndpointTest_NoAuthorizer_2_531lnq/http_credentials"
--image_provisioner_backend="copy" --initialize_driver_logging="true" --isolation="posix/cpu,posix/mem"
--launcher_dir="/mesos/mesos-1.0.0/_build/src" --logbufsecs="0" --logging_level="INFO" --oversubscribed_resources_interval="15secs"
--perf_duration="10secs" --perf_interval="1mins" --qos_correction_interval_min="0ns" --quiet="false"
--recover="reconnect" --recovery_timeout="15mins" --registration_backoff_factor="10ms" --resources="cpus:2;gpus:0;mem:1024;disk:1024;ports:[31000-32000]"
--revocable_cpu_low_priority="true" --sandbox_directory="/mnt/mesos/sandbox" --strict="true"
--switch_user="true" --systemd_enable_support="true" --systemd_runtime_directory="/run/systemd/system"
--version="false" --work_dir="/tmp/Endpoint_SlaveEndpointTest_NoAuthorizer_2_531lnq"
I0705 23:53:32.999943 26686 credentials.hpp:86] Loading credential for authentication from
'/tmp/Endpoint_SlaveEndpointTest_NoAuthorizer_2_531lnq/credential'
I0705 23:53:33.000138 26686 slave.cpp:341] Agent using credential for: test-principal
I0705 23:53:33.000183 26686 credentials.hpp:37] Loading credentials for authentication from
'/tmp/Endpoint_SlaveEndpointTest_NoAuthorizer_2_531lnq/http_credentials'
I0705 23:53:33.000442 26686 slave.cpp:393] Using default 'basic' HTTP authenticator
I0705 23:53:33.000723 26686 resources.cpp:572] Parsing resources as JSON failed: cpus:2;gpus:0;mem:1024;disk:1024;ports:[31000-32000]
Trying semicolon-delimited string format instead
I0705 23:53:33.001142 26686 resources.cpp:572] Parsing resources as JSON failed: cpus:2;gpus:0;mem:1024;disk:1024;ports:[31000-32000]
Trying semicolon-delimited string format instead
I0705 23:53:33.002558 26686 slave.cpp:592] Agent resources: cpus(*):2; mem(*):1024; disk(*):1024;
ports(*):[31000-32000]
I0705 23:53:33.002619 26686 slave.cpp:600] Agent attributes: [  ]
I0705 23:53:33.002631 26686 slave.cpp:605] Agent hostname: 7122dbf28553
I0705 23:53:33.004271 26684 state.cpp:57] Recovering state from '/tmp/Endpoint_SlaveEndpointTest_NoAuthorizer_2_531lnq/meta'
I0705 23:53:33.004456 26686 process.cpp:3322] Handling HTTP event for process 'slave(549)'
with path: '/slave(549)/containers'
I0705 23:53:33.004904 26694 status_update_manager.cpp:200] Recovering status update manager
I0705 23:53:33.005197 26694 containerizer.cpp:522] Recovering containerizer
I0705 23:53:33.006054 26686 http.cpp:765] Authorizing principal 'test-principal' to GET the
'/containers' endpoint
I0705 23:53:33.006640 26685 provisioner.cpp:253] Provisioner recovery complete
I0705 23:53:33.007194 26686 slave.cpp:4839] Finished recovery
I0705 23:53:33.007701 26686 slave.cpp:5011] Querying resource estimator for oversubscribable
resources
I0705 23:53:33.008509 26686 slave.cpp:5025] Received oversubscribable resources  from the
resource estimator
I0705 23:53:33.010447 26688 slave.cpp:839] Agent terminating
[       OK ] Endpoint/SlaveEndpointTest.NoAuthorizer/2 (26 ms)
[----------] 9 tests from Endpoint/SlaveEndpointTest (234 ms total)

[----------] Global test environment tear-down
[==========] 1224 tests from 139 test cases ran. (386015 ms total)
[  PASSED  ] 1223 tests.
[  FAILED  ] 1 test, listed below:
[  FAILED  ] DiskQuotaTest.SlaveRecovery

 1 FAILED TEST
  YOU HAVE 6 DISABLED TESTS

make[4]: *** [check-local] Error 1
make[4]: Leaving directory `/mesos/mesos-1.0.0/_build/src'
make[3]: *** [check-am] Error 2
make[3]: Leaving directory `/mesos/mesos-1.0.0/_build/src'
make[2]: *** [check] Error 2
make[2]: Leaving directory `/mesos/mesos-1.0.0/_build/src'
make[1]: *** [check-recursive] Error 1
make[1]: Leaving directory `/mesos/mesos-1.0.0/_build'
make: *** [distcheck] Error 1
+ docker rmi mesos-1467760485-30160
Untagged: mesos-1467760485-30160:latest
Deleted: 0d9502d517c471c80b90ba3827a94ecc159dcd2088cb9293ef3a66a4337fc1b3
Deleted: dadbacadc7ab62af1633d85d9afe66777a126080cc5afece49da5cafa9abf848
Deleted: 92f523ec0bb029eabeba8bb10b2dacdcb17a945c79806cc657076ecd3aae71b7
Deleted: 4a1612f0cc4abfc97ba6083442897a7b419afceee4f4bbfbd4cec7e3d9b4d460
Deleted: b1120222121f72dfe28acdd3c31902046d08aa5c47b55e7c690a05455c646bfb
Deleted: 1534cac4ed7ffa2830e60c42e43457ec37946c958f2a843fabece704548d608c
Deleted: 5f7b81a66092c2cf5cfec2000865a525a7b41ba6a01e814d1c96c9a612aa6e3b
Deleted: 9c2466c13e318a7b00842f69a4f17fa39c489dbb7d3f0b254090722baae2b4cc
Deleted: 3ff6914fb6dda51b5b9b0042d4b0b1151e41399e1b15541c329e61593c250ed1
Deleted: 8734b4cd6f48999c6ed93da7d7bc04a3fda26099f3a6b4164e4c5548b839190c
Deleted: 9fc9ee2e6c279a7c11a94c505cbfc56e6d52b68d6c0b24a73e1fa9994eef3ca8
Deleted: 56056540912eec98ded98004a5388a9d455e41267db6fbdadad06e1241f1a04b
Deleted: 03649acf29e0320522bbb376438937bfe81146d13547efe69a8ffd75348a0434
Deleted: 5b83098b458a49acf210c05842370032eb054620da7d012cc675dfceff259636
Deleted: 64c9cfeab23a51cf766f4206d4c7c259761bc9100cd5aa2e0192faf073c1d3ff
Build step 'Execute shell' marked build as failure

Mime
View raw message