mesos-builds mailing list archives

Site index · List index
Message view « Date » · « Thread »
Top « Date » · « Thread »
From Apache Jenkins Server <jenk...@builds.apache.org>
Subject Build failed in Jenkins: Mesos » autotools,gcc,--verbose,GLOG_v=1 MESOS_VERBOSE=1,ubuntu:14.04,(docker||Hadoop)&&(!ubuntu-us1)&&(!ubuntu-6) #2508
Date Thu, 14 Jul 2016 20:16:19 GMT
See <https://builds.apache.org/job/Mesos/BUILDTOOL=autotools,COMPILER=gcc,CONFIGURATION=--verbose,ENVIRONMENT=GLOG_v=1%20MESOS_VERBOSE=1,OS=ubuntu%3A14.04,label_exp=(docker%7C%7CHadoop)&&(!ubuntu-us1)&&(!ubuntu-6)/2508/changes>

Changes:

[bmahler] Added initial benchmark test for DRF sorter.

------------------------------------------
[...truncated 203480 lines...]
I0714 20:16:11.835758 28492 slave.cpp:594] Agent resources: cpus(*):2; mem(*):1024; disk(*):1024;
ports(*):[31000-32000]
I0714 20:16:11.835819 28492 slave.cpp:602] Agent attributes: [  ]
I0714 20:16:11.835837 28492 slave.cpp:607] Agent hostname: a237b64d5c9e
I0714 20:16:11.837158 28491 state.cpp:57] Recovering state from '/tmp/Endpoint_SlaveEndpointTest_AuthorizedRequest_1_WbUDMx/meta'
I0714 20:16:11.837260 28492 process.cpp:3354] Handling HTTP event for process 'slave(562)'
with path: '/slave(562)/monitor/statistics.json'
I0714 20:16:11.837765 28484 status_update_manager.cpp:200] Recovering status update manager
I0714 20:16:11.837911 28491 containerizer.cpp:522] Recovering containerizer
I0714 20:16:11.838381 28495 http.cpp:829] Authorizing principal 'test-principal' to GET the
'/monitor/statistics.json' endpoint
I0714 20:16:11.839292 28496 provisioner.cpp:253] Provisioner recovery complete
I0714 20:16:11.840023 28495 slave.cpp:4856] Finished recovery
I0714 20:16:11.840849 28495 slave.cpp:5028] Querying resource estimator for oversubscribable
resources
I0714 20:16:11.841058 28492 slave.cpp:5042] Received oversubscribable resources  from the
resource estimator
I0714 20:16:11.842201 28483 slave.cpp:841] Agent terminating
[       OK ] Endpoint/SlaveEndpointTest.AuthorizedRequest/1 (39 ms)
[ RUN      ] Endpoint/SlaveEndpointTest.AuthorizedRequest/2
I0714 20:16:11.880928 28463 containerizer.cpp:196] Using isolation: posix/cpu,posix/mem,filesystem/posix,network/cni
W0714 20:16:11.881922 28463 backend.cpp:75] Failed to create 'aufs' backend: AufsBackend requires
root privileges, but is running as user mesos
W0714 20:16:11.882128 28463 backend.cpp:75] Failed to create 'bind' backend: BindBackend requires
root privileges
I0714 20:16:11.887248 28482 slave.cpp:205] Agent started on 563)@172.17.0.2:54905
I0714 20:16:11.887290 28482 slave.cpp:206] Flags at startup: --acls="" --appc_simple_discovery_uri_prefix="http://"
--appc_store_dir="/tmp/mesos/store/appc" --authenticate_http="true" --authenticatee="crammd5"
--authentication_backoff_factor="1secs" --authorizer="local" --cgroups_cpu_enable_pids_and_tids_count="false"
--cgroups_enable_cfs="false" --cgroups_hierarchy="/sys/fs/cgroup" --cgroups_limit_swap="false"
--cgroups_root="mesos" --container_disk_watch_interval="15secs" --containerizers="mesos" --credential="/tmp/Endpoint_SlaveEndpointTest_AuthorizedRequest_2_pA52yv/credential"
--default_role="*" --disk_watch_interval="1mins" --docker="docker" --docker_kill_orphans="true"
--docker_registry="https://registry-1.docker.io" --docker_remove_delay="6hrs" --docker_socket="/var/run/docker.sock"
--docker_stop_timeout="0ns" --docker_store_dir="/tmp/mesos/store/docker" --docker_volume_checkpoint_dir="/var/run/mesos/isolators/docker/volume"
--enforce_container_disk_quota="false" --executor_registration_timeout="1mins" --executor_shutdown_grace_period="5secs"
--fetcher_cache_dir="/tmp/Endpoint_SlaveEndpointTest_AuthorizedRequest_2_pA52yv/fetch" --fetcher_cache_size="2GB"
--frameworks_home="" --gc_delay="1weeks" --gc_disk_headroom="0.1" --hadoop_home="" --help="false"
--hostname_lookup="true" --http_authenticators="basic" --http_command_executor="false" --http_credentials="/tmp/Endpoint_SlaveEndpointTest_AuthorizedRequest_2_pA52yv/http_credentials"
--image_provisioner_backend="copy" --initialize_driver_logging="true" --isolation="posix/cpu,posix/mem"
--launcher_dir="/mesos/mesos-1.1.0/_build/src" --logbufsecs="0" --logging_level="INFO" --oversubscribed_resources_interval="15secs"
--perf_duration="10secs" --perf_interval="1mins" --qos_correction_interval_min="0ns" --quiet="false"
--recover="reconnect" --recovery_timeout="15mins" --registration_backoff_factor="10ms" --resources="cpus:2;gpus:0;mem:1024;disk:1024;ports:[31000-32000]"
--revocable_cpu_low_priority="true" --sandbox_directory="/mnt/mesos/sandbox" --strict="true"
--switch_user="true" --systemd_enable_support="true" --systemd_runtime_directory="/run/systemd/system"
--version="false" --work_dir="/tmp/Endpoint_SlaveEndpointTest_AuthorizedRequest_2_pA52yv"
I0714 20:16:11.887964 28482 credentials.hpp:86] Loading credential for authentication from
'/tmp/Endpoint_SlaveEndpointTest_AuthorizedRequest_2_pA52yv/credential'
I0714 20:16:11.888197 28482 slave.cpp:343] Agent using credential for: test-principal
I0714 20:16:11.888387 28482 credentials.hpp:37] Loading credentials for authentication from
'/tmp/Endpoint_SlaveEndpointTest_AuthorizedRequest_2_pA52yv/http_credentials'
I0714 20:16:11.888756 28482 slave.cpp:395] Using default 'basic' HTTP authenticator
I0714 20:16:11.889168 28482 resources.cpp:572] Parsing resources as JSON failed: cpus:2;gpus:0;mem:1024;disk:1024;ports:[31000-32000]
Trying semicolon-delimited string format instead
I0714 20:16:11.889520 28482 resources.cpp:572] Parsing resources as JSON failed: cpus:2;gpus:0;mem:1024;disk:1024;ports:[31000-32000]
Trying semicolon-delimited string format instead
I0714 20:16:11.889866 28482 slave.cpp:594] Agent resources: cpus(*):2; mem(*):1024; disk(*):1024;
ports(*):[31000-32000]
I0714 20:16:11.889925 28482 slave.cpp:602] Agent attributes: [  ]
I0714 20:16:11.889935 28482 slave.cpp:607] Agent hostname: a237b64d5c9e
I0714 20:16:11.891377 28490 state.cpp:57] Recovering state from '/tmp/Endpoint_SlaveEndpointTest_AuthorizedRequest_2_pA52yv/meta'
I0714 20:16:11.891444 28482 process.cpp:3354] Handling HTTP event for process 'slave(563)'
with path: '/slave(563)/containers'
I0714 20:16:11.892016 28485 status_update_manager.cpp:200] Recovering status update manager
I0714 20:16:11.892175 28492 containerizer.cpp:522] Recovering containerizer
I0714 20:16:11.892488 28484 http.cpp:829] Authorizing principal 'test-principal' to GET the
'/containers' endpoint
I0714 20:16:11.894435 28489 provisioner.cpp:253] Provisioner recovery complete
I0714 20:16:11.894706 28489 slave.cpp:4856] Finished recovery
I0714 20:16:11.903142 28489 slave.cpp:5028] Querying resource estimator for oversubscribable
resources
I0714 20:16:11.903625 28489 slave.cpp:841] Agent terminating
[       OK ] Endpoint/SlaveEndpointTest.AuthorizedRequest/2 (32 ms)
[ RUN      ] Endpoint/SlaveEndpointTest.UnauthorizedRequest/0
I0714 20:16:11.920179 28463 containerizer.cpp:196] Using isolation: posix/cpu,posix/mem,filesystem/posix,network/cni
W0714 20:16:11.929246 28463 backend.cpp:75] Failed to create 'aufs' backend: AufsBackend requires
root privileges, but is running as user mesos
W0714 20:16:11.929414 28463 backend.cpp:75] Failed to create 'bind' backend: BindBackend requires
root privileges
I0714 20:16:11.932543 28492 slave.cpp:205] Agent started on 564)@172.17.0.2:54905
I0714 20:16:11.932567 28492 slave.cpp:206] Flags at startup: --acls="" --appc_simple_discovery_uri_prefix="http://"
--appc_store_dir="/tmp/mesos/store/appc" --authenticate_http="true" --authenticatee="crammd5"
--authentication_backoff_factor="1secs" --authorizer="local" --cgroups_cpu_enable_pids_and_tids_count="false"
--cgroups_enable_cfs="false" --cgroups_hierarchy="/sys/fs/cgroup" --cgroups_limit_swap="false"
--cgroups_root="mesos" --container_disk_watch_interval="15secs" --containerizers="mesos" --credential="/tmp/Endpoint_SlaveEndpointTest_UnauthorizedRequest_0_YN8nIt/credential"
--default_role="*" --disk_watch_interval="1mins" --docker="docker" --docker_kill_orphans="true"
--docker_registry="https://registry-1.docker.io" --docker_remove_delay="6hrs" --docker_socket="/var/run/docker.sock"
--docker_stop_timeout="0ns" --docker_store_dir="/tmp/mesos/store/docker" --docker_volume_checkpoint_dir="/var/run/mesos/isolators/docker/volume"
--enforce_container_disk_quota="false" --executor_registration_timeout="1mins" --executor_shutdown_grace_period="5secs"
--fetcher_cache_dir="/tmp/Endpoint_SlaveEndpointTest_UnauthorizedRequest_0_YN8nIt/fetch" --fetcher_cache_size="2GB"
--frameworks_home="" --gc_delay="1weeks" --gc_disk_headroom="0.1" --hadoop_home="" --help="false"
--hostname_lookup="true" --http_authenticators="basic" --http_command_executor="false" --http_credentials="/tmp/Endpoint_SlaveEndpointTest_UnauthorizedRequest_0_YN8nIt/http_credentials"
--image_provisioner_backend="copy" --initialize_driver_logging="true" --isolation="posix/cpu,posix/mem"
--launcher_dir="/mesos/mesos-1.1.0/_build/src" --logbufsecs="0" --logging_level="INFO" --oversubscribed_resources_interval="15secs"
--perf_duration="10secs" --perf_interval="1mins" --qos_correction_interval_min="0ns" --quiet="false"
--recover="reconnect" --recovery_timeout="15mins" --registration_backoff_factor="10ms" --resources="cpus:2;gpus:0;mem:1024;disk:1024;ports:[31000-32000]"
--revocable_cpu_low_priority="true" --sandbox_directory="/mnt/mesos/sandbox" --strict="true"
--switch_user="true" --systemd_enable_support="true" --systemd_runtime_directory="/run/systemd/system"
--version="false" --work_dir="/tmp/Endpoint_SlaveEndpointTest_UnauthorizedRequest_0_YN8nIt"
I0714 20:16:11.932967 28492 credentials.hpp:86] Loading credential for authentication from
'/tmp/Endpoint_SlaveEndpointTest_UnauthorizedRequest_0_YN8nIt/credential'
I0714 20:16:11.933128 28492 slave.cpp:343] Agent using credential for: test-principal
I0714 20:16:11.933164 28492 credentials.hpp:37] Loading credentials for authentication from
'/tmp/Endpoint_SlaveEndpointTest_UnauthorizedRequest_0_YN8nIt/http_credentials'
I0714 20:16:11.933511 28492 slave.cpp:395] Using default 'basic' HTTP authenticator
I0714 20:16:11.933790 28492 resources.cpp:572] Parsing resources as JSON failed: cpus:2;gpus:0;mem:1024;disk:1024;ports:[31000-32000]
Trying semicolon-delimited string format instead
I0714 20:16:11.934114 28492 resources.cpp:572] Parsing resources as JSON failed: cpus:2;gpus:0;mem:1024;disk:1024;ports:[31000-32000]
Trying semicolon-delimited string format instead
I0714 20:16:11.934649 28492 slave.cpp:594] Agent resources: cpus(*):2; mem(*):1024; disk(*):1024;
ports(*):[31000-32000]
I0714 20:16:11.934710 28492 slave.cpp:602] Agent attributes: [  ]
I0714 20:16:11.934727 28492 slave.cpp:607] Agent hostname: a237b64d5c9e
I0714 20:16:11.936034 28491 state.cpp:57] Recovering state from '/tmp/Endpoint_SlaveEndpointTest_UnauthorizedRequest_0_YN8nIt/meta'
I0714 20:16:11.936116 28492 process.cpp:3354] Handling HTTP event for process 'slave(564)'
with path: '/slave(564)/monitor/statistics'
I0714 20:16:11.936601 28491 status_update_manager.cpp:200] Recovering status update manager
I0714 20:16:11.936749 28483 containerizer.cpp:522] Recovering containerizer
I0714 20:16:11.937079 28486 http.cpp:829] Authorizing principal 'test-principal' to GET the
'/monitor/statistics' endpoint
I0714 20:16:11.937983 28491 provisioner.cpp:253] Provisioner recovery complete
I0714 20:16:11.938391 28489 slave.cpp:4856] Finished recovery
I0714 20:16:11.939100 28489 slave.cpp:5028] Querying resource estimator for oversubscribable
resources
I0714 20:16:11.939357 28495 slave.cpp:5042] Received oversubscribable resources  from the
resource estimator
I0714 20:16:11.939712 28494 slave.cpp:841] Agent terminating
[       OK ] Endpoint/SlaveEndpointTest.UnauthorizedRequest/0 (29 ms)
[ RUN      ] Endpoint/SlaveEndpointTest.UnauthorizedRequest/1
I0714 20:16:11.951053 28463 containerizer.cpp:196] Using isolation: posix/cpu,posix/mem,filesystem/posix,network/cni
W0714 20:16:11.951948 28463 backend.cpp:75] Failed to create 'aufs' backend: AufsBackend requires
root privileges, but is running as user mesos
W0714 20:16:11.952162 28463 backend.cpp:75] Failed to create 'bind' backend: BindBackend requires
root privileges
I0714 20:16:11.955484 28493 slave.cpp:205] Agent started on 565)@172.17.0.2:54905
I0714 20:16:11.955507 28493 slave.cpp:206] Flags at startup: --acls="" --appc_simple_discovery_uri_prefix="http://"
--appc_store_dir="/tmp/mesos/store/appc" --authenticate_http="true" --authenticatee="crammd5"
--authentication_backoff_factor="1secs" --authorizer="local" --cgroups_cpu_enable_pids_and_tids_count="false"
--cgroups_enable_cfs="false" --cgroups_hierarchy="/sys/fs/cgroup" --cgroups_limit_swap="false"
--cgroups_root="mesos" --container_disk_watch_interval="15secs" --containerizers="mesos" --credential="/tmp/Endpoint_SlaveEndpointTest_UnauthorizedRequest_1_Blcu7r/credential"
--default_role="*" --disk_watch_interval="1mins" --docker="docker" --docker_kill_orphans="true"
--docker_registry="https://registry-1.docker.io" --docker_remove_delay="6hrs" --docker_socket="/var/run/docker.sock"
--docker_stop_timeout="0ns" --docker_store_dir="/tmp/mesos/store/docker" --docker_volume_checkpoint_dir="/var/run/mesos/isolators/docker/volume"
--enforce_container_disk_quota="false" --executor_registration_timeout="1mins" --executor_shutdown_grace_period="5secs"
--fetcher_cache_dir="/tmp/Endpoint_SlaveEndpointTest_UnauthorizedRequest_1_Blcu7r/fetch" --fetcher_cache_size="2GB"
--frameworks_home="" --gc_delay="1weeks" --gc_disk_headroom="0.1" --hadoop_home="" --help="false"
--hostname_lookup="true" --http_authenticators="basic" --http_command_executor="false" --http_credentials="/tmp/Endpoint_SlaveEndpointTest_UnauthorizedRequest_1_Blcu7r/http_credentials"
--image_provisioner_backend="copy" --initialize_driver_logging="true" --isolation="posix/cpu,posix/mem"
--launcher_dir="/mesos/mesos-1.1.0/_build/src" --logbufsecs="0" --logging_level="INFO" --oversubscribed_resources_interval="15secs"
--perf_duration="10secs" --perf_interval="1mins" --qos_correction_interval_min="0ns" --quiet="false"
--recover="reconnect" --recovery_timeout="15mins" --registration_backoff_factor="10ms" --resources="cpus:2;gpus:0;mem:1024;disk:1024;ports:[31000-32000]"
--revocable_cpu_low_priority="true" --sandbox_directory="/mnt/mesos/sandbox" --strict="true"
--switch_user="true" --systemd_enable_support="true" --systemd_runtime_directory="/run/systemd/system"
--version="false" --work_dir="/tmp/Endpoint_SlaveEndpointTest_UnauthorizedRequest_1_Blcu7r"
I0714 20:16:11.955946 28493 credentials.hpp:86] Loading credential for authentication from
'/tmp/Endpoint_SlaveEndpointTest_UnauthorizedRequest_1_Blcu7r/credential'
I0714 20:16:11.975222 28493 slave.cpp:343] Agent using credential for: test-principal
I0714 20:16:11.975294 28493 credentials.hpp:37] Loading credentials for authentication from
'/tmp/Endpoint_SlaveEndpointTest_UnauthorizedRequest_1_Blcu7r/http_credentials'
I0714 20:16:11.975672 28493 slave.cpp:395] Using default 'basic' HTTP authenticator
I0714 20:16:11.976219 28493 resources.cpp:572] Parsing resources as JSON failed: cpus:2;gpus:0;mem:1024;disk:1024;ports:[31000-32000]
Trying semicolon-delimited string format instead
I0714 20:16:11.976768 28493 resources.cpp:572] Parsing resources as JSON failed: cpus:2;gpus:0;mem:1024;disk:1024;ports:[31000-32000]
Trying semicolon-delimited string format instead
I0714 20:16:11.977263 28493 slave.cpp:594] Agent resources: cpus(*):2; mem(*):1024; disk(*):1024;
ports(*):[31000-32000]
I0714 20:16:11.977341 28493 slave.cpp:602] Agent attributes: [  ]
I0714 20:16:11.977356 28493 slave.cpp:607] Agent hostname: a237b64d5c9e
I0714 20:16:11.979158 28489 state.cpp:57] Recovering state from '/tmp/Endpoint_SlaveEndpointTest_UnauthorizedRequest_1_Blcu7r/meta'
I0714 20:16:11.979250 28493 process.cpp:3354] Handling HTTP event for process 'slave(565)'
with path: '/slave(565)/monitor/statistics.json'
I0714 20:16:11.979866 28497 status_update_manager.cpp:200] Recovering status update manager
I0714 20:16:11.980147 28483 containerizer.cpp:522] Recovering containerizer
I0714 20:16:11.980514 28488 http.cpp:829] Authorizing principal 'test-principal' to GET the
'/monitor/statistics.json' endpoint
I0714 20:16:11.981884 28495 provisioner.cpp:253] Provisioner recovery complete
I0714 20:16:11.982221 28493 slave.cpp:4856] Finished recovery
I0714 20:16:11.982933 28493 slave.cpp:5028] Querying resource estimator for oversubscribable
resources
I0714 20:16:11.983243 28482 slave.cpp:5042] Received oversubscribable resources  from the
resource estimator
I0714 20:16:11.983603 28495 slave.cpp:841] Agent terminating
[       OK ] Endpoint/SlaveEndpointTest.UnauthorizedRequest/1 (42 ms)
[ RUN      ] Endpoint/SlaveEndpointTest.UnauthorizedRequest/2
I0714 20:16:12.003526 28463 containerizer.cpp:196] Using isolation: posix/cpu,posix/mem,filesystem/posix,network/cni
W0714 20:16:12.022403 28463 backend.cpp:75] Failed to create 'aufs' backend: AufsBackend requires
root privileges, but is running as user mesos
W0714 20:16:12.022703 28463 backend.cpp:75] Failed to create 'bind' backend: BindBackend requires
root privileges
I0714 20:16:12.027868 28482 slave.cpp:205] Agent started on 566)@172.17.0.2:54905
I0714 20:16:12.028025 28482 slave.cpp:206] Flags at startup: --acls="" --appc_simple_discovery_uri_prefix="http://"
--appc_store_dir="/tmp/mesos/store/appc" --authenticate_http="true" --authenticatee="crammd5"
--authentication_backoff_factor="1secs" --authorizer="local" --cgroups_cpu_enable_pids_and_tids_count="false"
--cgroups_enable_cfs="false" --cgroups_hierarchy="/sys/fs/cgroup" --cgroups_limit_swap="false"
--cgroups_root="mesos" --container_disk_watch_interval="15secs" --containerizers="mesos" --credential="/tmp/Endpoint_SlaveEndpointTest_UnauthorizedRequest_2_Jz6JUq/credential"
--default_role="*" --disk_watch_interval="1mins" --docker="docker" --docker_kill_orphans="true"
--docker_registry="https://registry-1.docker.io" --docker_remove_delay="6hrs" --docker_socket="/var/run/docker.sock"
--docker_stop_timeout="0ns" --docker_store_dir="/tmp/mesos/store/docker" --docker_volume_checkpoint_dir="/var/run/mesos/isolators/docker/volume"
--enforce_container_disk_quota="false" --executor_registration_timeout="1mins" --executor_shutdown_grace_period="5secs"
--fetcher_cache_dir="/tmp/Endpoint_SlaveEndpointTest_UnauthorizedRequest_2_Jz6JUq/fetch" --fetcher_cache_size="2GB"
--frameworks_home="" --gc_delay="1weeks" --gc_disk_headroom="0.1" --hadoop_home="" --help="false"
--hostname_lookup="true" --http_authenticators="basic" --http_command_executor="false" --http_credentials="/tmp/Endpoint_SlaveEndpointTest_UnauthorizedRequest_2_Jz6JUq/http_credentials"
--image_provisioner_backend="copy" --initialize_driver_logging="true" --isolation="posix/cpu,posix/mem"
--launcher_dir="/mesos/mesos-1.1.0/_build/src" --logbufsecs="0" --logging_level="INFO" --oversubscribed_resources_interval="15secs"
--perf_duration="10secs" --perf_interval="1mins" --qos_correction_interval_min="0ns" --quiet="false"
--recover="reconnect" --recovery_timeout="15mins" --registration_backoff_factor="10ms" --resources="cpus:2;gpus:0;mem:1024;disk:1024;ports:[31000-32000]"
--revocable_cpu_low_priority="true" --sandbox_directory="/mnt/mesos/sandbox" --strict="true"
--switch_user="true" --systemd_enable_support="true" --systemd_runtime_directory="/run/systemd/system"
--version="false" --work_dir="/tmp/Endpoint_SlaveEndpointTest_UnauthorizedRequest_2_Jz6JUq"
I0714 20:16:12.029114 28482 credentials.hpp:86] Loading credential for authentication from
'/tmp/Endpoint_SlaveEndpointTest_UnauthorizedRequest_2_Jz6JUq/credential'
I0714 20:16:12.029517 28482 slave.cpp:343] Agent using credential for: test-principal
I0714 20:16:12.029664 28482 credentials.hpp:37] Loading credentials for authentication from
'/tmp/Endpoint_SlaveEndpointTest_UnauthorizedRequest_2_Jz6JUq/http_credentials'
I0714 20:16:12.030130 28482 slave.cpp:395] Using default 'basic' HTTP authenticator
I0714 20:16:12.030777 28482 resources.cpp:572] Parsing resources as JSON failed: cpus:2;gpus:0;mem:1024;disk:1024;ports:[31000-32000]
Trying semicolon-delimited string format instead
I0714 20:16:12.031286 28482 resources.cpp:572] Parsing resources as JSON failed: cpus:2;gpus:0;mem:1024;disk:1024;ports:[31000-32000]
Trying semicolon-delimited string format instead
I0714 20:16:12.031818 28482 slave.cpp:594] Agent resources: cpus(*):2; mem(*):1024; disk(*):1024;
ports(*):[31000-32000]
I0714 20:16:12.031901 28482 slave.cpp:602] Agent attributes: [  ]
I0714 20:16:12.031925 28482 slave.cpp:607] Agent hostname: a237b64d5c9e
I0714 20:16:12.033571 28492 state.cpp:57] Recovering state from '/tmp/Endpoint_SlaveEndpointTest_UnauthorizedRequest_2_Jz6JUq/meta'
I0714 20:16:12.033659 28482 process.cpp:3354] Handling HTTP event for process 'slave(566)'
with path: '/slave(566)/containers'
I0714 20:16:12.034310 28494 status_update_manager.cpp:200] Recovering status update manager
I0714 20:16:12.034596 28483 containerizer.cpp:522] Recovering containerizer
I0714 20:16:12.034688 28482 http.cpp:829] Authorizing principal 'test-principal' to GET the
'/containers' endpoint
I0714 20:16:12.035807 28492 provisioner.cpp:253] Provisioner recovery complete
I0714 20:16:12.036254 28486 slave.cpp:4856] Finished recovery
I0714 20:16:12.036852 28486 slave.cpp:5028] Querying resource estimator for oversubscribable
resources
I0714 20:16:12.036981 28486 slave.cpp:841] Agent terminating
[       OK ] Endpoint/SlaveEndpointTest.UnauthorizedRequest/2 (43 ms)
[ RUN      ] Endpoint/SlaveEndpointTest.NoAuthorizer/0
I0714 20:16:12.056233 28463 containerizer.cpp:196] Using isolation: posix/cpu,posix/mem,filesystem/posix,network/cni
W0714 20:16:12.057032 28463 backend.cpp:75] Failed to create 'aufs' backend: AufsBackend requires
root privileges, but is running as user mesos
W0714 20:16:12.057188 28463 backend.cpp:75] Failed to create 'bind' backend: BindBackend requires
root privileges
I0714 20:16:12.058737 28463 cluster.cpp:432] Creating default 'local' authorizer
I0714 20:16:12.061036 28482 slave.cpp:205] Agent started on 567)@172.17.0.2:54905
I0714 20:16:12.061069 28482 slave.cpp:206] Flags at startup: --acls="" --appc_simple_discovery_uri_prefix="http://"
--appc_store_dir="/tmp/mesos/store/appc" --authenticate_http="true" --authenticatee="crammd5"
--authentication_backoff_factor="1secs" --authorizer="local" --cgroups_cpu_enable_pids_and_tids_count="false"
--cgroups_enable_cfs="false" --cgroups_hierarchy="/sys/fs/cgroup" --cgroups_limit_swap="false"
--cgroups_root="mesos" --container_disk_watch_interval="15secs" --containerizers="mesos" --credential="/tmp/Endpoint_SlaveEndpointTest_NoAuthorizer_0_63kU7p/credential"
--default_role="*" --disk_watch_interval="1mins" --docker="docker" --docker_kill_orphans="true"
--docker_registry="https://registry-1.docker.io" --docker_remove_delay="6hrs" --docker_socket="/var/run/docker.sock"
--docker_stop_timeout="0ns" --docker_store_dir="/tmp/mesos/store/docker" --docker_volume_checkpoint_dir="/var/run/mesos/isolators/docker/volume"
--enforce_container_disk_quota="false" --executor_registration_timeout="1mins" --executor_shutdown_grace_period="5secs"
--fetcher_cache_dir="/tmp/Endpoint_SlaveEndpointTest_NoAuthorizer_0_63kU7p/fetch" --fetcher_cache_size="2GB"
--frameworks_home="" --gc_delay="1weeks" --gc_disk_headroom="0.1" --hadoop_home="" --help="false"
--hostname_lookup="true" --http_authenticators="basic" --http_command_executor="false" --http_credentials="/tmp/Endpoint_SlaveEndpointTest_NoAuthorizer_0_63kU7p/http_credentials"
--image_provisioner_backend="copy" --initialize_driver_logging="true" --isolation="posix/cpu,posix/mem"
--launcher_dir="/mesos/mesos-1.1.0/_build/src" --logbufsecs="0" --logging_level="INFO" --oversubscribed_resources_interval="15secs"
--perf_duration="10secs" --perf_interval="1mins" --qos_correction_interval_min="0ns" --quiet="false"
--recover="reconnect" --recovery_timeout="15mins" --registration_backoff_factor="10ms" --resources="cpus:2;gpus:0;mem:1024;disk:1024;ports:[31000-32000]"
--revocable_cpu_low_priority="true" --sandbox_directory="/mnt/mesos/sandbox" --strict="true"
--switch_user="true" --systemd_enable_support="true" --systemd_runtime_directory="/run/systemd/system"
--version="false" --work_dir="/tmp/Endpoint_SlaveEndpointTest_NoAuthorizer_0_63kU7p"
I0714 20:16:12.061858 28482 credentials.hpp:86] Loading credential for authentication from
'/tmp/Endpoint_SlaveEndpointTest_NoAuthorizer_0_63kU7p/credential'
I0714 20:16:12.062134 28482 slave.cpp:343] Agent using credential for: test-principal
I0714 20:16:12.062172 28482 credentials.hpp:37] Loading credentials for authentication from
'/tmp/Endpoint_SlaveEndpointTest_NoAuthorizer_0_63kU7p/http_credentials'
I0714 20:16:12.062516 28482 slave.cpp:395] Using default 'basic' HTTP authenticator
I0714 20:16:12.062834 28482 resources.cpp:572] Parsing resources as JSON failed: cpus:2;gpus:0;mem:1024;disk:1024;ports:[31000-32000]
Trying semicolon-delimited string format instead
I0714 20:16:12.063479 28482 resources.cpp:572] Parsing resources as JSON failed: cpus:2;gpus:0;mem:1024;disk:1024;ports:[31000-32000]
Trying semicolon-delimited string format instead
I0714 20:16:12.064177 28482 slave.cpp:594] Agent resources: cpus(*):2; mem(*):1024; disk(*):1024;
ports(*):[31000-32000]
I0714 20:16:12.064265 28482 slave.cpp:602] Agent attributes: [  ]
I0714 20:16:12.064281 28482 slave.cpp:607] Agent hostname: a237b64d5c9e
I0714 20:16:12.066007 28487 state.cpp:57] Recovering state from '/tmp/Endpoint_SlaveEndpointTest_NoAuthorizer_0_63kU7p/meta'
I0714 20:16:12.066084 28482 process.cpp:3354] Handling HTTP event for process 'slave(567)'
with path: '/slave(567)/monitor/statistics'
I0714 20:16:12.067718 28489 status_update_manager.cpp:200] Recovering status update manager
I0714 20:16:12.067991 28488 containerizer.cpp:522] Recovering containerizer
I0714 20:16:12.068138 28493 http.cpp:829] Authorizing principal 'test-principal' to GET the
'/monitor/statistics' endpoint
I0714 20:16:12.070564 28497 provisioner.cpp:253] Provisioner recovery complete
I0714 20:16:12.070801 28493 slave.cpp:4856] Finished recovery
I0714 20:16:12.071410 28493 slave.cpp:5028] Querying resource estimator for oversubscribable
resources
I0714 20:16:12.071739 28489 slave.cpp:5042] Received oversubscribable resources  from the
resource estimator
I0714 20:16:12.072712 28463 slave.cpp:841] Agent terminating
[       OK ] Endpoint/SlaveEndpointTest.NoAuthorizer/0 (26 ms)
[ RUN      ] Endpoint/SlaveEndpointTest.NoAuthorizer/1
I0714 20:16:12.091380 28463 containerizer.cpp:196] Using isolation: posix/cpu,posix/mem,filesystem/posix,network/cni
W0714 20:16:12.092110 28463 backend.cpp:75] Failed to create 'aufs' backend: AufsBackend requires
root privileges, but is running as user mesos
W0714 20:16:12.092281 28463 backend.cpp:75] Failed to create 'bind' backend: BindBackend requires
root privileges
I0714 20:16:12.093793 28463 cluster.cpp:432] Creating default 'local' authorizer
I0714 20:16:12.095476 28497 slave.cpp:205] Agent started on 568)@172.17.0.2:54905
I0714 20:16:12.095502 28497 slave.cpp:206] Flags at startup: --acls="" --appc_simple_discovery_uri_prefix="http://"
--appc_store_dir="/tmp/mesos/store/appc" --authenticate_http="true" --authenticatee="crammd5"
--authentication_backoff_factor="1secs" --authorizer="local" --cgroups_cpu_enable_pids_and_tids_count="false"
--cgroups_enable_cfs="false" --cgroups_hierarchy="/sys/fs/cgroup" --cgroups_limit_swap="false"
--cgroups_root="mesos" --container_disk_watch_interval="15secs" --containerizers="mesos" --credential="/tmp/Endpoint_SlaveEndpointTest_NoAuthorizer_1_G7kdCp/credential"
--default_role="*" --disk_watch_interval="1mins" --docker="docker" --docker_kill_orphans="true"
--docker_registry="https://registry-1.docker.io" --docker_remove_delay="6hrs" --docker_socket="/var/run/docker.sock"
--docker_stop_timeout="0ns" --docker_store_dir="/tmp/mesos/store/docker" --docker_volume_checkpoint_dir="/var/run/mesos/isolators/docker/volume"
--enforce_container_disk_quota="false" --executor_registration_timeout="1mins" --executor_shutdown_grace_period="5secs"
--fetcher_cache_dir="/tmp/Endpoint_SlaveEndpointTest_NoAuthorizer_1_G7kdCp/fetch" --fetcher_cache_size="2GB"
--frameworks_home="" --gc_delay="1weeks" --gc_disk_headroom="0.1" --hadoop_home="" --help="false"
--hostname_lookup="true" --http_authenticators="basic" --http_command_executor="false" --http_credentials="/tmp/Endpoint_SlaveEndpointTest_NoAuthorizer_1_G7kdCp/http_credentials"
--image_provisioner_backend="copy" --initialize_driver_logging="true" --isolation="posix/cpu,posix/mem"
--launcher_dir="/mesos/mesos-1.1.0/_build/src" --logbufsecs="0" --logging_level="INFO" --oversubscribed_resources_interval="15secs"
--perf_duration="10secs" --perf_interval="1mins" --qos_correction_interval_min="0ns" --quiet="false"
--recover="reconnect" --recovery_timeout="15mins" --registration_backoff_factor="10ms" --resources="cpus:2;gpus:0;mem:1024;disk:1024;ports:[31000-32000]"
--revocable_cpu_low_priority="true" --sandbox_directory="/mnt/mesos/sandbox" --strict="true"
--switch_user="true" --systemd_enable_support="true" --systemd_runtime_directory="/run/systemd/system"
--version="false" --work_dir="/tmp/Endpoint_SlaveEndpointTest_NoAuthorizer_1_G7kdCp"
I0714 20:16:12.096168 28497 credentials.hpp:86] Loading credential for authentication from
'/tmp/Endpoint_SlaveEndpointTest_NoAuthorizer_1_G7kdCp/credential'
I0714 20:16:12.096377 28497 slave.cpp:343] Agent using credential for: test-principal
I0714 20:16:12.096413 28497 credentials.hpp:37] Loading credentials for authentication from
'/tmp/Endpoint_SlaveEndpointTest_NoAuthorizer_1_G7kdCp/http_credentials'
I0714 20:16:12.096786 28497 slave.cpp:395] Using default 'basic' HTTP authenticator
I0714 20:16:12.097179 28497 resources.cpp:572] Parsing resources as JSON failed: cpus:2;gpus:0;mem:1024;disk:1024;ports:[31000-32000]
Trying semicolon-delimited string format instead
I0714 20:16:12.097620 28497 resources.cpp:572] Parsing resources as JSON failed: cpus:2;gpus:0;mem:1024;disk:1024;ports:[31000-32000]
Trying semicolon-delimited string format instead
I0714 20:16:12.098140 28497 slave.cpp:594] Agent resources: cpus(*):2; mem(*):1024; disk(*):1024;
ports(*):[31000-32000]
I0714 20:16:12.098218 28497 slave.cpp:602] Agent attributes: [  ]
I0714 20:16:12.098234 28497 slave.cpp:607] Agent hostname: a237b64d5c9e
I0714 20:16:12.100112 28494 state.cpp:57] Recovering state from '/tmp/Endpoint_SlaveEndpointTest_NoAuthorizer_1_G7kdCp/meta'
I0714 20:16:12.100201 28497 process.cpp:3354] Handling HTTP event for process 'slave(568)'
with path: '/slave(568)/monitor/statistics.json'
I0714 20:16:12.100762 28489 status_update_manager.cpp:200] Recovering status update manager
I0714 20:16:12.100905 28489 containerizer.cpp:522] Recovering containerizer
I0714 20:16:12.101327 28497 http.cpp:829] Authorizing principal 'test-principal' to GET the
'/monitor/statistics.json' endpoint
I0714 20:16:12.102085 28489 provisioner.cpp:253] Provisioner recovery complete
I0714 20:16:12.103520 28488 slave.cpp:4856] Finished recovery
I0714 20:16:12.104140 28488 slave.cpp:5028] Querying resource estimator for oversubscribable
resources
I0714 20:16:12.104351 28482 slave.cpp:5042] Received oversubscribable resources  from the
resource estimator
I0714 20:16:12.105547 28483 slave.cpp:841] Agent terminating
[       OK ] Endpoint/SlaveEndpointTest.NoAuthorizer/1 (23 ms)
[ RUN      ] Endpoint/SlaveEndpointTest.NoAuthorizer/2
I0714 20:16:12.114464 28463 containerizer.cpp:196] Using isolation: posix/cpu,posix/mem,filesystem/posix,network/cni
W0714 20:16:12.115309 28463 backend.cpp:75] Failed to create 'aufs' backend: AufsBackend requires
root privileges, but is running as user mesos
W0714 20:16:12.115486 28463 backend.cpp:75] Failed to create 'bind' backend: BindBackend requires
root privileges
I0714 20:16:12.117100 28463 cluster.cpp:432] Creating default 'local' authorizer
I0714 20:16:12.119349 28486 slave.cpp:205] Agent started on 569)@172.17.0.2:54905
I0714 20:16:12.119374 28486 slave.cpp:206] Flags at startup: --acls="" --appc_simple_discovery_uri_prefix="http://"
--appc_store_dir="/tmp/mesos/store/appc" --authenticate_http="true" --authenticatee="crammd5"
--authentication_backoff_factor="1secs" --authorizer="local" --cgroups_cpu_enable_pids_and_tids_count="false"
--cgroups_enable_cfs="false" --cgroups_hierarchy="/sys/fs/cgroup" --cgroups_limit_swap="false"
--cgroups_root="mesos" --container_disk_watch_interval="15secs" --containerizers="mesos" --credential="/tmp/Endpoint_SlaveEndpointTest_NoAuthorizer_2_7eRljp/credential"
--default_role="*" --disk_watch_interval="1mins" --docker="docker" --docker_kill_orphans="true"
--docker_registry="https://registry-1.docker.io" --docker_remove_delay="6hrs" --docker_socket="/var/run/docker.sock"
--docker_stop_timeout="0ns" --docker_store_dir="/tmp/mesos/store/docker" --docker_volume_checkpoint_dir="/var/run/mesos/isolators/docker/volume"
--enforce_container_disk_quota="false" --executor_registration_timeout="1mins" --executor_shutdown_grace_period="5secs"
--fetcher_cache_dir="/tmp/Endpoint_SlaveEndpointTest_NoAuthorizer_2_7eRljp/fetch" --fetcher_cache_size="2GB"
--frameworks_home="" --gc_delay="1weeks" --gc_disk_headroom="0.1" --hadoop_home="" --help="false"
--hostname_lookup="true" --http_authenticators="basic" --http_command_executor="false" --http_credentials="/tmp/Endpoint_SlaveEndpointTest_NoAuthorizer_2_7eRljp/http_credentials"
--image_provisioner_backend="copy" --initialize_driver_logging="true" --isolation="posix/cpu,posix/mem"
--launcher_dir="/mesos/mesos-1.1.0/_build/src" --logbufsecs="0" --logging_level="INFO" --oversubscribed_resources_interval="15secs"
--perf_duration="10secs" --perf_interval="1mins" --qos_correction_interval_min="0ns" --quiet="false"
--recover="reconnect" --recovery_timeout="15mins" --registration_backoff_factor="10ms" --resources="cpus:2;gpus:0;mem:1024;disk:1024;ports:[31000-32000]"
--revocable_cpu_low_priority="true" --sandbox_directory="/mnt/mesos/sandbox" --strict="true"
--switch_user="true" --systemd_enable_support="true" --systemd_runtime_directory="/run/systemd/system"
--version="false" --work_dir="/tmp/Endpoint_SlaveEndpointTest_NoAuthorizer_2_7eRljp"
I0714 20:16:12.119884 28486 credentials.hpp:86] Loading credential for authentication from
'/tmp/Endpoint_SlaveEndpointTest_NoAuthorizer_2_7eRljp/credential'
I0714 20:16:12.131722 28486 slave.cpp:343] Agent using credential for: test-principal
I0714 20:16:12.131793 28486 credentials.hpp:37] Loading credentials for authentication from
'/tmp/Endpoint_SlaveEndpointTest_NoAuthorizer_2_7eRljp/http_credentials'
I0714 20:16:12.132150 28486 slave.cpp:395] Using default 'basic' HTTP authenticator
I0714 20:16:12.132987 28486 resources.cpp:572] Parsing resources as JSON failed: cpus:2;gpus:0;mem:1024;disk:1024;ports:[31000-32000]
Trying semicolon-delimited string format instead
I0714 20:16:12.133401 28486 resources.cpp:572] Parsing resources as JSON failed: cpus:2;gpus:0;mem:1024;disk:1024;ports:[31000-32000]
Trying semicolon-delimited string format instead
I0714 20:16:12.133833 28486 slave.cpp:594] Agent resources: cpus(*):2; mem(*):1024; disk(*):1024;
ports(*):[31000-32000]
I0714 20:16:12.133901 28486 slave.cpp:602] Agent attributes: [  ]
I0714 20:16:12.133921 28486 slave.cpp:607] Agent hostname: a237b64d5c9e
I0714 20:16:12.135931 28496 state.cpp:57] Recovering state from '/tmp/Endpoint_SlaveEndpointTest_NoAuthorizer_2_7eRljp/meta'
I0714 20:16:12.136060 28486 process.cpp:3354] Handling HTTP event for process 'slave(569)'
with path: '/slave(569)/containers'
I0714 20:16:12.136703 28488 status_update_manager.cpp:200] Recovering status update manager
I0714 20:16:12.136901 28487 containerizer.cpp:522] Recovering containerizer
I0714 20:16:12.137035 28496 http.cpp:829] Authorizing principal 'test-principal' to GET the
'/containers' endpoint
I0714 20:16:12.138173 28490 provisioner.cpp:253] Provisioner recovery complete
I0714 20:16:12.138447 28497 slave.cpp:4856] Finished recovery
I0714 20:16:12.138979 28497 slave.cpp:5028] Querying resource estimator for oversubscribable
resources
I0714 20:16:12.139237 28495 slave.cpp:5042] Received oversubscribable resources  from the
resource estimator
I0714 20:16:12.140338 28484 slave.cpp:841] Agent terminating
[       OK ] Endpoint/SlaveEndpointTest.NoAuthorizer/2 (36 ms)
[----------] 9 tests from Endpoint/SlaveEndpointTest (435 ms total)

[----------] Global test environment tear-down
[==========] 1256 tests from 139 test cases ran. (983326 ms total)
[  PASSED  ] 1255 tests.
[  FAILED  ] 1 test, listed below:
[  FAILED  ] ContentType/AgentAPITest.GetState/0, where GetParam() = application/x-protobuf

 1 FAILED TEST
  YOU HAVE 6 DISABLED TESTS

make[4]: *** [check-local] Error 1
make[4]: Leaving directory `/mesos/mesos-1.1.0/_build/src'
make[3]: *** [check-am] Error 2
make[3]: Leaving directory `/mesos/mesos-1.1.0/_build/src'
make[2]: *** [check] Error 2
make[2]: Leaving directory `/mesos/mesos-1.1.0/_build/src'
make[1]: *** [check-recursive] Error 1
make[1]: Leaving directory `/mesos/mesos-1.1.0/_build'
make: *** [distcheck] Error 1
+ docker rmi mesos-1468524237-23776
Untagged: mesos-1468524237-23776:latest
Deleted: 2e91507323d877c2ba5c3c17eeb4bd282a25b3b51b69416c53ffb2cb6692fca0
Deleted: e157ae7645885802cb0e676e4940288e77ffc0fa6e39a86cb4e0f103f3410899
Deleted: 14ab7b8613cf792cb8e53c767a15c97aff92ec1d23c5af006461fc7c7069d880
Deleted: 545f9b467280883dfb9634cc8ff1f7f0848ec6e6857515ed82c6a5f05963037c
Deleted: 5d58bb9a4794f97f2ccc3a54119d78f24328e78d3aac5fb4a2a95d267a76e5cd
Deleted: 8f6347d3d01ca6f86b82fb5b679b65d3a39d91824415bad5436ed23c6a05b526
Deleted: 13f8f58b023f12a7f3d079cc7015e47b3d99384ca13f50f71dcf8e6058e8798d
Deleted: 720f9df833485201e106adb4c1c31e1fb5373ad5ff2398a3bd53be6ab62e6d8e
Deleted: bb11b0e2acca577ed664521bacd8cab31849f2193c8aa4814eb840d9b1a9030c
Deleted: 9a110f70c7ed82fc6b887f70b225caa7a224343e85f076a1f8c9863b1e0fafd6
Deleted: 4e841f2c5b5c709c83f48e246349a0d0ff1def0c377dbdb9a5ba86a0da6e5373
Deleted: 0257eed91dfea6e6bfa465f4e53cadac27015368ca9e304827c69d1e57a0f28e
Deleted: 296c0f4fe63105d8cd9ba733a873a3a05fb4c75ce506fe93df4814b29d50c7f6
Deleted: ad32799a4b85164bfe57f189f9da98c762b6e71f6c28c63ad4be01ecfef1c99f
Deleted: 3440e6d17eac3f981b18da78cc91d0faed9dac4654d364232119fba008153c4b
Build step 'Execute shell' marked build as failure

Mime
View raw message