mesos-builds mailing list archives

Site index · List index
Message view « Date » · « Thread »
Top « Date » · « Thread »
From Apache Jenkins Server <jenk...@builds.apache.org>
Subject Build failed in Jenkins: Mesos » autotools,gcc,--verbose --enable-libevent --enable-ssl,GLOG_v=1 MESOS_VERBOSE=1,ubuntu:14.04,(docker||Hadoop)&&(!ubuntu-us1)&&(!ubuntu-6) #2473
Date Fri, 08 Jul 2016 14:02:09 GMT
See <https://builds.apache.org/job/Mesos/BUILDTOOL=autotools,COMPILER=gcc,CONFIGURATION=--verbose%20--enable-libevent%20--enable-ssl,ENVIRONMENT=GLOG_v=1%20MESOS_VERBOSE=1,OS=ubuntu%3A14.04,label_exp=(docker%7C%7CHadoop)&&(!ubuntu-us1)&&(!ubuntu-6)/2473/changes>

Changes:

[alexr] Fixed lambda formatting in "slave/http.cpp".

------------------------------------------
[...truncated 201291 lines...]
I0708 14:02:02.770699 29450 state.cpp:57] Recovering state from '/tmp/Endpoint_SlaveEndpointTest_AuthorizedRequest_1_g3vlRW/meta'
I0708 14:02:02.770737 29459 process.cpp:3322] Handling HTTP event for process 'slave(550)'
with path: '/slave(550)/monitor/statistics.json'
I0708 14:02:02.771466 29458 status_update_manager.cpp:200] Recovering status update manager
I0708 14:02:02.771705 29451 containerizer.cpp:522] Recovering containerizer
I0708 14:02:02.772111 29450 http.cpp:829] Authorizing principal 'test-principal' to GET the
'/monitor/statistics.json' endpoint
I0708 14:02:02.773123 29459 provisioner.cpp:253] Provisioner recovery complete
I0708 14:02:02.773777 29450 slave.cpp:4856] Finished recovery
I0708 14:02:02.775141 29450 slave.cpp:5028] Querying resource estimator for oversubscribable
resources
I0708 14:02:02.775586 29450 slave.cpp:5042] Received oversubscribable resources  from the
resource estimator
I0708 14:02:02.776922 29425 slave.cpp:841] Agent terminating
[       OK ] Endpoint/SlaveEndpointTest.AuthorizedRequest/1 (34 ms)
[ RUN      ] Endpoint/SlaveEndpointTest.AuthorizedRequest/2
I0708 14:02:02.788851 29425 containerizer.cpp:196] Using isolation: posix/cpu,posix/mem,filesystem/posix,network/cni
W0708 14:02:02.789995 29425 backend.cpp:75] Failed to create 'aufs' backend: AufsBackend requires
root privileges, but is running as user mesos
W0708 14:02:02.790387 29425 backend.cpp:75] Failed to create 'bind' backend: BindBackend requires
root privileges
I0708 14:02:02.795132 29451 slave.cpp:205] Agent started on 551)@172.17.0.7:42675
I0708 14:02:02.795291 29451 slave.cpp:206] Flags at startup: --acls="" --appc_simple_discovery_uri_prefix="http://"
--appc_store_dir="/tmp/mesos/store/appc" --authenticate_http="true" --authenticatee="crammd5"
--authentication_backoff_factor="1secs" --authorizer="local" --cgroups_cpu_enable_pids_and_tids_count="false"
--cgroups_enable_cfs="false" --cgroups_hierarchy="/sys/fs/cgroup" --cgroups_limit_swap="false"
--cgroups_root="mesos" --container_disk_watch_interval="15secs" --containerizers="mesos" --credential="/tmp/Endpoint_SlaveEndpointTest_AuthorizedRequest_2_NTQjfQ/credential"
--default_role="*" --disk_watch_interval="1mins" --docker="docker" --docker_kill_orphans="true"
--docker_registry="https://registry-1.docker.io" --docker_remove_delay="6hrs" --docker_socket="/var/run/docker.sock"
--docker_stop_timeout="0ns" --docker_store_dir="/tmp/mesos/store/docker" --docker_volume_checkpoint_dir="/var/run/mesos/isolators/docker/volume"
--enforce_container_disk_quota="false" --executor_registration_timeout="1mins" --executor_shutdown_grace_period="5secs"
--fetcher_cache_dir="/tmp/Endpoint_SlaveEndpointTest_AuthorizedRequest_2_NTQjfQ/fetch" --fetcher_cache_size="2GB"
--frameworks_home="" --gc_delay="1weeks" --gc_disk_headroom="0.1" --hadoop_home="" --help="false"
--hostname_lookup="true" --http_authenticators="basic" --http_command_executor="false" --http_credentials="/tmp/Endpoint_SlaveEndpointTest_AuthorizedRequest_2_NTQjfQ/http_credentials"
--image_provisioner_backend="copy" --initialize_driver_logging="true" --isolation="posix/cpu,posix/mem"
--launcher_dir="/mesos/mesos-1.1.0/_build/src" --logbufsecs="0" --logging_level="INFO" --oversubscribed_resources_interval="15secs"
--perf_duration="10secs" --perf_interval="1mins" --qos_correction_interval_min="0ns" --quiet="false"
--recover="reconnect" --recovery_timeout="15mins" --registration_backoff_factor="10ms" --resources="cpus:2;gpus:0;mem:1024;disk:1024;ports:[31000-32000]"
--revocable_cpu_low_priority="true" --sandbox_directory="/mnt/mesos/sandbox" --strict="true"
--switch_user="true" --systemd_enable_support="true" --systemd_runtime_directory="/run/systemd/system"
--version="false" --work_dir="/tmp/Endpoint_SlaveEndpointTest_AuthorizedRequest_2_NTQjfQ"
I0708 14:02:02.796072 29451 credentials.hpp:86] Loading credential for authentication from
'/tmp/Endpoint_SlaveEndpointTest_AuthorizedRequest_2_NTQjfQ/credential'
I0708 14:02:02.796314 29451 slave.cpp:343] Agent using credential for: test-principal
I0708 14:02:02.796448 29451 credentials.hpp:37] Loading credentials for authentication from
'/tmp/Endpoint_SlaveEndpointTest_AuthorizedRequest_2_NTQjfQ/http_credentials'
I0708 14:02:02.796795 29451 slave.cpp:395] Using default 'basic' HTTP authenticator
I0708 14:02:02.797216 29451 resources.cpp:572] Parsing resources as JSON failed: cpus:2;gpus:0;mem:1024;disk:1024;ports:[31000-32000]
Trying semicolon-delimited string format instead
I0708 14:02:02.797698 29451 resources.cpp:572] Parsing resources as JSON failed: cpus:2;gpus:0;mem:1024;disk:1024;ports:[31000-32000]
Trying semicolon-delimited string format instead
I0708 14:02:02.798228 29451 slave.cpp:594] Agent resources: cpus(*):2; mem(*):1024; disk(*):1024;
ports(*):[31000-32000]
I0708 14:02:02.798362 29451 slave.cpp:602] Agent attributes: [  ]
I0708 14:02:02.798471 29451 slave.cpp:607] Agent hostname: 744f8e1eafe4
I0708 14:02:02.800514 29448 state.cpp:57] Recovering state from '/tmp/Endpoint_SlaveEndpointTest_AuthorizedRequest_2_NTQjfQ/meta'
I0708 14:02:02.800405 29451 process.cpp:3322] Handling HTTP event for process 'slave(551)'
with path: '/slave(551)/containers'
I0708 14:02:02.802654 29446 status_update_manager.cpp:200] Recovering status update manager
I0708 14:02:02.803532 29449 containerizer.cpp:522] Recovering containerizer
I0708 14:02:02.806529 29449 provisioner.cpp:253] Provisioner recovery complete
I0708 14:02:02.807261 29451 http.cpp:829] Authorizing principal 'test-principal' to GET the
'/containers' endpoint
I0708 14:02:02.810822 29451 slave.cpp:4856] Finished recovery
I0708 14:02:02.814577 29451 slave.cpp:5028] Querying resource estimator for oversubscribable
resources
I0708 14:02:02.815083 29451 slave.cpp:5042] Received oversubscribable resources  from the
resource estimator
I0708 14:02:02.838518 29450 slave.cpp:841] Agent terminating
[       OK ] Endpoint/SlaveEndpointTest.AuthorizedRequest/2 (68 ms)
[ RUN      ] Endpoint/SlaveEndpointTest.UnauthorizedRequest/0
I0708 14:02:02.866452 29425 containerizer.cpp:196] Using isolation: posix/cpu,posix/mem,filesystem/posix,network/cni
W0708 14:02:02.868554 29425 backend.cpp:75] Failed to create 'aufs' backend: AufsBackend requires
root privileges, but is running as user mesos
W0708 14:02:02.868793 29425 backend.cpp:75] Failed to create 'bind' backend: BindBackend requires
root privileges
I0708 14:02:02.877614 29444 slave.cpp:205] Agent started on 552)@172.17.0.7:42675
I0708 14:02:02.877656 29444 slave.cpp:206] Flags at startup: --acls="" --appc_simple_discovery_uri_prefix="http://"
--appc_store_dir="/tmp/mesos/store/appc" --authenticate_http="true" --authenticatee="crammd5"
--authentication_backoff_factor="1secs" --authorizer="local" --cgroups_cpu_enable_pids_and_tids_count="false"
--cgroups_enable_cfs="false" --cgroups_hierarchy="/sys/fs/cgroup" --cgroups_limit_swap="false"
--cgroups_root="mesos" --container_disk_watch_interval="15secs" --containerizers="mesos" --credential="/tmp/Endpoint_SlaveEndpointTest_UnauthorizedRequest_0_cFp55J/credential"
--default_role="*" --disk_watch_interval="1mins" --docker="docker" --docker_kill_orphans="true"
--docker_registry="https://registry-1.docker.io" --docker_remove_delay="6hrs" --docker_socket="/var/run/docker.sock"
--docker_stop_timeout="0ns" --docker_store_dir="/tmp/mesos/store/docker" --docker_volume_checkpoint_dir="/var/run/mesos/isolators/docker/volume"
--enforce_container_disk_quota="false" --executor_registration_timeout="1mins" --executor_shutdown_grace_period="5secs"
--fetcher_cache_dir="/tmp/Endpoint_SlaveEndpointTest_UnauthorizedRequest_0_cFp55J/fetch" --fetcher_cache_size="2GB"
--frameworks_home="" --gc_delay="1weeks" --gc_disk_headroom="0.1" --hadoop_home="" --help="false"
--hostname_lookup="true" --http_authenticators="basic" --http_command_executor="false" --http_credentials="/tmp/Endpoint_SlaveEndpointTest_UnauthorizedRequest_0_cFp55J/http_credentials"
--image_provisioner_backend="copy" --initialize_driver_logging="true" --isolation="posix/cpu,posix/mem"
--launcher_dir="/mesos/mesos-1.1.0/_build/src" --logbufsecs="0" --logging_level="INFO" --oversubscribed_resources_interval="15secs"
--perf_duration="10secs" --perf_interval="1mins" --qos_correction_interval_min="0ns" --quiet="false"
--recover="reconnect" --recovery_timeout="15mins" --registration_backoff_factor="10ms" --resources="cpus:2;gpus:0;mem:1024;disk:1024;ports:[31000-32000]"
--revocable_cpu_low_priority="true" --sandbox_directory="/mnt/mesos/sandbox" --strict="true"
--switch_user="true" --systemd_enable_support="true" --systemd_runtime_directory="/run/systemd/system"
--version="false" --work_dir="/tmp/Endpoint_SlaveEndpointTest_UnauthorizedRequest_0_cFp55J"
I0708 14:02:02.878293 29444 credentials.hpp:86] Loading credential for authentication from
'/tmp/Endpoint_SlaveEndpointTest_UnauthorizedRequest_0_cFp55J/credential'
I0708 14:02:02.878607 29444 slave.cpp:343] Agent using credential for: test-principal
I0708 14:02:02.878643 29444 credentials.hpp:37] Loading credentials for authentication from
'/tmp/Endpoint_SlaveEndpointTest_UnauthorizedRequest_0_cFp55J/http_credentials'
I0708 14:02:02.878934 29444 slave.cpp:395] Using default 'basic' HTTP authenticator
I0708 14:02:02.879207 29444 resources.cpp:572] Parsing resources as JSON failed: cpus:2;gpus:0;mem:1024;disk:1024;ports:[31000-32000]
Trying semicolon-delimited string format instead
I0708 14:02:02.879705 29444 resources.cpp:572] Parsing resources as JSON failed: cpus:2;gpus:0;mem:1024;disk:1024;ports:[31000-32000]
Trying semicolon-delimited string format instead
I0708 14:02:02.880193 29444 slave.cpp:594] Agent resources: cpus(*):2; mem(*):1024; disk(*):1024;
ports(*):[31000-32000]
I0708 14:02:02.880269 29444 slave.cpp:602] Agent attributes: [  ]
I0708 14:02:02.880283 29444 slave.cpp:607] Agent hostname: 744f8e1eafe4
I0708 14:02:02.884347 29444 process.cpp:3322] Handling HTTP event for process 'slave(552)'
with path: '/slave(552)/monitor/statistics'
I0708 14:02:02.884461 29454 state.cpp:57] Recovering state from '/tmp/Endpoint_SlaveEndpointTest_UnauthorizedRequest_0_cFp55J/meta'
I0708 14:02:02.885444 29448 status_update_manager.cpp:200] Recovering status update manager
I0708 14:02:02.885606 29448 containerizer.cpp:522] Recovering containerizer
I0708 14:02:02.887303 29453 http.cpp:829] Authorizing principal 'test-principal' to GET the
'/monitor/statistics' endpoint
I0708 14:02:02.887444 29444 provisioner.cpp:253] Provisioner recovery complete
I0708 14:02:02.888761 29453 slave.cpp:4856] Finished recovery
I0708 14:02:02.891171 29453 slave.cpp:5028] Querying resource estimator for oversubscribable
resources
I0708 14:02:02.892094 29455 slave.cpp:5042] Received oversubscribable resources  from the
resource estimator
I0708 14:02:02.897567 29425 slave.cpp:841] Agent terminating
[       OK ] Endpoint/SlaveEndpointTest.UnauthorizedRequest/0 (89 ms)
[ RUN      ] Endpoint/SlaveEndpointTest.UnauthorizedRequest/1
I0708 14:02:02.947425 29425 containerizer.cpp:196] Using isolation: posix/cpu,posix/mem,filesystem/posix,network/cni
W0708 14:02:02.948652 29425 backend.cpp:75] Failed to create 'aufs' backend: AufsBackend requires
root privileges, but is running as user mesos
W0708 14:02:02.949093 29425 backend.cpp:75] Failed to create 'bind' backend: BindBackend requires
root privileges
I0708 14:02:02.961724 29455 slave.cpp:205] Agent started on 553)@172.17.0.7:42675
I0708 14:02:02.961936 29455 slave.cpp:206] Flags at startup: --acls="" --appc_simple_discovery_uri_prefix="http://"
--appc_store_dir="/tmp/mesos/store/appc" --authenticate_http="true" --authenticatee="crammd5"
--authentication_backoff_factor="1secs" --authorizer="local" --cgroups_cpu_enable_pids_and_tids_count="false"
--cgroups_enable_cfs="false" --cgroups_hierarchy="/sys/fs/cgroup" --cgroups_limit_swap="false"
--cgroups_root="mesos" --container_disk_watch_interval="15secs" --containerizers="mesos" --credential="/tmp/Endpoint_SlaveEndpointTest_UnauthorizedRequest_1_4O3uCE/credential"
--default_role="*" --disk_watch_interval="1mins" --docker="docker" --docker_kill_orphans="true"
--docker_registry="https://registry-1.docker.io" --docker_remove_delay="6hrs" --docker_socket="/var/run/docker.sock"
--docker_stop_timeout="0ns" --docker_store_dir="/tmp/mesos/store/docker" --docker_volume_checkpoint_dir="/var/run/mesos/isolators/docker/volume"
--enforce_container_disk_quota="false" --executor_registration_timeout="1mins" --executor_shutdown_grace_period="5secs"
--fetcher_cache_dir="/tmp/Endpoint_SlaveEndpointTest_UnauthorizedRequest_1_4O3uCE/fetch" --fetcher_cache_size="2GB"
--frameworks_home="" --gc_delay="1weeks" --gc_disk_headroom="0.1" --hadoop_home="" --help="false"
--hostname_lookup="true" --http_authenticators="basic" --http_command_executor="false" --http_credentials="/tmp/Endpoint_SlaveEndpointTest_UnauthorizedRequest_1_4O3uCE/http_credentials"
--image_provisioner_backend="copy" --initialize_driver_logging="true" --isolation="posix/cpu,posix/mem"
--launcher_dir="/mesos/mesos-1.1.0/_build/src" --logbufsecs="0" --logging_level="INFO" --oversubscribed_resources_interval="15secs"
--perf_duration="10secs" --perf_interval="1mins" --qos_correction_interval_min="0ns" --quiet="false"
--recover="reconnect" --recovery_timeout="15mins" --registration_backoff_factor="10ms" --resources="cpus:2;gpus:0;mem:1024;disk:1024;ports:[31000-32000]"
--revocable_cpu_low_priority="true" --sandbox_directory="/mnt/mesos/sandbox" --strict="true"
--switch_user="true" --systemd_enable_support="true" --systemd_runtime_directory="/run/systemd/system"
--version="false" --work_dir="/tmp/Endpoint_SlaveEndpointTest_UnauthorizedRequest_1_4O3uCE"
I0708 14:02:02.963007 29455 credentials.hpp:86] Loading credential for authentication from
'/tmp/Endpoint_SlaveEndpointTest_UnauthorizedRequest_1_4O3uCE/credential'
I0708 14:02:02.963481 29455 slave.cpp:343] Agent using credential for: test-principal
I0708 14:02:02.963618 29455 credentials.hpp:37] Loading credentials for authentication from
'/tmp/Endpoint_SlaveEndpointTest_UnauthorizedRequest_1_4O3uCE/http_credentials'
I0708 14:02:02.964094 29455 slave.cpp:395] Using default 'basic' HTTP authenticator
I0708 14:02:02.964638 29455 resources.cpp:572] Parsing resources as JSON failed: cpus:2;gpus:0;mem:1024;disk:1024;ports:[31000-32000]
Trying semicolon-delimited string format instead
I0708 14:02:02.965780 29455 resources.cpp:572] Parsing resources as JSON failed: cpus:2;gpus:0;mem:1024;disk:1024;ports:[31000-32000]
Trying semicolon-delimited string format instead
I0708 14:02:02.966531 29455 slave.cpp:594] Agent resources: cpus(*):2; mem(*):1024; disk(*):1024;
ports(*):[31000-32000]
I0708 14:02:02.966703 29455 slave.cpp:602] Agent attributes: [  ]
I0708 14:02:02.966835 29455 slave.cpp:607] Agent hostname: 744f8e1eafe4
I0708 14:02:02.969195 29446 state.cpp:57] Recovering state from '/tmp/Endpoint_SlaveEndpointTest_UnauthorizedRequest_1_4O3uCE/meta'
I0708 14:02:02.969625 29446 status_update_manager.cpp:200] Recovering status update manager
I0708 14:02:02.969900 29446 containerizer.cpp:522] Recovering containerizer
I0708 14:02:02.971340 29456 provisioner.cpp:253] Provisioner recovery complete
I0708 14:02:02.971741 29457 slave.cpp:4856] Finished recovery
I0708 14:02:02.972738 29457 slave.cpp:5028] Querying resource estimator for oversubscribable
resources
I0708 14:02:02.973266 29457 slave.cpp:5042] Received oversubscribable resources  from the
resource estimator
I0708 14:02:02.976034 29444 process.cpp:3322] Handling HTTP event for process 'slave(553)'
with path: '/slave(553)/monitor/statistics.json'
I0708 14:02:02.977440 29444 http.cpp:829] Authorizing principal 'test-principal' to GET the
'/monitor/statistics.json' endpoint
I0708 14:02:02.983825 29425 slave.cpp:841] Agent terminating
[       OK ] Endpoint/SlaveEndpointTest.UnauthorizedRequest/1 (124 ms)
[ RUN      ] Endpoint/SlaveEndpointTest.UnauthorizedRequest/2
I0708 14:02:03.071471 29425 containerizer.cpp:196] Using isolation: posix/cpu,posix/mem,filesystem/posix,network/cni
W0708 14:02:03.072402 29425 backend.cpp:75] Failed to create 'aufs' backend: AufsBackend requires
root privileges, but is running as user mesos
W0708 14:02:03.072643 29425 backend.cpp:75] Failed to create 'bind' backend: BindBackend requires
root privileges
I0708 14:02:03.077229 29453 slave.cpp:205] Agent started on 554)@172.17.0.7:42675
I0708 14:02:03.077257 29453 slave.cpp:206] Flags at startup: --acls="" --appc_simple_discovery_uri_prefix="http://"
--appc_store_dir="/tmp/mesos/store/appc" --authenticate_http="true" --authenticatee="crammd5"
--authentication_backoff_factor="1secs" --authorizer="local" --cgroups_cpu_enable_pids_and_tids_count="false"
--cgroups_enable_cfs="false" --cgroups_hierarchy="/sys/fs/cgroup" --cgroups_limit_swap="false"
--cgroups_root="mesos" --container_disk_watch_interval="15secs" --containerizers="mesos" --credential="/tmp/Endpoint_SlaveEndpointTest_UnauthorizedRequest_2_TX0z0z/credential"
--default_role="*" --disk_watch_interval="1mins" --docker="docker" --docker_kill_orphans="true"
--docker_registry="https://registry-1.docker.io" --docker_remove_delay="6hrs" --docker_socket="/var/run/docker.sock"
--docker_stop_timeout="0ns" --docker_store_dir="/tmp/mesos/store/docker" --docker_volume_checkpoint_dir="/var/run/mesos/isolators/docker/volume"
--enforce_container_disk_quota="false" --executor_registration_timeout="1mins" --executor_shutdown_grace_period="5secs"
--fetcher_cache_dir="/tmp/Endpoint_SlaveEndpointTest_UnauthorizedRequest_2_TX0z0z/fetch" --fetcher_cache_size="2GB"
--frameworks_home="" --gc_delay="1weeks" --gc_disk_headroom="0.1" --hadoop_home="" --help="false"
--hostname_lookup="true" --http_authenticators="basic" --http_command_executor="false" --http_credentials="/tmp/Endpoint_SlaveEndpointTest_UnauthorizedRequest_2_TX0z0z/http_credentials"
--image_provisioner_backend="copy" --initialize_driver_logging="true" --isolation="posix/cpu,posix/mem"
--launcher_dir="/mesos/mesos-1.1.0/_build/src" --logbufsecs="0" --logging_level="INFO" --oversubscribed_resources_interval="15secs"
--perf_duration="10secs" --perf_interval="1mins" --qos_correction_interval_min="0ns" --quiet="false"
--recover="reconnect" --recovery_timeout="15mins" --registration_backoff_factor="10ms" --resources="cpus:2;gpus:0;mem:1024;disk:1024;ports:[31000-32000]"
--revocable_cpu_low_priority="true" --sandbox_directory="/mnt/mesos/sandbox" --strict="true"
--switch_user="true" --systemd_enable_support="true" --systemd_runtime_directory="/run/systemd/system"
--version="false" --work_dir="/tmp/Endpoint_SlaveEndpointTest_UnauthorizedRequest_2_TX0z0z"
I0708 14:02:03.078029 29453 credentials.hpp:86] Loading credential for authentication from
'/tmp/Endpoint_SlaveEndpointTest_UnauthorizedRequest_2_TX0z0z/credential'
I0708 14:02:03.078280 29453 slave.cpp:343] Agent using credential for: test-principal
I0708 14:02:03.078377 29453 credentials.hpp:37] Loading credentials for authentication from
'/tmp/Endpoint_SlaveEndpointTest_UnauthorizedRequest_2_TX0z0z/http_credentials'
I0708 14:02:03.078742 29453 slave.cpp:395] Using default 'basic' HTTP authenticator
I0708 14:02:03.081532 29453 resources.cpp:572] Parsing resources as JSON failed: cpus:2;gpus:0;mem:1024;disk:1024;ports:[31000-32000]
Trying semicolon-delimited string format instead
I0708 14:02:03.081974 29453 resources.cpp:572] Parsing resources as JSON failed: cpus:2;gpus:0;mem:1024;disk:1024;ports:[31000-32000]
Trying semicolon-delimited string format instead
I0708 14:02:03.082543 29453 slave.cpp:594] Agent resources: cpus(*):2; mem(*):1024; disk(*):1024;
ports(*):[31000-32000]
I0708 14:02:03.082682 29453 slave.cpp:602] Agent attributes: [  ]
I0708 14:02:03.082787 29453 slave.cpp:607] Agent hostname: 744f8e1eafe4
I0708 14:02:03.084631 29449 state.cpp:57] Recovering state from '/tmp/Endpoint_SlaveEndpointTest_UnauthorizedRequest_2_TX0z0z/meta'
I0708 14:02:03.084729 29453 process.cpp:3322] Handling HTTP event for process 'slave(554)'
with path: '/slave(554)/containers'
I0708 14:02:03.085223 29453 status_update_manager.cpp:200] Recovering status update manager
I0708 14:02:03.085942 29452 containerizer.cpp:522] Recovering containerizer
I0708 14:02:03.086359 29455 http.cpp:829] Authorizing principal 'test-principal' to GET the
'/containers' endpoint
I0708 14:02:03.087178 29452 provisioner.cpp:253] Provisioner recovery complete
I0708 14:02:03.090615 29445 slave.cpp:4856] Finished recovery
I0708 14:02:03.092031 29445 slave.cpp:5028] Querying resource estimator for oversubscribable
resources
I0708 14:02:03.092583 29459 slave.cpp:5042] Received oversubscribable resources  from the
resource estimator
I0708 14:02:03.094768 29449 slave.cpp:841] Agent terminating
[       OK ] Endpoint/SlaveEndpointTest.UnauthorizedRequest/2 (53 ms)
[ RUN      ] Endpoint/SlaveEndpointTest.NoAuthorizer/0
I0708 14:02:03.125450 29425 containerizer.cpp:196] Using isolation: posix/cpu,posix/mem,filesystem/posix,network/cni
W0708 14:02:03.126561 29425 backend.cpp:75] Failed to create 'aufs' backend: AufsBackend requires
root privileges, but is running as user mesos
W0708 14:02:03.126862 29425 backend.cpp:75] Failed to create 'bind' backend: BindBackend requires
root privileges
I0708 14:02:03.129530 29425 cluster.cpp:432] Creating default 'local' authorizer
I0708 14:02:03.131698 29453 slave.cpp:205] Agent started on 555)@172.17.0.7:42675
I0708 14:02:03.131798 29453 slave.cpp:206] Flags at startup: --acls="" --appc_simple_discovery_uri_prefix="http://"
--appc_store_dir="/tmp/mesos/store/appc" --authenticate_http="true" --authenticatee="crammd5"
--authentication_backoff_factor="1secs" --authorizer="local" --cgroups_cpu_enable_pids_and_tids_count="false"
--cgroups_enable_cfs="false" --cgroups_hierarchy="/sys/fs/cgroup" --cgroups_limit_swap="false"
--cgroups_root="mesos" --container_disk_watch_interval="15secs" --containerizers="mesos" --credential="/tmp/Endpoint_SlaveEndpointTest_NoAuthorizer_0_ZltjZv/credential"
--default_role="*" --disk_watch_interval="1mins" --docker="docker" --docker_kill_orphans="true"
--docker_registry="https://registry-1.docker.io" --docker_remove_delay="6hrs" --docker_socket="/var/run/docker.sock"
--docker_stop_timeout="0ns" --docker_store_dir="/tmp/mesos/store/docker" --docker_volume_checkpoint_dir="/var/run/mesos/isolators/docker/volume"
--enforce_container_disk_quota="false" --executor_registration_timeout="1mins" --executor_shutdown_grace_period="5secs"
--fetcher_cache_dir="/tmp/Endpoint_SlaveEndpointTest_NoAuthorizer_0_ZltjZv/fetch" --fetcher_cache_size="2GB"
--frameworks_home="" --gc_delay="1weeks" --gc_disk_headroom="0.1" --hadoop_home="" --help="false"
--hostname_lookup="true" --http_authenticators="basic" --http_command_executor="false" --http_credentials="/tmp/Endpoint_SlaveEndpointTest_NoAuthorizer_0_ZltjZv/http_credentials"
--image_provisioner_backend="copy" --initialize_driver_logging="true" --isolation="posix/cpu,posix/mem"
--launcher_dir="/mesos/mesos-1.1.0/_build/src" --logbufsecs="0" --logging_level="INFO" --oversubscribed_resources_interval="15secs"
--perf_duration="10secs" --perf_interval="1mins" --qos_correction_interval_min="0ns" --quiet="false"
--recover="reconnect" --recovery_timeout="15mins" --registration_backoff_factor="10ms" --resources="cpus:2;gpus:0;mem:1024;disk:1024;ports:[31000-32000]"
--revocable_cpu_low_priority="true" --sandbox_directory="/mnt/mesos/sandbox" --strict="true"
--switch_user="true" --systemd_enable_support="true" --systemd_runtime_directory="/run/systemd/system"
--version="false" --work_dir="/tmp/Endpoint_SlaveEndpointTest_NoAuthorizer_0_ZltjZv"
I0708 14:02:03.132463 29453 credentials.hpp:86] Loading credential for authentication from
'/tmp/Endpoint_SlaveEndpointTest_NoAuthorizer_0_ZltjZv/credential'
I0708 14:02:03.132659 29453 slave.cpp:343] Agent using credential for: test-principal
I0708 14:02:03.132694 29453 credentials.hpp:37] Loading credentials for authentication from
'/tmp/Endpoint_SlaveEndpointTest_NoAuthorizer_0_ZltjZv/http_credentials'
I0708 14:02:03.132966 29453 slave.cpp:395] Using default 'basic' HTTP authenticator
I0708 14:02:03.133226 29453 resources.cpp:572] Parsing resources as JSON failed: cpus:2;gpus:0;mem:1024;disk:1024;ports:[31000-32000]
Trying semicolon-delimited string format instead
I0708 14:02:03.133899 29453 resources.cpp:572] Parsing resources as JSON failed: cpus:2;gpus:0;mem:1024;disk:1024;ports:[31000-32000]
Trying semicolon-delimited string format instead
I0708 14:02:03.134382 29453 slave.cpp:594] Agent resources: cpus(*):2; mem(*):1024; disk(*):1024;
ports(*):[31000-32000]
I0708 14:02:03.134476 29453 slave.cpp:602] Agent attributes: [  ]
I0708 14:02:03.134490 29453 slave.cpp:607] Agent hostname: 744f8e1eafe4
I0708 14:02:03.136499 29454 state.cpp:57] Recovering state from '/tmp/Endpoint_SlaveEndpointTest_NoAuthorizer_0_ZltjZv/meta'
I0708 14:02:03.136865 29454 status_update_manager.cpp:200] Recovering status update manager
I0708 14:02:03.137007 29454 containerizer.cpp:522] Recovering containerizer
I0708 14:02:03.141592 29451 provisioner.cpp:253] Provisioner recovery complete
I0708 14:02:03.145769 29449 slave.cpp:4856] Finished recovery
I0708 14:02:03.146405 29449 slave.cpp:5028] Querying resource estimator for oversubscribable
resources
I0708 14:02:03.146790 29449 slave.cpp:5042] Received oversubscribable resources  from the
resource estimator
I0708 14:02:03.150353 29450 process.cpp:3322] Handling HTTP event for process 'slave(555)'
with path: '/slave(555)/monitor/statistics'
I0708 14:02:03.151722 29450 http.cpp:829] Authorizing principal 'test-principal' to GET the
'/monitor/statistics' endpoint
I0708 14:02:03.198303 29425 slave.cpp:841] Agent terminating
[       OK ] Endpoint/SlaveEndpointTest.NoAuthorizer/0 (105 ms)
[ RUN      ] Endpoint/SlaveEndpointTest.NoAuthorizer/1
I0708 14:02:03.231755 29425 containerizer.cpp:196] Using isolation: posix/cpu,posix/mem,filesystem/posix,network/cni
W0708 14:02:03.232970 29425 backend.cpp:75] Failed to create 'aufs' backend: AufsBackend requires
root privileges, but is running as user mesos
W0708 14:02:03.233476 29425 backend.cpp:75] Failed to create 'bind' backend: BindBackend requires
root privileges
I0708 14:02:03.235585 29425 cluster.cpp:432] Creating default 'local' authorizer
I0708 14:02:03.238173 29444 slave.cpp:205] Agent started on 556)@172.17.0.7:42675
I0708 14:02:03.238198 29444 slave.cpp:206] Flags at startup: --acls="" --appc_simple_discovery_uri_prefix="http://"
--appc_store_dir="/tmp/mesos/store/appc" --authenticate_http="true" --authenticatee="crammd5"
--authentication_backoff_factor="1secs" --authorizer="local" --cgroups_cpu_enable_pids_and_tids_count="false"
--cgroups_enable_cfs="false" --cgroups_hierarchy="/sys/fs/cgroup" --cgroups_limit_swap="false"
--cgroups_root="mesos" --container_disk_watch_interval="15secs" --containerizers="mesos" --credential="/tmp/Endpoint_SlaveEndpointTest_NoAuthorizer_1_QqQvFs/credential"
--default_role="*" --disk_watch_interval="1mins" --docker="docker" --docker_kill_orphans="true"
--docker_registry="https://registry-1.docker.io" --docker_remove_delay="6hrs" --docker_socket="/var/run/docker.sock"
--docker_stop_timeout="0ns" --docker_store_dir="/tmp/mesos/store/docker" --docker_volume_checkpoint_dir="/var/run/mesos/isolators/docker/volume"
--enforce_container_disk_quota="false" --executor_registration_timeout="1mins" --executor_shutdown_grace_period="5secs"
--fetcher_cache_dir="/tmp/Endpoint_SlaveEndpointTest_NoAuthorizer_1_QqQvFs/fetch" --fetcher_cache_size="2GB"
--frameworks_home="" --gc_delay="1weeks" --gc_disk_headroom="0.1" --hadoop_home="" --help="false"
--hostname_lookup="true" --http_authenticators="basic" --http_command_executor="false" --http_credentials="/tmp/Endpoint_SlaveEndpointTest_NoAuthorizer_1_QqQvFs/http_credentials"
--image_provisioner_backend="copy" --initialize_driver_logging="true" --isolation="posix/cpu,posix/mem"
--launcher_dir="/mesos/mesos-1.1.0/_build/src" --logbufsecs="0" --logging_level="INFO" --oversubscribed_resources_interval="15secs"
--perf_duration="10secs" --perf_interval="1mins" --qos_correction_interval_min="0ns" --quiet="false"
--recover="reconnect" --recovery_timeout="15mins" --registration_backoff_factor="10ms" --resources="cpus:2;gpus:0;mem:1024;disk:1024;ports:[31000-32000]"
--revocable_cpu_low_priority="true" --sandbox_directory="/mnt/mesos/sandbox" --strict="true"
--switch_user="true" --systemd_enable_support="true" --systemd_runtime_directory="/run/systemd/system"
--version="false" --work_dir="/tmp/Endpoint_SlaveEndpointTest_NoAuthorizer_1_QqQvFs"
I0708 14:02:03.239045 29444 credentials.hpp:86] Loading credential for authentication from
'/tmp/Endpoint_SlaveEndpointTest_NoAuthorizer_1_QqQvFs/credential'
I0708 14:02:03.239264 29444 slave.cpp:343] Agent using credential for: test-principal
I0708 14:02:03.239512 29444 credentials.hpp:37] Loading credentials for authentication from
'/tmp/Endpoint_SlaveEndpointTest_NoAuthorizer_1_QqQvFs/http_credentials'
I0708 14:02:03.239985 29444 slave.cpp:395] Using default 'basic' HTTP authenticator
I0708 14:02:03.240475 29444 resources.cpp:572] Parsing resources as JSON failed: cpus:2;gpus:0;mem:1024;disk:1024;ports:[31000-32000]
Trying semicolon-delimited string format instead
I0708 14:02:03.241106 29444 resources.cpp:572] Parsing resources as JSON failed: cpus:2;gpus:0;mem:1024;disk:1024;ports:[31000-32000]
Trying semicolon-delimited string format instead
I0708 14:02:03.241678 29444 slave.cpp:594] Agent resources: cpus(*):2; mem(*):1024; disk(*):1024;
ports(*):[31000-32000]
I0708 14:02:03.241755 29444 slave.cpp:602] Agent attributes: [  ]
I0708 14:02:03.241770 29444 slave.cpp:607] Agent hostname: 744f8e1eafe4
I0708 14:02:03.243741 29444 state.cpp:57] Recovering state from '/tmp/Endpoint_SlaveEndpointTest_NoAuthorizer_1_QqQvFs/meta'
I0708 14:02:03.244101 29459 status_update_manager.cpp:200] Recovering status update manager
I0708 14:02:03.244333 29459 containerizer.cpp:522] Recovering containerizer
I0708 14:02:03.246119 29457 provisioner.cpp:253] Provisioner recovery complete
I0708 14:02:03.246572 29457 slave.cpp:4856] Finished recovery
I0708 14:02:03.247211 29457 slave.cpp:5028] Querying resource estimator for oversubscribable
resources
I0708 14:02:03.247705 29457 slave.cpp:5042] Received oversubscribable resources  from the
resource estimator
I0708 14:02:03.254688 29448 process.cpp:3322] Handling HTTP event for process 'slave(556)'
with path: '/slave(556)/monitor/statistics.json'
I0708 14:02:03.256316 29448 http.cpp:829] Authorizing principal 'test-principal' to GET the
'/monitor/statistics.json' endpoint
I0708 14:02:03.262730 29425 slave.cpp:841] Agent terminating
[       OK ] Endpoint/SlaveEndpointTest.NoAuthorizer/1 (86 ms)
[ RUN      ] Endpoint/SlaveEndpointTest.NoAuthorizer/2
I0708 14:02:03.323396 29425 containerizer.cpp:196] Using isolation: posix/cpu,posix/mem,filesystem/posix,network/cni
W0708 14:02:03.326375 29425 backend.cpp:75] Failed to create 'aufs' backend: AufsBackend requires
root privileges, but is running as user mesos
W0708 14:02:03.327579 29425 backend.cpp:75] Failed to create 'bind' backend: BindBackend requires
root privileges
I0708 14:02:03.331784 29425 cluster.cpp:432] Creating default 'local' authorizer
I0708 14:02:03.337568 29455 slave.cpp:205] Agent started on 557)@172.17.0.7:42675
I0708 14:02:03.337604 29455 slave.cpp:206] Flags at startup: --acls="" --appc_simple_discovery_uri_prefix="http://"
--appc_store_dir="/tmp/mesos/store/appc" --authenticate_http="true" --authenticatee="crammd5"
--authentication_backoff_factor="1secs" --authorizer="local" --cgroups_cpu_enable_pids_and_tids_count="false"
--cgroups_enable_cfs="false" --cgroups_hierarchy="/sys/fs/cgroup" --cgroups_limit_swap="false"
--cgroups_root="mesos" --container_disk_watch_interval="15secs" --containerizers="mesos" --credential="/tmp/Endpoint_SlaveEndpointTest_NoAuthorizer_2_6s4M4p/credential"
--default_role="*" --disk_watch_interval="1mins" --docker="docker" --docker_kill_orphans="true"
--docker_registry="https://registry-1.docker.io" --docker_remove_delay="6hrs" --docker_socket="/var/run/docker.sock"
--docker_stop_timeout="0ns" --docker_store_dir="/tmp/mesos/store/docker" --docker_volume_checkpoint_dir="/var/run/mesos/isolators/docker/volume"
--enforce_container_disk_quota="false" --executor_registration_timeout="1mins" --executor_shutdown_grace_period="5secs"
--fetcher_cache_dir="/tmp/Endpoint_SlaveEndpointTest_NoAuthorizer_2_6s4M4p/fetch" --fetcher_cache_size="2GB"
--frameworks_home="" --gc_delay="1weeks" --gc_disk_headroom="0.1" --hadoop_home="" --help="false"
--hostname_lookup="true" --http_authenticators="basic" --http_command_executor="false" --http_credentials="/tmp/Endpoint_SlaveEndpointTest_NoAuthorizer_2_6s4M4p/http_credentials"
--image_provisioner_backend="copy" --initialize_driver_logging="true" --isolation="posix/cpu,posix/mem"
--launcher_dir="/mesos/mesos-1.1.0/_build/src" --logbufsecs="0" --logging_level="INFO" --oversubscribed_resources_interval="15secs"
--perf_duration="10secs" --perf_interval="1mins" --qos_correction_interval_min="0ns" --quiet="false"
--recover="reconnect" --recovery_timeout="15mins" --registration_backoff_factor="10ms" --resources="cpus:2;gpus:0;mem:1024;disk:1024;ports:[31000-32000]"
--revocable_cpu_low_priority="true" --sandbox_directory="/mnt/mesos/sandbox" --strict="true"
--switch_user="true" --systemd_enable_support="true" --systemd_runtime_directory="/run/systemd/system"
--version="false" --work_dir="/tmp/Endpoint_SlaveEndpointTest_NoAuthorizer_2_6s4M4p"
I0708 14:02:03.338249 29455 credentials.hpp:86] Loading credential for authentication from
'/tmp/Endpoint_SlaveEndpointTest_NoAuthorizer_2_6s4M4p/credential'
I0708 14:02:03.338673 29455 slave.cpp:343] Agent using credential for: test-principal
I0708 14:02:03.338793 29455 credentials.hpp:37] Loading credentials for authentication from
'/tmp/Endpoint_SlaveEndpointTest_NoAuthorizer_2_6s4M4p/http_credentials'
I0708 14:02:03.339187 29455 slave.cpp:395] Using default 'basic' HTTP authenticator
I0708 14:02:03.339568 29455 resources.cpp:572] Parsing resources as JSON failed: cpus:2;gpus:0;mem:1024;disk:1024;ports:[31000-32000]
Trying semicolon-delimited string format instead
I0708 14:02:03.340080 29455 resources.cpp:572] Parsing resources as JSON failed: cpus:2;gpus:0;mem:1024;disk:1024;ports:[31000-32000]
Trying semicolon-delimited string format instead
I0708 14:02:03.340669 29455 slave.cpp:594] Agent resources: cpus(*):2; mem(*):1024; disk(*):1024;
ports(*):[31000-32000]
I0708 14:02:03.340807 29455 slave.cpp:602] Agent attributes: [  ]
I0708 14:02:03.340910 29455 slave.cpp:607] Agent hostname: 744f8e1eafe4
I0708 14:02:03.344508 29455 state.cpp:57] Recovering state from '/tmp/Endpoint_SlaveEndpointTest_NoAuthorizer_2_6s4M4p/meta'
I0708 14:02:03.345000 29455 status_update_manager.cpp:200] Recovering status update manager
I0708 14:02:03.345252 29458 process.cpp:3322] Handling HTTP event for process 'slave(557)'
with path: '/slave(557)/containers'
I0708 14:02:03.346215 29458 containerizer.cpp:522] Recovering containerizer
I0708 14:02:03.347039 29449 http.cpp:829] Authorizing principal 'test-principal' to GET the
'/containers' endpoint
I0708 14:02:03.352757 29458 provisioner.cpp:253] Provisioner recovery complete
I0708 14:02:03.353442 29454 slave.cpp:4856] Finished recovery
I0708 14:02:03.353984 29454 slave.cpp:5028] Querying resource estimator for oversubscribable
resources
I0708 14:02:03.354337 29454 slave.cpp:5042] Received oversubscribable resources  from the
resource estimator
I0708 14:02:03.355929 29425 slave.cpp:841] Agent terminating
[       OK ] Endpoint/SlaveEndpointTest.NoAuthorizer/2 (55 ms)
[----------] 9 tests from Endpoint/SlaveEndpointTest (730 ms total)

[----------] Global test environment tear-down
[==========] 1236 tests from 139 test cases ran. (1003028 ms total)
[  PASSED  ] 1234 tests.
make[4]: [  FAILED  ] 2 tests, listed below:
[  FAILED  ] ContentType/MasterAPITest.GetAgents/0, where GetParam() = application/x-protobuf
[  FAILED  ] ContentType/MasterAPITest.GetAgents/1, where GetParam() = application/json

 2 FAILED TESTS
  YOU HAVE 6 DISABLED TESTS

make[4]: Leaving directory `/mesos/mesos-1.1.0/_build/src'
make[3]: Leaving directory `/mesos/mesos-1.1.0/_build/src'
*** [check-local] Error 1
make[3]: *** [check-am] Error 2
make[2]: *** [check] Error 2
make[2]: Leaving directory `/mesos/mesos-1.1.0/_build/src'
make[1]: *** [check-recursive] Error 1
make[1]: Leaving directory `/mesos/mesos-1.1.0/_build'
make: *** [distcheck] Error 1
+ docker rmi mesos-1467982349-24821
Untagged: mesos-1467982349-24821:latest
Deleted: 2fc7ea3831de2159022a5b9ba54fb239d0c637bab144236a2110eac19b6fe045
Deleted: 4d364e84c15e424e7f3af81ef6179c49b9a2fc31158e0247d2d1ee260f12cf97
Deleted: c3156d216753aa70641ec417faad5aa791df9b8e51268fa7f113fd0240ed414c
Deleted: 014b9d5b2b887bbe851fed0b2df5c671c8768b3b5f55a95e389428491b721ce9
Deleted: c575becf37ca3913a6a64c9b61453e8c3b97deb9241b97b7a7b9cd7e56a7bd8a
Deleted: 3e49e2d2b23145835f7983c7e2dde49b12d18340487c11a7f1792809b1e6b001
Deleted: 98bc0a9bdcbe2f414b1e8ac854b2f51d46f535928aa75f66e7a54b1720772acc
Deleted: 9b3595f780fec304f6227ec650b41496c9ca1e308f0a76c88ae47d1f063d5da0
Deleted: 69be9d2a56235f2ccda7a148e2088075601771d188f0de929f3d878f2a594f10
Deleted: c49915653629ef02f2829f5173189fc3045383e0d5e70792fcab2eee0ce8ebe5
Deleted: b02fca71d151e19bd3fb2b61af9be1f20d304d7b32a0e9657a43d5643240fd4e
Deleted: cf45e860599adc415e215c52dfa4924fd4de9960cf0abdc9bdf226edc7729a16
Deleted: ea0c2f3b27b0f854485474be8bf7de02953627203b5c9844ce089f781a5e3f0c
Deleted: 9c635d6ff128eb0957a41cb246f2210d917a5e2a4624d33152d7e4bd9c2c6ee6
Deleted: ee4dccc00ac98284da7bb4607836168bc54ad459430c3628566d3aade06585d6
Build step 'Execute shell' marked build as failure

Mime
View raw message