mesos-builds mailing list archives

Site index · List index
Message view « Date » · « Thread »
Top « Date » · « Thread »
From Apache Jenkins Server <jenk...@builds.apache.org>
Subject Build failed in Jenkins: Mesos » cmake,clang,--verbose,GLOG_v=1 MESOS_VERBOSE=1,ubuntu:14.04,(docker||Hadoop)&&(!ubuntu-us1) #2295
Date Thu, 16 Jun 2016 22:59:56 GMT
See <https://builds.apache.org/job/Mesos/BUILDTOOL=cmake,COMPILER=clang,CONFIGURATION=--verbose,ENVIRONMENT=GLOG_v=1%20MESOS_VERBOSE=1,OS=ubuntu%3A14.04,label_exp=(docker%7C%7CHadoop)&&(!ubuntu-us1)/2295/changes>

Changes:

[toenshoff] Added Berlin usergroup to community page.

[bmahler] Added a comment to clarify granting of NVIDIA control devices.

[yujie.jay] Added a metric to replicated log.

[yujie.jay] Added a metrics prefix for registrar replicated log.

[yujie.jay] Added a test for replicated log metrics.

[yujie.jay] Added a TODO about a bug in RecoverProtocolProcess discard logic.

------------------------------------------
[...truncated 8758 lines...]
clang -DHAVE_CONFIG_H -I.  -I./include -I./tests -I./generated   -DTHREADED -g -O2 -D_GNU_SOURCE
-MT cli_mt-cli.o -MD -MP -MF .deps/cli_mt-cli.Tpo -c -o cli_mt-cli.o `test -f 'src/cli.c'
|| echo './'`src/cli.c
mv -f .deps/cli_mt-cli.Tpo .deps/cli_mt-cli.Po
/bin/bash ./libtool  --tag=CC   --mode=link clang -DTHREADED -g -O2 -D_GNU_SOURCE   -o cli_mt
cli_mt-cli.o libzookeeper_mt.la 
clang++ -I. -I./include -fno-builtin-memcmp -pthread -DOS_LINUX -DLEVELDB_PLATFORM_POSIX -O2
-DNDEBUG        -c db/db_impl.cc -o db/db_impl.o
libtool: link: clang -DTHREADED -g -O2 -D_GNU_SOURCE -o cli_mt cli_mt-cli.o  ./.libs/libzookeeper_mt.a
-lm -lpthread
clang -DHAVE_CONFIG_H -I.  -I./include -I./tests -I./generated   -DTHREADED -g -O2 -D_GNU_SOURCE
-MT load_gen-load_gen.o -MD -MP -MF .deps/load_gen-load_gen.Tpo -c -o load_gen-load_gen.o
`test -f 'src/load_gen.c' || echo './'`src/load_gen.c
mv -f .deps/load_gen-load_gen.Tpo .deps/load_gen-load_gen.Po
/bin/bash ./libtool  --tag=CC   --mode=link clang -DTHREADED -g -O2 -D_GNU_SOURCE   -o load_gen
load_gen-load_gen.o libzookeeper_mt.la 
libtool: link: clang -DTHREADED -g -O2 -D_GNU_SOURCE -o load_gen load_gen-load_gen.o  ./.libs/libzookeeper_mt.a
-lm -lpthread
make[4]: Leaving directory `/mesos/build/3rdparty/zookeeper-3.4.8/src/zookeeper-3.4.8/src/c'
make[3]: Leaving directory `/mesos/build/3rdparty/zookeeper-3.4.8/src/zookeeper-3.4.8/src/c'
cd /mesos/build/3rdparty/zookeeper-3.4.8/src/zookeeper-3.4.8-build && /usr/bin/cmake
-E touch /mesos/build/3rdparty/zookeeper-3.4.8/src/zookeeper-3.4.8-stamp/zookeeper-3.4.8-build
/usr/bin/cmake -E cmake_progress_report /mesos/build/CMakeFiles 
[ 40%] Performing install step for 'zookeeper-3.4.8'
cd /mesos/build/3rdparty/zookeeper-3.4.8/src/zookeeper-3.4.8-build && cd /mesos/build/3rdparty/zookeeper-3.4.8/src/zookeeper-3.4.8/src/c
&& make install
make[3]: Entering directory `/mesos/build/3rdparty/zookeeper-3.4.8/src/zookeeper-3.4.8/src/c'
make[3]: warning: jobserver unavailable: using -j1.  Add `+' to parent make rule.
make[4]: Entering directory `/mesos/build/3rdparty/zookeeper-3.4.8/src/zookeeper-3.4.8/src/c'
 /bin/mkdir -p '/mesos/build/3rdparty/zookeeper-3.4.8/src/zookeeper-3.4.8/src/c/lib'
 /bin/bash ./libtool   --mode=install /usr/bin/install -c   libzookeeper_st.la libzookeeper_mt.la
'/mesos/build/3rdparty/zookeeper-3.4.8/src/zookeeper-3.4.8/src/c/lib'
libtool: install: /usr/bin/install -c .libs/libzookeeper_st.lai /mesos/build/3rdparty/zookeeper-3.4.8/src/zookeeper-3.4.8/src/c/lib/libzookeeper_st.la
libtool: install: /usr/bin/install -c .libs/libzookeeper_mt.lai /mesos/build/3rdparty/zookeeper-3.4.8/src/zookeeper-3.4.8/src/c/lib/libzookeeper_mt.la
libtool: install: /usr/bin/install -c .libs/libzookeeper_st.a /mesos/build/3rdparty/zookeeper-3.4.8/src/zookeeper-3.4.8/src/c/lib/libzookeeper_st.a
libtool: install: chmod 644 /mesos/build/3rdparty/zookeeper-3.4.8/src/zookeeper-3.4.8/src/c/lib/libzookeeper_st.a
libtool: install: ranlib /mesos/build/3rdparty/zookeeper-3.4.8/src/zookeeper-3.4.8/src/c/lib/libzookeeper_st.a
libtool: install: /usr/bin/install -c .libs/libzookeeper_mt.a /mesos/build/3rdparty/zookeeper-3.4.8/src/zookeeper-3.4.8/src/c/lib/libzookeeper_mt.a
libtool: install: chmod 644 /mesos/build/3rdparty/zookeeper-3.4.8/src/zookeeper-3.4.8/src/c/lib/libzookeeper_mt.a
libtool: install: ranlib /mesos/build/3rdparty/zookeeper-3.4.8/src/zookeeper-3.4.8/src/c/lib/libzookeeper_mt.a
libtool: finish: PATH="/usr/local/sbin:/usr/local/bin:/usr/sbin:/usr/bin:/sbin:/bin:/sbin"
ldconfig -n /mesos/build/3rdparty/zookeeper-3.4.8/src/zookeeper-3.4.8/src/c/lib
----------------------------------------------------------------------
Libraries have been installed in:
   /mesos/build/3rdparty/zookeeper-3.4.8/src/zookeeper-3.4.8/src/c/lib

If you ever happen to want to link against installed libraries
in a given directory, LIBDIR, you must either use libtool, and
specify the full pathname of the library, or use the '-LLIBDIR'
flag during linking and do at least one of the following:
   - add LIBDIR to the 'LD_LIBRARY_PATH' environment variable
     during execution
   - add LIBDIR to the 'LD_RUN_PATH' environment variable
     during linking
   - use the '-Wl,-rpath -Wl,LIBDIR' linker flag
   - have your system administrator add LIBDIR to '/etc/ld.so.conf'

See any operating system documentation about shared libraries for
more information, such as the ld(1) and ld.so(8) manual pages.
----------------------------------------------------------------------
 /bin/mkdir -p '/mesos/build/3rdparty/zookeeper-3.4.8/src/zookeeper-3.4.8/src/c/bin'
  /bin/bash ./libtool   --mode=install /usr/bin/install -c cli_st cli_mt load_gen '/mesos/build/3rdparty/zookeeper-3.4.8/src/zookeeper-3.4.8/src/c/bin'
libtool: install: /usr/bin/install -c cli_st /mesos/build/3rdparty/zookeeper-3.4.8/src/zookeeper-3.4.8/src/c/bin/cli_st
libtool: install: /usr/bin/install -c cli_mt /mesos/build/3rdparty/zookeeper-3.4.8/src/zookeeper-3.4.8/src/c/bin/cli_mt
libtool: install: /usr/bin/install -c load_gen /mesos/build/3rdparty/zookeeper-3.4.8/src/zookeeper-3.4.8/src/c/bin/load_gen
 /bin/mkdir -p '/mesos/build/3rdparty/zookeeper-3.4.8/src/zookeeper-3.4.8/src/c/include/zookeeper'
 /usr/bin/install -c -m 644 include/zookeeper.h include/zookeeper_version.h include/zookeeper_log.h
include/proto.h include/recordio.h generated/zookeeper.jute.h '/mesos/build/3rdparty/zookeeper-3.4.8/src/zookeeper-3.4.8/src/c/include/zookeeper'
make[4]: Leaving directory `/mesos/build/3rdparty/zookeeper-3.4.8/src/zookeeper-3.4.8/src/c'
make[3]: Leaving directory `/mesos/build/3rdparty/zookeeper-3.4.8/src/zookeeper-3.4.8/src/c'
cd /mesos/build/3rdparty/zookeeper-3.4.8/src/zookeeper-3.4.8-build && /usr/bin/cmake
-E touch /mesos/build/3rdparty/zookeeper-3.4.8/src/zookeeper-3.4.8-stamp/zookeeper-3.4.8-install
/usr/bin/cmake -E cmake_progress_report /mesos/build/CMakeFiles 
[ 40%] Completed 'zookeeper-3.4.8'
cd /mesos/build/3rdparty && /usr/bin/cmake -E make_directory /mesos/build/3rdparty/CMakeFiles
cd /mesos/build/3rdparty && /usr/bin/cmake -E touch /mesos/build/3rdparty/CMakeFiles/zookeeper-3.4.8-complete
cd /mesos/build/3rdparty && /usr/bin/cmake -E touch /mesos/build/3rdparty/zookeeper-3.4.8/src/zookeeper-3.4.8-stamp/zookeeper-3.4.8-done
make[2]: Leaving directory `/mesos/build'
/usr/bin/cmake -E cmake_progress_report /mesos/build/CMakeFiles  99 100
[ 40%] Built target zookeeper-3.4.8
clang++ -I. -I./include -fno-builtin-memcmp -pthread -DOS_LINUX -DLEVELDB_PLATFORM_POSIX -O2
-DNDEBUG        -c db/db_iter.cc -o db/db_iter.o
clang++ -I. -I./include -fno-builtin-memcmp -pthread -DOS_LINUX -DLEVELDB_PLATFORM_POSIX -O2
-DNDEBUG        -c db/dbformat.cc -o db/dbformat.o
clang++ -I. -I./include -fno-builtin-memcmp -pthread -DOS_LINUX -DLEVELDB_PLATFORM_POSIX -O2
-DNDEBUG        -c db/filename.cc -o db/filename.o
clang++ -I. -I./include -fno-builtin-memcmp -pthread -DOS_LINUX -DLEVELDB_PLATFORM_POSIX -O2
-DNDEBUG        -c db/log_reader.cc -o db/log_reader.o
clang++ -I. -I./include -fno-builtin-memcmp -pthread -DOS_LINUX -DLEVELDB_PLATFORM_POSIX -O2
-DNDEBUG        -c db/log_writer.cc -o db/log_writer.o
clang++ -I. -I./include -fno-builtin-memcmp -pthread -DOS_LINUX -DLEVELDB_PLATFORM_POSIX -O2
-DNDEBUG        -c db/memtable.cc -o db/memtable.o
clang++ -I. -I./include -fno-builtin-memcmp -pthread -DOS_LINUX -DLEVELDB_PLATFORM_POSIX -O2
-DNDEBUG        -c db/repair.cc -o db/repair.o
clang++ -I. -I./include -fno-builtin-memcmp -pthread -DOS_LINUX -DLEVELDB_PLATFORM_POSIX -O2
-DNDEBUG        -c db/table_cache.cc -o db/table_cache.o
clang++ -I. -I./include -fno-builtin-memcmp -pthread -DOS_LINUX -DLEVELDB_PLATFORM_POSIX -O2
-DNDEBUG        -c db/version_edit.cc -o db/version_edit.o
clang++ -I. -I./include -fno-builtin-memcmp -pthread -DOS_LINUX -DLEVELDB_PLATFORM_POSIX -O2
-DNDEBUG        -c db/version_set.cc -o db/version_set.o
clang++ -I. -I./include -fno-builtin-memcmp -pthread -DOS_LINUX -DLEVELDB_PLATFORM_POSIX -O2
-DNDEBUG        -c db/write_batch.cc -o db/write_batch.o
clang++ -I. -I./include -fno-builtin-memcmp -pthread -DOS_LINUX -DLEVELDB_PLATFORM_POSIX -O2
-DNDEBUG        -c table/block.cc -o table/block.o
clang++ -I. -I./include -fno-builtin-memcmp -pthread -DOS_LINUX -DLEVELDB_PLATFORM_POSIX -O2
-DNDEBUG        -c table/block_builder.cc -o table/block_builder.o
clang++ -I. -I./include -fno-builtin-memcmp -pthread -DOS_LINUX -DLEVELDB_PLATFORM_POSIX -O2
-DNDEBUG        -c table/filter_block.cc -o table/filter_block.o
clang++ -I. -I./include -fno-builtin-memcmp -pthread -DOS_LINUX -DLEVELDB_PLATFORM_POSIX -O2
-DNDEBUG        -c table/format.cc -o table/format.o
clang++ -I. -I./include -fno-builtin-memcmp -pthread -DOS_LINUX -DLEVELDB_PLATFORM_POSIX -O2
-DNDEBUG        -c table/iterator.cc -o table/iterator.o
clang++ -I. -I./include -fno-builtin-memcmp -pthread -DOS_LINUX -DLEVELDB_PLATFORM_POSIX -O2
-DNDEBUG        -c table/merger.cc -o table/merger.o
clang++ -I. -I./include -fno-builtin-memcmp -pthread -DOS_LINUX -DLEVELDB_PLATFORM_POSIX -O2
-DNDEBUG        -c table/table.cc -o table/table.o
clang++ -I. -I./include -fno-builtin-memcmp -pthread -DOS_LINUX -DLEVELDB_PLATFORM_POSIX -O2
-DNDEBUG        -c table/table_builder.cc -o table/table_builder.o
clang++ -I. -I./include -fno-builtin-memcmp -pthread -DOS_LINUX -DLEVELDB_PLATFORM_POSIX -O2
-DNDEBUG        -c table/two_level_iterator.cc -o table/two_level_iterator.o
clang++ -I. -I./include -fno-builtin-memcmp -pthread -DOS_LINUX -DLEVELDB_PLATFORM_POSIX -O2
-DNDEBUG        -c util/arena.cc -o util/arena.o
clang++ -I. -I./include -fno-builtin-memcmp -pthread -DOS_LINUX -DLEVELDB_PLATFORM_POSIX -O2
-DNDEBUG        -c util/bloom.cc -o util/bloom.o
clang++ -I. -I./include -fno-builtin-memcmp -pthread -DOS_LINUX -DLEVELDB_PLATFORM_POSIX -O2
-DNDEBUG        -c util/cache.cc -o util/cache.o
clang++ -I. -I./include -fno-builtin-memcmp -pthread -DOS_LINUX -DLEVELDB_PLATFORM_POSIX -O2
-DNDEBUG        -c util/coding.cc -o util/coding.o
clang++ -I. -I./include -fno-builtin-memcmp -pthread -DOS_LINUX -DLEVELDB_PLATFORM_POSIX -O2
-DNDEBUG        -c util/comparator.cc -o util/comparator.o
clang++ -I. -I./include -fno-builtin-memcmp -pthread -DOS_LINUX -DLEVELDB_PLATFORM_POSIX -O2
-DNDEBUG        -c util/crc32c.cc -o util/crc32c.o
clang++ -I. -I./include -fno-builtin-memcmp -pthread -DOS_LINUX -DLEVELDB_PLATFORM_POSIX -O2
-DNDEBUG        -c util/env.cc -o util/env.o
clang++ -I. -I./include -fno-builtin-memcmp -pthread -DOS_LINUX -DLEVELDB_PLATFORM_POSIX -O2
-DNDEBUG        -c util/env_posix.cc -o util/env_posix.o
clang++ -I. -I./include -fno-builtin-memcmp -pthread -DOS_LINUX -DLEVELDB_PLATFORM_POSIX -O2
-DNDEBUG        -c util/filter_policy.cc -o util/filter_policy.o
clang++ -I. -I./include -fno-builtin-memcmp -pthread -DOS_LINUX -DLEVELDB_PLATFORM_POSIX -O2
-DNDEBUG        -c util/hash.cc -o util/hash.o
clang++ -I. -I./include -fno-builtin-memcmp -pthread -DOS_LINUX -DLEVELDB_PLATFORM_POSIX -O2
-DNDEBUG        -c util/histogram.cc -o util/histogram.o
clang++ -I. -I./include -fno-builtin-memcmp -pthread -DOS_LINUX -DLEVELDB_PLATFORM_POSIX -O2
-DNDEBUG        -c util/logging.cc -o util/logging.o
clang++ -I. -I./include -fno-builtin-memcmp -pthread -DOS_LINUX -DLEVELDB_PLATFORM_POSIX -O2
-DNDEBUG        -c util/options.cc -o util/options.o
clang++ -I. -I./include -fno-builtin-memcmp -pthread -DOS_LINUX -DLEVELDB_PLATFORM_POSIX -O2
-DNDEBUG        -c util/status.cc -o util/status.o
clang++ -I. -I./include -fno-builtin-memcmp -pthread -DOS_LINUX -DLEVELDB_PLATFORM_POSIX -O2
-DNDEBUG        -c port/port_posix.cc -o port/port_posix.o
rm -f libleveldb.a
ar -rs libleveldb.a db/builder.o db/c.o db/db_impl.o db/db_iter.o db/dbformat.o db/filename.o
db/log_reader.o db/log_writer.o db/memtable.o db/repair.o db/table_cache.o db/version_edit.o
db/version_set.o db/write_batch.o table/block.o table/block_builder.o table/filter_block.o
table/format.o table/iterator.o table/merger.o table/table.o table/table_builder.o table/two_level_iterator.o
util/arena.o util/bloom.o util/cache.o util/coding.o util/comparator.o util/crc32c.o util/env.o
util/env_posix.o util/filter_policy.o util/hash.o util/histogram.o util/logging.o util/options.o
util/status.o port/port_posix.o
ar: creating libleveldb.a
make[3]: Leaving directory `/mesos/build/3rdparty/leveldb-1.4/src/leveldb-1.4'
cd /mesos/build/3rdparty/leveldb-1.4/src/leveldb-1.4-build && /usr/bin/cmake -E touch
/mesos/build/3rdparty/leveldb-1.4/src/leveldb-1.4-stamp/leveldb-1.4-build
/usr/bin/cmake -E cmake_progress_report /mesos/build/CMakeFiles 
[ 40%] Performing install step for 'leveldb-1.4'
cd /mesos/build/3rdparty/leveldb-1.4/src/leveldb-1.4-build && /usr/bin/cmake -E echo

cd /mesos/build/3rdparty/leveldb-1.4/src/leveldb-1.4-build && /usr/bin/cmake -E touch
/mesos/build/3rdparty/leveldb-1.4/src/leveldb-1.4-stamp/leveldb-1.4-install
/usr/bin/cmake -E cmake_progress_report /mesos/build/CMakeFiles 10
[ 41%] Completed 'leveldb-1.4'
cd /mesos/build/3rdparty && /usr/bin/cmake -E make_directory /mesos/build/3rdparty/CMakeFiles
cd /mesos/build/3rdparty && /usr/bin/cmake -E touch /mesos/build/3rdparty/CMakeFiles/leveldb-1.4-complete
cd /mesos/build/3rdparty && /usr/bin/cmake -E touch /mesos/build/3rdparty/leveldb-1.4/src/leveldb-1.4-stamp/leveldb-1.4-done
make[2]: Leaving directory `/mesos/build'
/usr/bin/cmake -E cmake_progress_report /mesos/build/CMakeFiles  10 11
[ 41%] Built target leveldb-1.4
make -f src/CMakeFiles/mesos-1.0.0.dir/build.make src/CMakeFiles/mesos-1.0.0.dir/depend
make[2]: Entering directory `/mesos/build'
/usr/bin/cmake -E cmake_progress_report /mesos/build/CMakeFiles 
/usr/bin/cmake -E cmake_progress_report /mesos/build/CMakeFiles 14
/usr/bin/cmake -E cmake_progress_report /mesos/build/CMakeFiles 
/usr/bin/cmake -E cmake_progress_report /mesos/build/CMakeFiles 
/usr/bin/cmake -E cmake_progress_report /mesos/build/CMakeFiles 
/usr/bin/cmake -E cmake_progress_report /mesos/build/CMakeFiles 15
[ 41%] /usr/bin/cmake -E cmake_progress_report /mesos/build/CMakeFiles 
[ 42%] [ 42%] [ 42%] /usr/bin/cmake -E cmake_progress_report /mesos/build/CMakeFiles 
[ 42%] [ 42%] Generating ../include/mesos/v1/scheduler/scheduler.pb.cc, ../include/mesos/v1/scheduler/scheduler.pb.h
[ 43%] [ 43%] /mesos/build/3rdparty/protobuf-2.6.1/src/protobuf-2.6.1-lib/lib/bin/protoc -I/mesos/include
-I/mesos/src --cpp_out=/mesos/build/include /mesos/include/mesos/v1/scheduler/scheduler.proto
Generating ../include/mesos/authentication/authentication.pb.cc, ../include/mesos/authentication/authentication.pb.h
Generating ../include/mesos/authorizer/acls.pb.cc, ../include/mesos/authorizer/acls.pb.h
/mesos/build/3rdparty/protobuf-2.6.1/src/protobuf-2.6.1-lib/lib/bin/protoc -I/mesos/include
-I/mesos/src --cpp_out=/mesos/build/include /mesos/include/mesos/authentication/authentication.proto
/mesos/build/3rdparty/protobuf-2.6.1/src/protobuf-2.6.1-lib/lib/bin/protoc -I/mesos/include
-I/mesos/src --cpp_out=/mesos/build/include /mesos/include/mesos/authorizer/acls.proto
/usr/bin/cmake -E cmake_progress_report /mesos/build/CMakeFiles 
Generating ../include/mesos/appc/spec.pb.cc, ../include/mesos/appc/spec.pb.h
/mesos/build/3rdparty/protobuf-2.6.1/src/protobuf-2.6.1-lib/lib/bin/protoc -I/mesos/include
-I/mesos/src --cpp_out=/mesos/build/include /mesos/include/mesos/appc/spec.proto
Generating ../include/mesos/docker/spec.pb.cc, ../include/mesos/docker/spec.pb.h
Generating ../include/mesos/containerizer/containerizer.pb.cc, ../include/mesos/containerizer/containerizer.pb.h
Generating ../include/mesos/authorizer/authorizer.pb.cc, ../include/mesos/authorizer/authorizer.pb.h
Generating ../include/mesos/master/allocator.pb.cc, ../include/mesos/master/allocator.pb.h
/mesos/build/3rdparty/protobuf-2.6.1/src/protobuf-2.6.1-lib/lib/bin/protoc -I/mesos/include
-I/mesos/src --cpp_out=/mesos/build/include /mesos/include/mesos/master/allocator.proto
[ 43%] /mesos/build/3rdparty/protobuf-2.6.1/src/protobuf-2.6.1-lib/lib/bin/protoc -I/mesos/include
-I/mesos/src --cpp_out=/mesos/build/include /mesos/include/mesos/containerizer/containerizer.proto
/mesos/build/3rdparty/protobuf-2.6.1/src/protobuf-2.6.1-lib/lib/bin/protoc -I/mesos/include
-I/mesos/src --cpp_out=/mesos/build/include /mesos/include/mesos/authorizer/authorizer.proto
/mesos/build/3rdparty/protobuf-2.6.1/src/protobuf-2.6.1-lib/lib/bin/protoc -I/mesos/include
-I/mesos/src --cpp_out=/mesos/build/include /mesos/include/mesos/docker/spec.proto
/usr/bin/cmake -E cmake_progress_report /mesos/build/CMakeFiles 16
/usr/bin/cmake -E cmake_progress_report /mesos/build/CMakeFiles 
/usr/bin/cmake -E cmake_progress_report /mesos/build/CMakeFiles 
[ 44%] /usr/bin/cmake -E cmake_progress_report /mesos/build/CMakeFiles 
[ 44%] Generating ../include/mesos/docker/v1.pb.cc, ../include/mesos/docker/v1.pb.h
[ 44%] /mesos/build/3rdparty/protobuf-2.6.1/src/protobuf-2.6.1-lib/lib/bin/protoc -I/mesos/include
-I/mesos/src --cpp_out=/mesos/build/include /mesos/include/mesos/docker/v1.proto
/usr/bin/cmake -E cmake_progress_report /mesos/build/CMakeFiles 17
/usr/bin/cmake -E cmake_progress_report /mesos/build/CMakeFiles 
[ 44%] /usr/bin/cmake -E cmake_progress_report /mesos/build/CMakeFiles 
Generating ../include/mesos/docker/v2.pb.cc, ../include/mesos/docker/v2.pb.h
[ 45%] Generating ../include/mesos/fetcher/fetcher.pb.cc, ../include/mesos/fetcher/fetcher.pb.h
Generating ../include/mesos/executor/executor.pb.cc, ../include/mesos/executor/executor.pb.h
[ 45%] /mesos/build/3rdparty/protobuf-2.6.1/src/protobuf-2.6.1-lib/lib/bin/protoc -I/mesos/include
-I/mesos/src --cpp_out=/mesos/build/include /mesos/include/mesos/docker/v2.proto
/mesos/build/3rdparty/protobuf-2.6.1/src/protobuf-2.6.1-lib/lib/bin/protoc -I/mesos/include
-I/mesos/src --cpp_out=/mesos/build/include /mesos/include/mesos/executor/executor.proto
/mesos/build/3rdparty/protobuf-2.6.1/src/protobuf-2.6.1-lib/lib/bin/protoc -I/mesos/include
-I/mesos/src --cpp_out=/mesos/build/include /mesos/include/mesos/fetcher/fetcher.proto
[ 45%] /usr/bin/cmake -E cmake_progress_report /mesos/build/CMakeFiles 
Generating messages/messages.pb.cc, messages/messages.pb.h
Generating messages/log.pb.cc, messages/log.pb.h
/mesos/build/3rdparty/protobuf-2.6.1/src/protobuf-2.6.1-lib/lib/bin/protoc -I/mesos/include
-I/mesos/src --cpp_out=/mesos/build/src /mesos/src/messages/log.proto
/mesos/build/3rdparty/protobuf-2.6.1/src/protobuf-2.6.1-lib/lib/bin/protoc -I/mesos/include
-I/mesos/src --cpp_out=/mesos/build/src /mesos/src/messages/messages.proto
Generating messages/flags.pb.cc, messages/flags.pb.h
/usr/bin/cmake -E cmake_progress_report /mesos/build/CMakeFiles 18
[ 45%] /mesos/build/3rdparty/protobuf-2.6.1/src/protobuf-2.6.1-lib/lib/bin/protoc -I/mesos/include
-I/mesos/src --cpp_out=/mesos/build/src /mesos/src/messages/flags.proto
/usr/bin/cmake -E cmake_progress_report /mesos/build/CMakeFiles 
Generating messages/state.pb.cc, messages/state.pb.h
/mesos/build/3rdparty/protobuf-2.6.1/src/protobuf-2.6.1-lib/lib/bin/protoc -I/mesos/include
-I/mesos/src --cpp_out=/mesos/build/src /mesos/src/messages/state.proto
/usr/bin/cmake -E cmake_progress_report /mesos/build/CMakeFiles 
Generating ../include/mesos/slave/isolator.pb.cc, ../include/mesos/slave/isolator.pb.h
[ 46%] [ 46%] /mesos/build/3rdparty/protobuf-2.6.1/src/protobuf-2.6.1-lib/lib/bin/protoc -I/mesos/include
-I/mesos/src --cpp_out=/mesos/build/include /mesos/include/mesos/slave/isolator.proto
[ 46%] /usr/bin/cmake -E cmake_progress_report /mesos/build/CMakeFiles 
Generating slave/containerizer/mesos/isolators/docker/volume/state.pb.cc, slave/containerizer/mesos/isolators/docker/volume/state.pb.h
/mesos/build/3rdparty/protobuf-2.6.1/src/protobuf-2.6.1-lib/lib/bin/protoc -I/mesos/include
-I/mesos/src --cpp_out=/mesos/build/src /mesos/src/slave/containerizer/mesos/isolators/docker/volume/state.proto
Generating slave/containerizer/mesos/isolators/network/cni/spec.pb.cc, slave/containerizer/mesos/isolators/network/cni/spec.pb.h
/mesos/build/3rdparty/protobuf-2.6.1/src/protobuf-2.6.1-lib/lib/bin/protoc -I/mesos/include
-I/mesos/src --cpp_out=/mesos/build/src /mesos/src/slave/containerizer/mesos/isolators/network/cni/spec.proto
/usr/bin/cmake -E cmake_progress_report /mesos/build/CMakeFiles 19
/usr/bin/cmake -E cmake_progress_report /mesos/build/CMakeFiles 
/usr/bin/cmake -E cmake_progress_report /mesos/build/CMakeFiles 
[ 46%] Generating ../include/mesos/maintenance/maintenance.pb.cc, ../include/mesos/maintenance/maintenance.pb.h
/mesos/build/3rdparty/protobuf-2.6.1/src/protobuf-2.6.1-lib/lib/bin/protoc -I/mesos/include
-I/mesos/src --cpp_out=/mesos/build/include /mesos/include/mesos/maintenance/maintenance.proto
[ 47%] [ 47%] [ 47%] /usr/bin/cmake -E cmake_progress_report /mesos/build/CMakeFiles 
Generating ../include/mesos/module/module.pb.cc, ../include/mesos/module/module.pb.h
/mesos/build/3rdparty/protobuf-2.6.1/src/protobuf-2.6.1-lib/lib/bin/protoc -I/mesos/include
-I/mesos/src --cpp_out=/mesos/build/include /mesos/include/mesos/module/module.proto
/usr/bin/cmake -E cmake_progress_report /mesos/build/CMakeFiles 20
Generating ../include/mesos/mesos.pb.cc, ../include/mesos/mesos.pb.h
/usr/bin/cmake -E cmake_progress_report /mesos/build/CMakeFiles 
/usr/bin/cmake -E cmake_progress_report /mesos/build/CMakeFiles 
Generating ../include/mesos/slave/oversubscription.pb.cc, ../include/mesos/slave/oversubscription.pb.h
/mesos/build/3rdparty/protobuf-2.6.1/src/protobuf-2.6.1-lib/lib/bin/protoc -I/mesos/include
-I/mesos/src --cpp_out=/mesos/build/include /mesos/include/mesos/mesos.proto
/mesos/build/3rdparty/protobuf-2.6.1/src/protobuf-2.6.1-lib/lib/bin/protoc -I/mesos/include
-I/mesos/src --cpp_out=/mesos/build/include /mesos/include/mesos/slave/oversubscription.proto
[ 47%] Generating ../include/mesos/quota/quota.pb.cc, ../include/mesos/quota/quota.pb.h
[ 47%] /mesos/build/3rdparty/protobuf-2.6.1/src/protobuf-2.6.1-lib/lib/bin/protoc -I/mesos/include
-I/mesos/src --cpp_out=/mesos/build/include /mesos/include/mesos/quota/quota.proto
[ 48%] [ 48%] Generating slave/containerizer/mesos/provisioner/docker/message.pb.cc, slave/containerizer/mesos/provisioner/docker/message.pb.h
Generating master/registry.pb.cc, master/registry.pb.h
Generating ../include/mesos/scheduler/scheduler.pb.cc, ../include/mesos/scheduler/scheduler.pb.h
/mesos/build/3rdparty/protobuf-2.6.1/src/protobuf-2.6.1-lib/lib/bin/protoc -I/mesos/include
-I/mesos/src --cpp_out=/mesos/build/src /mesos/src/slave/containerizer/mesos/provisioner/docker/message.proto
/mesos/build/3rdparty/protobuf-2.6.1/src/protobuf-2.6.1-lib/lib/bin/protoc -I/mesos/include
-I/mesos/src --cpp_out=/mesos/build/src /mesos/src/master/registry.proto
/mesos/build/3rdparty/protobuf-2.6.1/src/protobuf-2.6.1-lib/lib/bin/protoc -I/mesos/include
-I/mesos/src --cpp_out=/mesos/build/include /mesos/include/mesos/scheduler/scheduler.proto
/usr/bin/cmake -E cmake_progress_report /mesos/build/CMakeFiles 
Generating ../include/mesos/state/state.pb.cc, ../include/mesos/state/state.pb.h
/usr/bin/cmake -E cmake_progress_report /mesos/build/CMakeFiles 
/mesos/build/3rdparty/protobuf-2.6.1/src/protobuf-2.6.1-lib/lib/bin/protoc -I/mesos/include
-I/mesos/src --cpp_out=/mesos/build/include /mesos/include/mesos/state/state.proto
/usr/bin/cmake -E cmake_progress_report /mesos/build/CMakeFiles 21
[ 48%] [ 48%] /usr/bin/cmake -E cmake_progress_report /mesos/build/CMakeFiles 
/usr/bin/cmake -E cmake_progress_report /mesos/build/CMakeFiles 
Generating ../include/mesos/uri/uri.pb.cc, ../include/mesos/uri/uri.pb.h
[ 49%] /mesos/build/3rdparty/protobuf-2.6.1/src/protobuf-2.6.1-lib/lib/bin/protoc -I/mesos/include
-I/mesos/src --cpp_out=/mesos/build/include /mesos/include/mesos/uri/uri.proto
[ 49%] [ 49%] Generating ../include/mesos/v1/agent.pb.cc, ../include/mesos/v1/agent.pb.h
/mesos/build/3rdparty/protobuf-2.6.1/src/protobuf-2.6.1-lib/lib/bin/protoc -I/mesos/include
-I/mesos/src --cpp_out=/mesos/build/include /mesos/include/mesos/v1/agent.proto
/usr/bin/cmake -E cmake_progress_report /mesos/build/CMakeFiles 
/mesos/include/mesos/v1/agent.proto: No such file or directory
make[2]: *** [include/mesos/v1/agent.pb.cc] Error 1
make[2]: *** Waiting for unfinished jobs....
Generating ../include/mesos/v1/master/allocator.pb.cc, ../include/mesos/v1/master/allocator.pb.h
/mesos/build/3rdparty/protobuf-2.6.1/src/protobuf-2.6.1-lib/lib/bin/protoc -I/mesos/include
-I/mesos/src --cpp_out=/mesos/build/include /mesos/include/mesos/v1/master/allocator.proto
Generating ../include/mesos/v1/maintenance/maintenance.pb.cc, ../include/mesos/v1/maintenance/maintenance.pb.h
[ 49%] /mesos/build/3rdparty/protobuf-2.6.1/src/protobuf-2.6.1-lib/lib/bin/protoc -I/mesos/include
-I/mesos/src --cpp_out=/mesos/build/include /mesos/include/mesos/v1/maintenance/maintenance.proto
Generating ../include/mesos/v1/executor/executor.pb.cc, ../include/mesos/v1/executor/executor.pb.h
/mesos/build/3rdparty/protobuf-2.6.1/src/protobuf-2.6.1-lib/lib/bin/protoc -I/mesos/include
-I/mesos/src --cpp_out=/mesos/build/include /mesos/include/mesos/v1/executor/executor.proto
Generating ../include/mesos/v1/master.pb.cc, ../include/mesos/v1/master.pb.h
/mesos/build/3rdparty/protobuf-2.6.1/src/protobuf-2.6.1-lib/lib/bin/protoc -I/mesos/include
-I/mesos/src --cpp_out=/mesos/build/include /mesos/include/mesos/v1/master.proto
/mesos/include/mesos/v1/master.proto: No such file or directory
make[2]: *** [include/mesos/v1/master.pb.cc] Error 1
make[2]: Leaving directory `/mesos/build'
make[1]: *** [src/CMakeFiles/mesos-1.0.0.dir/all] Error 2
make[1]: Leaving directory `/mesos/build'
make: *** [all] Error 2
+ docker rmi mesos-1466117489-26769
Untagged: mesos-1466117489-26769:latest
Deleted: 2d1010a577e6763a4d2fac088c1f0c5fa94c58fe8b7554b75fa43d0f969092ca
Deleted: d69a26a2ece25059f4d0b9b66672f7488486de9e4c80877091ef927a14fca1ba
Deleted: d4fa879b2199bf69f4b02968e817e92211226d8e0e4c5e99b8dbf3d70e88d3c7
Deleted: b13ac758ef2b5a41b29fac86db430f055d923fb0806875bf23e3c1c611c1b11a
Deleted: 443d7ad75802af7ce4f49b3a0261edbac903cf89af3c5745aaf6f3a3201dea0a
Deleted: d9aec05bae966c4f4a1c37e60afd99e9171eeefcf0418315ba70f158249b43ee
Deleted: e4c18966c74c6df6857cfe2ef93e89d7d98883fec4bfc56ffae89abe3e354eb2
Deleted: d0cbbc9d6e01b6729f199fcf8d1ac885441304b2147ffccfb9ab1ee8c8a47220
Deleted: 9f751847874a2e717fbb4239a4d75f34c61ba157f649635f8264426c8466c1d0
Deleted: b67c0a022998b0ec398774f3b21d4a23935d5c596b153bd0bf38a6df0824c5f4
Deleted: 95a7eea72884334d51e7727ce4f97c2f14791ff68478150a69f9c4e1c5743dd7
Deleted: 6923872d757a8a364946ca257814740c841a8de98473b4262c1a5f7abc347534
Deleted: cd7d0d7fbb675022addb1e573b2e8b63c3fdb740bd46e1bbc720d526f4a2bec9
Deleted: 65dc81207b9d141d027d1b3c5b79c8ca6a342899e7acf42606e47a9fe2978329
Deleted: 671d6d8895b65cc93627dabf07297452367b234a099db55f8f1746cc7f6bbc0d
Build step 'Execute shell' marked build as failure

Mime
View raw message