mesos-builds mailing list archives

Site index · List index
Message view « Date » · « Thread »
Top « Date » · « Thread »
From Apache Jenkins Server <jenk...@builds.apache.org>
Subject Build failed in Jenkins: Mesos » autotools,gcc,--verbose --enable-libevent --enable-ssl,GLOG_v=1 MESOS_VERBOSE=1,centos:7,(docker||Hadoop)&&(!ubuntu-us1)&&(!ubuntu-6) #2395
Date Wed, 29 Jun 2016 17:39:52 GMT
See <https://builds.apache.org/job/Mesos/BUILDTOOL=autotools,COMPILER=gcc,CONFIGURATION=--verbose%20--enable-libevent%20--enable-ssl,ENVIRONMENT=GLOG_v=1%20MESOS_VERBOSE=1,OS=centos%3A7,label_exp=(docker%7C%7CHadoop)&&(!ubuntu-us1)&&(!ubuntu-6)/2395/changes>

Changes:

[anand] Moved the agent exists check to `_reserve/_unreserve`.

[anand] Renamed `agent_id` fields to `slave_id` for unversioned master.proto.

[anand] Moved code to group old/v1 operator API implementations together.

------------------------------------------
[...truncated 197870 lines...]
I0629 17:39:57.602747 29941 resources.cpp:572] Parsing resources as JSON failed: cpus:2;gpus:0;mem:1024;disk:1024;ports:[31000-32000]
Trying semicolon-delimited string format instead
I0629 17:39:57.603087 29941 slave.cpp:592] Agent resources: cpus(*):2; mem(*):1024; disk(*):1024;
ports(*):[31000-32000]
I0629 17:39:57.603144 29941 slave.cpp:600] Agent attributes: [  ]
I0629 17:39:57.603154 29941 slave.cpp:605] Agent hostname: 57c58d38b3aa
I0629 17:39:57.604456 29934 state.cpp:57] Recovering state from '/tmp/Endpoint_SlaveEndpointTest_AuthorizedRequest_1_2RgXtH/meta'
I0629 17:39:57.604533 29941 process.cpp:3279] Handling HTTP event for process 'slave(531)'
with path: '/slave(531)/monitor/statistics.json'
I0629 17:39:57.605108 29941 status_update_manager.cpp:200] Recovering status update manager
I0629 17:39:57.605396 29934 containerizer.cpp:514] Recovering containerizer
I0629 17:39:57.605772 29928 http.cpp:1306] Authorizing principal 'test-principal' to GET the
'/monitor/statistics.json' endpoint
I0629 17:39:57.606991 29935 provisioner.cpp:253] Provisioner recovery complete
I0629 17:39:57.607924 29941 slave.cpp:4840] Finished recovery
I0629 17:39:57.608711 29941 slave.cpp:5012] Querying resource estimator for oversubscribable
resources
I0629 17:39:57.608970 29943 slave.cpp:5026] Received oversubscribable resources  from the
resource estimator
I0629 17:39:57.610039 29933 slave.cpp:839] Agent terminating
[       OK ] Endpoint/SlaveEndpointTest.AuthorizedRequest/1 (21 ms)
[ RUN      ] Endpoint/SlaveEndpointTest.AuthorizedRequest/2
I0629 17:39:57.619338 29909 containerizer.cpp:201] Using isolation: posix/cpu,posix/mem,filesystem/posix,network/cni
W0629 17:39:57.620175 29909 backend.cpp:75] Failed to create 'aufs' backend: AufsBackend requires
root privileges, but is running as user mesos
W0629 17:39:57.620388 29909 backend.cpp:75] Failed to create 'bind' backend: BindBackend requires
root privileges
I0629 17:39:57.623136 29931 slave.cpp:203] Agent started on 532)@172.17.0.2:36458
I0629 17:39:57.623160 29931 slave.cpp:204] Flags at startup: --acls="" --appc_simple_discovery_uri_prefix="http://"
--appc_store_dir="/tmp/mesos/store/appc" --authenticate_http="true" --authenticatee="crammd5"
--authorizer="local" --cgroups_cpu_enable_pids_and_tids_count="false" --cgroups_enable_cfs="false"
--cgroups_hierarchy="/sys/fs/cgroup" --cgroups_limit_swap="false" --cgroups_root="mesos" --container_disk_watch_interval="15secs"
--containerizers="mesos" --credential="/tmp/Endpoint_SlaveEndpointTest_AuthorizedRequest_2_JLXSsS/credential"
--default_role="*" --disk_watch_interval="1mins" --docker="docker" --docker_kill_orphans="true"
--docker_registry="https://registry-1.docker.io" --docker_remove_delay="6hrs" --docker_socket="/var/run/docker.sock"
--docker_stop_timeout="0ns" --docker_store_dir="/tmp/mesos/store/docker" --docker_volume_checkpoint_dir="/var/run/mesos/isolators/docker/volume"
--enforce_container_disk_quota="false" --executor_registration_timeout="1mins" --executor_shutdown_grace_period="5secs"
--fetcher_cache_dir="/tmp/Endpoint_SlaveEndpointTest_AuthorizedRequest_2_JLXSsS/fetch" --fetcher_cache_size="2GB"
--frameworks_home="" --gc_delay="1weeks" --gc_disk_headroom="0.1" --hadoop_home="" --help="true"
--hostname_lookup="true" --http_authenticators="basic" --http_command_executor="false" --http_credentials="/tmp/Endpoint_SlaveEndpointTest_AuthorizedRequest_2_JLXSsS/http_credentials"
--image_provisioner_backend="copy" --initialize_driver_logging="true" --isolation="posix/cpu,posix/mem"
--launcher_dir="/mesos/mesos-1.0.0/_build/src" --logbufsecs="0" --logging_level="INFO" --oversubscribed_resources_interval="15secs"
--perf_duration="10secs" --perf_interval="1mins" --qos_correction_interval_min="0ns" --quiet="false"
--recover="reconnect" --recovery_timeout="15mins" --registration_backoff_factor="10ms" --resources="cpus:2;gpus:0;mem:1024;disk:1024;ports:[31000-32000]"
--revocable_cpu_low_priority="true" --sandbox_directory="/mnt/mesos/sandbox" --strict="true"
--switch_user="true" --systemd_enable_support="true" --systemd_runtime_directory="/run/systemd/system"
--version="false" --work_dir="/tmp/Endpoint_SlaveEndpointTest_AuthorizedRequest_2_JLXSsS"
I0629 17:39:57.623611 29931 credentials.hpp:86] Loading credential for authentication from
'/tmp/Endpoint_SlaveEndpointTest_AuthorizedRequest_2_JLXSsS/credential'
I0629 17:39:57.623783 29931 slave.cpp:341] Agent using credential for: test-principal
I0629 17:39:57.623819 29931 credentials.hpp:37] Loading credentials for authentication from
'/tmp/Endpoint_SlaveEndpointTest_AuthorizedRequest_2_JLXSsS/http_credentials'
I0629 17:39:57.624058 29931 slave.cpp:393] Using default 'basic' HTTP authenticator
I0629 17:39:57.624516 29931 resources.cpp:572] Parsing resources as JSON failed: cpus:2;gpus:0;mem:1024;disk:1024;ports:[31000-32000]
Trying semicolon-delimited string format instead
I0629 17:39:57.624799 29931 resources.cpp:572] Parsing resources as JSON failed: cpus:2;gpus:0;mem:1024;disk:1024;ports:[31000-32000]
Trying semicolon-delimited string format instead
I0629 17:39:57.625171 29931 slave.cpp:592] Agent resources: cpus(*):2; mem(*):1024; disk(*):1024;
ports(*):[31000-32000]
I0629 17:39:57.625229 29931 slave.cpp:600] Agent attributes: [  ]
I0629 17:39:57.625239 29931 slave.cpp:605] Agent hostname: 57c58d38b3aa
I0629 17:39:57.626528 29940 state.cpp:57] Recovering state from '/tmp/Endpoint_SlaveEndpointTest_AuthorizedRequest_2_JLXSsS/meta'
I0629 17:39:57.626613 29931 process.cpp:3279] Handling HTTP event for process 'slave(532)'
with path: '/slave(532)/containers'
I0629 17:39:57.627089 29933 status_update_manager.cpp:200] Recovering status update manager
I0629 17:39:57.627357 29936 containerizer.cpp:514] Recovering containerizer
I0629 17:39:57.627768 29929 http.cpp:1306] Authorizing principal 'test-principal' to GET the
'/containers' endpoint
I0629 17:39:57.628698 29930 provisioner.cpp:253] Provisioner recovery complete
I0629 17:39:57.629041 29938 slave.cpp:4840] Finished recovery
I0629 17:39:57.629606 29938 slave.cpp:5012] Querying resource estimator for oversubscribable
resources
I0629 17:39:57.630075 29928 slave.cpp:5026] Received oversubscribable resources  from the
resource estimator
I0629 17:39:57.630259 29933 slave.cpp:839] Agent terminating
[       OK ] Endpoint/SlaveEndpointTest.AuthorizedRequest/2 (19 ms)
[ RUN      ] Endpoint/SlaveEndpointTest.UnauthorizedRequest/0
I0629 17:39:57.638703 29909 containerizer.cpp:201] Using isolation: posix/cpu,posix/mem,filesystem/posix,network/cni
W0629 17:39:57.639443 29909 backend.cpp:75] Failed to create 'aufs' backend: AufsBackend requires
root privileges, but is running as user mesos
W0629 17:39:57.639621 29909 backend.cpp:75] Failed to create 'bind' backend: BindBackend requires
root privileges
I0629 17:39:57.642686 29931 slave.cpp:203] Agent started on 533)@172.17.0.2:36458
I0629 17:39:57.642712 29931 slave.cpp:204] Flags at startup: --acls="" --appc_simple_discovery_uri_prefix="http://"
--appc_store_dir="/tmp/mesos/store/appc" --authenticate_http="true" --authenticatee="crammd5"
--authorizer="local" --cgroups_cpu_enable_pids_and_tids_count="false" --cgroups_enable_cfs="false"
--cgroups_hierarchy="/sys/fs/cgroup" --cgroups_limit_swap="false" --cgroups_root="mesos" --container_disk_watch_interval="15secs"
--containerizers="mesos" --credential="/tmp/Endpoint_SlaveEndpointTest_UnauthorizedRequest_0_mQwAB3/credential"
--default_role="*" --disk_watch_interval="1mins" --docker="docker" --docker_kill_orphans="true"
--docker_registry="https://registry-1.docker.io" --docker_remove_delay="6hrs" --docker_socket="/var/run/docker.sock"
--docker_stop_timeout="0ns" --docker_store_dir="/tmp/mesos/store/docker" --docker_volume_checkpoint_dir="/var/run/mesos/isolators/docker/volume"
--enforce_container_disk_quota="false" --executor_registration_timeout="1mins" --executor_shutdown_grace_period="5secs"
--fetcher_cache_dir="/tmp/Endpoint_SlaveEndpointTest_UnauthorizedRequest_0_mQwAB3/fetch" --fetcher_cache_size="2GB"
--frameworks_home="" --gc_delay="1weeks" --gc_disk_headroom="0.1" --hadoop_home="" --help="true"
--hostname_lookup="true" --http_authenticators="basic" --http_command_executor="false" --http_credentials="/tmp/Endpoint_SlaveEndpointTest_UnauthorizedRequest_0_mQwAB3/http_credentials"
--image_provisioner_backend="copy" --initialize_driver_logging="true" --isolation="posix/cpu,posix/mem"
--launcher_dir="/mesos/mesos-1.0.0/_build/src" --logbufsecs="0" --logging_level="INFO" --oversubscribed_resources_interval="15secs"
--perf_duration="10secs" --perf_interval="1mins" --qos_correction_interval_min="0ns" --quiet="false"
--recover="reconnect" --recovery_timeout="15mins" --registration_backoff_factor="10ms" --resources="cpus:2;gpus:0;mem:1024;disk:1024;ports:[31000-32000]"
--revocable_cpu_low_priority="true" --sandbox_directory="/mnt/mesos/sandbox" --strict="true"
--switch_user="true" --systemd_enable_support="true" --systemd_runtime_directory="/run/systemd/system"
--version="false" --work_dir="/tmp/Endpoint_SlaveEndpointTest_UnauthorizedRequest_0_mQwAB3"
I0629 17:39:57.643141 29931 credentials.hpp:86] Loading credential for authentication from
'/tmp/Endpoint_SlaveEndpointTest_UnauthorizedRequest_0_mQwAB3/credential'
I0629 17:39:57.643321 29931 slave.cpp:341] Agent using credential for: test-principal
I0629 17:39:57.643457 29931 credentials.hpp:37] Loading credentials for authentication from
'/tmp/Endpoint_SlaveEndpointTest_UnauthorizedRequest_0_mQwAB3/http_credentials'
I0629 17:39:57.643697 29931 slave.cpp:393] Using default 'basic' HTTP authenticator
I0629 17:39:57.644517 29931 resources.cpp:572] Parsing resources as JSON failed: cpus:2;gpus:0;mem:1024;disk:1024;ports:[31000-32000]
Trying semicolon-delimited string format instead
I0629 17:39:57.645045 29931 resources.cpp:572] Parsing resources as JSON failed: cpus:2;gpus:0;mem:1024;disk:1024;ports:[31000-32000]
Trying semicolon-delimited string format instead
I0629 17:39:57.645668 29931 slave.cpp:592] Agent resources: cpus(*):2; mem(*):1024; disk(*):1024;
ports(*):[31000-32000]
I0629 17:39:57.645763 29931 slave.cpp:600] Agent attributes: [  ]
I0629 17:39:57.645783 29931 slave.cpp:605] Agent hostname: 57c58d38b3aa
I0629 17:39:57.647644 29940 state.cpp:57] Recovering state from '/tmp/Endpoint_SlaveEndpointTest_UnauthorizedRequest_0_mQwAB3/meta'
I0629 17:39:57.647760 29931 process.cpp:3279] Handling HTTP event for process 'slave(533)'
with path: '/slave(533)/monitor/statistics'
I0629 17:39:57.648247 29928 status_update_manager.cpp:200] Recovering status update manager
I0629 17:39:57.648571 29936 containerizer.cpp:514] Recovering containerizer
I0629 17:39:57.648672 29932 http.cpp:1306] Authorizing principal 'test-principal' to GET the
'/monitor/statistics' endpoint
I0629 17:39:57.650192 29935 provisioner.cpp:253] Provisioner recovery complete
I0629 17:39:57.650738 29942 slave.cpp:839] Agent terminating
[       OK ] Endpoint/SlaveEndpointTest.UnauthorizedRequest/0 (21 ms)
[ RUN      ] Endpoint/SlaveEndpointTest.UnauthorizedRequest/1
I0629 17:39:57.660182 29909 containerizer.cpp:201] Using isolation: posix/cpu,posix/mem,filesystem/posix,network/cni
W0629 17:39:57.660986 29909 backend.cpp:75] Failed to create 'aufs' backend: AufsBackend requires
root privileges, but is running as user mesos
W0629 17:39:57.661144 29909 backend.cpp:75] Failed to create 'bind' backend: BindBackend requires
root privileges
I0629 17:39:57.664451 29940 slave.cpp:203] Agent started on 534)@172.17.0.2:36458
I0629 17:39:57.664474 29940 slave.cpp:204] Flags at startup: --acls="" --appc_simple_discovery_uri_prefix="http://"
--appc_store_dir="/tmp/mesos/store/appc" --authenticate_http="true" --authenticatee="crammd5"
--authorizer="local" --cgroups_cpu_enable_pids_and_tids_count="false" --cgroups_enable_cfs="false"
--cgroups_hierarchy="/sys/fs/cgroup" --cgroups_limit_swap="false" --cgroups_root="mesos" --container_disk_watch_interval="15secs"
--containerizers="mesos" --credential="/tmp/Endpoint_SlaveEndpointTest_UnauthorizedRequest_1_yNFF9a/credential"
--default_role="*" --disk_watch_interval="1mins" --docker="docker" --docker_kill_orphans="true"
--docker_registry="https://registry-1.docker.io" --docker_remove_delay="6hrs" --docker_socket="/var/run/docker.sock"
--docker_stop_timeout="0ns" --docker_store_dir="/tmp/mesos/store/docker" --docker_volume_checkpoint_dir="/var/run/mesos/isolators/docker/volume"
--enforce_container_disk_quota="false" --executor_registration_timeout="1mins" --executor_shutdown_grace_period="5secs"
--fetcher_cache_dir="/tmp/Endpoint_SlaveEndpointTest_UnauthorizedRequest_1_yNFF9a/fetch" --fetcher_cache_size="2GB"
--frameworks_home="" --gc_delay="1weeks" --gc_disk_headroom="0.1" --hadoop_home="" --help="true"
--hostname_lookup="true" --http_authenticators="basic" --http_command_executor="false" --http_credentials="/tmp/Endpoint_SlaveEndpointTest_UnauthorizedRequest_1_yNFF9a/http_credentials"
--image_provisioner_backend="copy" --initialize_driver_logging="true" --isolation="posix/cpu,posix/mem"
--launcher_dir="/mesos/mesos-1.0.0/_build/src" --logbufsecs="0" --logging_level="INFO" --oversubscribed_resources_interval="15secs"
--perf_duration="10secs" --perf_interval="1mins" --qos_correction_interval_min="0ns" --quiet="false"
--recover="reconnect" --recovery_timeout="15mins" --registration_backoff_factor="10ms" --resources="cpus:2;gpus:0;mem:1024;disk:1024;ports:[31000-32000]"
--revocable_cpu_low_priority="true" --sandbox_directory="/mnt/mesos/sandbox" --strict="true"
--switch_user="true" --systemd_enable_support="true" --systemd_runtime_directory="/run/systemd/system"
--version="false" --work_dir="/tmp/Endpoint_SlaveEndpointTest_UnauthorizedRequest_1_yNFF9a"
I0629 17:39:57.665055 29940 credentials.hpp:86] Loading credential for authentication from
'/tmp/Endpoint_SlaveEndpointTest_UnauthorizedRequest_1_yNFF9a/credential'
I0629 17:39:57.665243 29940 slave.cpp:341] Agent using credential for: test-principal
I0629 17:39:57.665300 29940 credentials.hpp:37] Loading credentials for authentication from
'/tmp/Endpoint_SlaveEndpointTest_UnauthorizedRequest_1_yNFF9a/http_credentials'
I0629 17:39:57.665588 29940 slave.cpp:393] Using default 'basic' HTTP authenticator
I0629 17:39:57.666092 29940 resources.cpp:572] Parsing resources as JSON failed: cpus:2;gpus:0;mem:1024;disk:1024;ports:[31000-32000]
Trying semicolon-delimited string format instead
I0629 17:39:57.666461 29940 resources.cpp:572] Parsing resources as JSON failed: cpus:2;gpus:0;mem:1024;disk:1024;ports:[31000-32000]
Trying semicolon-delimited string format instead
I0629 17:39:57.666919 29940 slave.cpp:592] Agent resources: cpus(*):2; mem(*):1024; disk(*):1024;
ports(*):[31000-32000]
I0629 17:39:57.666990 29940 slave.cpp:600] Agent attributes: [  ]
I0629 17:39:57.667002 29940 slave.cpp:605] Agent hostname: 57c58d38b3aa
I0629 17:39:57.668434 29933 state.cpp:57] Recovering state from '/tmp/Endpoint_SlaveEndpointTest_UnauthorizedRequest_1_yNFF9a/meta'
I0629 17:39:57.668510 29940 process.cpp:3279] Handling HTTP event for process 'slave(534)'
with path: '/slave(534)/monitor/statistics.json'
I0629 17:39:57.669039 29937 status_update_manager.cpp:200] Recovering status update manager
I0629 17:39:57.669226 29937 containerizer.cpp:514] Recovering containerizer
I0629 17:39:57.669502 29930 http.cpp:1306] Authorizing principal 'test-principal' to GET the
'/monitor/statistics.json' endpoint
I0629 17:39:57.670845 29936 provisioner.cpp:253] Provisioner recovery complete
I0629 17:39:57.671315 29941 slave.cpp:4840] Finished recovery
I0629 17:39:57.671957 29941 slave.cpp:5012] Querying resource estimator for oversubscribable
resources
I0629 17:39:57.672091 29941 slave.cpp:839] Agent terminating
[       OK ] Endpoint/SlaveEndpointTest.UnauthorizedRequest/1 (20 ms)
[ RUN      ] Endpoint/SlaveEndpointTest.UnauthorizedRequest/2
I0629 17:39:57.681236 29909 containerizer.cpp:201] Using isolation: posix/cpu,posix/mem,filesystem/posix,network/cni
W0629 17:39:57.682034 29909 backend.cpp:75] Failed to create 'aufs' backend: AufsBackend requires
root privileges, but is running as user mesos
W0629 17:39:57.682198 29909 backend.cpp:75] Failed to create 'bind' backend: BindBackend requires
root privileges
I0629 17:39:57.685523 29928 slave.cpp:203] Agent started on 535)@172.17.0.2:36458
I0629 17:39:57.685545 29928 slave.cpp:204] Flags at startup: --acls="" --appc_simple_discovery_uri_prefix="http://"
--appc_store_dir="/tmp/mesos/store/appc" --authenticate_http="true" --authenticatee="crammd5"
--authorizer="local" --cgroups_cpu_enable_pids_and_tids_count="false" --cgroups_enable_cfs="false"
--cgroups_hierarchy="/sys/fs/cgroup" --cgroups_limit_swap="false" --cgroups_root="mesos" --container_disk_watch_interval="15secs"
--containerizers="mesos" --credential="/tmp/Endpoint_SlaveEndpointTest_UnauthorizedRequest_2_S5m1Cm/credential"
--default_role="*" --disk_watch_interval="1mins" --docker="docker" --docker_kill_orphans="true"
--docker_registry="https://registry-1.docker.io" --docker_remove_delay="6hrs" --docker_socket="/var/run/docker.sock"
--docker_stop_timeout="0ns" --docker_store_dir="/tmp/mesos/store/docker" --docker_volume_checkpoint_dir="/var/run/mesos/isolators/docker/volume"
--enforce_container_disk_quota="false" --executor_registration_timeout="1mins" --executor_shutdown_grace_period="5secs"
--fetcher_cache_dir="/tmp/Endpoint_SlaveEndpointTest_UnauthorizedRequest_2_S5m1Cm/fetch" --fetcher_cache_size="2GB"
--frameworks_home="" --gc_delay="1weeks" --gc_disk_headroom="0.1" --hadoop_home="" --help="true"
--hostname_lookup="true" --http_authenticators="basic" --http_command_executor="false" --http_credentials="/tmp/Endpoint_SlaveEndpointTest_UnauthorizedRequest_2_S5m1Cm/http_credentials"
--image_provisioner_backend="copy" --initialize_driver_logging="true" --isolation="posix/cpu,posix/mem"
--launcher_dir="/mesos/mesos-1.0.0/_build/src" --logbufsecs="0" --logging_level="INFO" --oversubscribed_resources_interval="15secs"
--perf_duration="10secs" --perf_interval="1mins" --qos_correction_interval_min="0ns" --quiet="false"
--recover="reconnect" --recovery_timeout="15mins" --registration_backoff_factor="10ms" --resources="cpus:2;gpus:0;mem:1024;disk:1024;ports:[31000-32000]"
--revocable_cpu_low_priority="true" --sandbox_directory="/mnt/mesos/sandbox" --strict="true"
--switch_user="true" --systemd_enable_support="true" --systemd_runtime_directory="/run/systemd/system"
--version="false" --work_dir="/tmp/Endpoint_SlaveEndpointTest_UnauthorizedRequest_2_S5m1Cm"
I0629 17:39:57.686069 29928 credentials.hpp:86] Loading credential for authentication from
'/tmp/Endpoint_SlaveEndpointTest_UnauthorizedRequest_2_S5m1Cm/credential'
I0629 17:39:57.686254 29928 slave.cpp:341] Agent using credential for: test-principal
I0629 17:39:57.686326 29928 credentials.hpp:37] Loading credentials for authentication from
'/tmp/Endpoint_SlaveEndpointTest_UnauthorizedRequest_2_S5m1Cm/http_credentials'
I0629 17:39:57.686599 29928 slave.cpp:393] Using default 'basic' HTTP authenticator
I0629 17:39:57.686977 29928 resources.cpp:572] Parsing resources as JSON failed: cpus:2;gpus:0;mem:1024;disk:1024;ports:[31000-32000]
Trying semicolon-delimited string format instead
I0629 17:39:57.687366 29928 resources.cpp:572] Parsing resources as JSON failed: cpus:2;gpus:0;mem:1024;disk:1024;ports:[31000-32000]
Trying semicolon-delimited string format instead
I0629 17:39:57.687819 29928 slave.cpp:592] Agent resources: cpus(*):2; mem(*):1024; disk(*):1024;
ports(*):[31000-32000]
I0629 17:39:57.687886 29928 slave.cpp:600] Agent attributes: [  ]
I0629 17:39:57.687899 29928 slave.cpp:605] Agent hostname: 57c58d38b3aa
I0629 17:39:57.689419 29941 state.cpp:57] Recovering state from '/tmp/Endpoint_SlaveEndpointTest_UnauthorizedRequest_2_S5m1Cm/meta'
I0629 17:39:57.689538 29928 process.cpp:3279] Handling HTTP event for process 'slave(535)'
with path: '/slave(535)/containers'
I0629 17:39:57.690150 29938 status_update_manager.cpp:200] Recovering status update manager
I0629 17:39:57.690455 29934 containerizer.cpp:514] Recovering containerizer
I0629 17:39:57.690585 29943 http.cpp:1306] Authorizing principal 'test-principal' to GET the
'/containers' endpoint
I0629 17:39:57.691716 29928 provisioner.cpp:253] Provisioner recovery complete
I0629 17:39:57.692358 29933 slave.cpp:4840] Finished recovery
I0629 17:39:57.692867 29933 slave.cpp:5012] Querying resource estimator for oversubscribable
resources
I0629 17:39:57.693001 29933 slave.cpp:839] Agent terminating
[       OK ] Endpoint/SlaveEndpointTest.UnauthorizedRequest/2 (20 ms)
[ RUN      ] Endpoint/SlaveEndpointTest.NoAuthorizer/0
I0629 17:39:57.701871 29909 containerizer.cpp:201] Using isolation: posix/cpu,posix/mem,filesystem/posix,network/cni
W0629 17:39:57.702704 29909 backend.cpp:75] Failed to create 'aufs' backend: AufsBackend requires
root privileges, but is running as user mesos
W0629 17:39:57.702886 29909 backend.cpp:75] Failed to create 'bind' backend: BindBackend requires
root privileges
I0629 17:39:57.704633 29909 cluster.cpp:432] Creating default 'local' authorizer
I0629 17:39:57.706599 29936 slave.cpp:203] Agent started on 536)@172.17.0.2:36458
I0629 17:39:57.706627 29936 slave.cpp:204] Flags at startup: --acls="" --appc_simple_discovery_uri_prefix="http://"
--appc_store_dir="/tmp/mesos/store/appc" --authenticate_http="true" --authenticatee="crammd5"
--authorizer="local" --cgroups_cpu_enable_pids_and_tids_count="false" --cgroups_enable_cfs="false"
--cgroups_hierarchy="/sys/fs/cgroup" --cgroups_limit_swap="false" --cgroups_root="mesos" --container_disk_watch_interval="15secs"
--containerizers="mesos" --credential="/tmp/Endpoint_SlaveEndpointTest_NoAuthorizer_0_JLftgy/credential"
--default_role="*" --disk_watch_interval="1mins" --docker="docker" --docker_kill_orphans="true"
--docker_registry="https://registry-1.docker.io" --docker_remove_delay="6hrs" --docker_socket="/var/run/docker.sock"
--docker_stop_timeout="0ns" --docker_store_dir="/tmp/mesos/store/docker" --docker_volume_checkpoint_dir="/var/run/mesos/isolators/docker/volume"
--enforce_container_disk_quota="false" --executor_registration_timeout="1mins" --executor_shutdown_grace_period="5secs"
--fetcher_cache_dir="/tmp/Endpoint_SlaveEndpointTest_NoAuthorizer_0_JLftgy/fetch" --fetcher_cache_size="2GB"
--frameworks_home="" --gc_delay="1weeks" --gc_disk_headroom="0.1" --hadoop_home="" --help="false"
--hostname_lookup="true" --http_authenticators="basic" --http_command_executor="false" --http_credentials="/tmp/Endpoint_SlaveEndpointTest_NoAuthorizer_0_JLftgy/http_credentials"
--image_provisioner_backend="copy" --initialize_driver_logging="true" --isolation="posix/cpu,posix/mem"
--launcher_dir="/mesos/mesos-1.0.0/_build/src" --logbufsecs="0" --logging_level="INFO" --oversubscribed_resources_interval="15secs"
--perf_duration="10secs" --perf_interval="1mins" --qos_correction_interval_min="0ns" --quiet="false"
--recover="reconnect" --recovery_timeout="15mins" --registration_backoff_factor="10ms" --resources="cpus:2;gpus:0;mem:1024;disk:1024;ports:[31000-32000]"
--revocable_cpu_low_priority="true" --sandbox_directory="/mnt/mesos/sandbox" --strict="true"
--switch_user="true" --systemd_enable_support="true" --systemd_runtime_directory="/run/systemd/system"
--version="false" --work_dir="/tmp/Endpoint_SlaveEndpointTest_NoAuthorizer_0_JLftgy"
I0629 17:39:57.707154 29936 credentials.hpp:86] Loading credential for authentication from
'/tmp/Endpoint_SlaveEndpointTest_NoAuthorizer_0_JLftgy/credential'
I0629 17:39:57.707356 29936 slave.cpp:341] Agent using credential for: test-principal
I0629 17:39:57.707521 29936 credentials.hpp:37] Loading credentials for authentication from
'/tmp/Endpoint_SlaveEndpointTest_NoAuthorizer_0_JLftgy/http_credentials'
I0629 17:39:57.707847 29936 slave.cpp:393] Using default 'basic' HTTP authenticator
I0629 17:39:57.708264 29936 resources.cpp:572] Parsing resources as JSON failed: cpus:2;gpus:0;mem:1024;disk:1024;ports:[31000-32000]
Trying semicolon-delimited string format instead
I0629 17:39:57.708684 29936 resources.cpp:572] Parsing resources as JSON failed: cpus:2;gpus:0;mem:1024;disk:1024;ports:[31000-32000]
Trying semicolon-delimited string format instead
I0629 17:39:57.709197 29936 slave.cpp:592] Agent resources: cpus(*):2; mem(*):1024; disk(*):1024;
ports(*):[31000-32000]
I0629 17:39:57.709291 29936 slave.cpp:600] Agent attributes: [  ]
I0629 17:39:57.709317 29936 slave.cpp:605] Agent hostname: 57c58d38b3aa
I0629 17:39:57.710911 29943 state.cpp:57] Recovering state from '/tmp/Endpoint_SlaveEndpointTest_NoAuthorizer_0_JLftgy/meta'
I0629 17:39:57.711002 29936 process.cpp:3279] Handling HTTP event for process 'slave(536)'
with path: '/slave(536)/monitor/statistics'
I0629 17:39:57.711711 29940 status_update_manager.cpp:200] Recovering status update manager
I0629 17:39:57.712046 29939 containerizer.cpp:514] Recovering containerizer
I0629 17:39:57.712357 29929 http.cpp:1306] Authorizing principal 'test-principal' to GET the
'/monitor/statistics' endpoint
I0629 17:39:57.713619 29943 provisioner.cpp:253] Provisioner recovery complete
I0629 17:39:57.713935 29939 slave.cpp:4840] Finished recovery
I0629 17:39:57.715229 29939 slave.cpp:5012] Querying resource estimator for oversubscribable
resources
I0629 17:39:57.715423 29929 slave.cpp:5026] Received oversubscribable resources  from the
resource estimator
I0629 17:39:57.716135 29943 slave.cpp:839] Agent terminating
[       OK ] Endpoint/SlaveEndpointTest.NoAuthorizer/0 (23 ms)
[ RUN      ] Endpoint/SlaveEndpointTest.NoAuthorizer/1
I0629 17:39:57.725682 29909 containerizer.cpp:201] Using isolation: posix/cpu,posix/mem,filesystem/posix,network/cni
W0629 17:39:57.726521 29909 backend.cpp:75] Failed to create 'aufs' backend: AufsBackend requires
root privileges, but is running as user mesos
W0629 17:39:57.726704 29909 backend.cpp:75] Failed to create 'bind' backend: BindBackend requires
root privileges
I0629 17:39:57.728550 29909 cluster.cpp:432] Creating default 'local' authorizer
I0629 17:39:57.730525 29935 slave.cpp:203] Agent started on 537)@172.17.0.2:36458
I0629 17:39:57.730546 29935 slave.cpp:204] Flags at startup: --acls="" --appc_simple_discovery_uri_prefix="http://"
--appc_store_dir="/tmp/mesos/store/appc" --authenticate_http="true" --authenticatee="crammd5"
--authorizer="local" --cgroups_cpu_enable_pids_and_tids_count="false" --cgroups_enable_cfs="false"
--cgroups_hierarchy="/sys/fs/cgroup" --cgroups_limit_swap="false" --cgroups_root="mesos" --container_disk_watch_interval="15secs"
--containerizers="mesos" --credential="/tmp/Endpoint_SlaveEndpointTest_NoAuthorizer_1_O2W94J/credential"
--default_role="*" --disk_watch_interval="1mins" --docker="docker" --docker_kill_orphans="true"
--docker_registry="https://registry-1.docker.io" --docker_remove_delay="6hrs" --docker_socket="/var/run/docker.sock"
--docker_stop_timeout="0ns" --docker_store_dir="/tmp/mesos/store/docker" --docker_volume_checkpoint_dir="/var/run/mesos/isolators/docker/volume"
--enforce_container_disk_quota="false" --executor_registration_timeout="1mins" --executor_shutdown_grace_period="5secs"
--fetcher_cache_dir="/tmp/Endpoint_SlaveEndpointTest_NoAuthorizer_1_O2W94J/fetch" --fetcher_cache_size="2GB"
--frameworks_home="" --gc_delay="1weeks" --gc_disk_headroom="0.1" --hadoop_home="" --help="false"
--hostname_lookup="true" --http_authenticators="basic" --http_command_executor="false" --http_credentials="/tmp/Endpoint_SlaveEndpointTest_NoAuthorizer_1_O2W94J/http_credentials"
--image_provisioner_backend="copy" --initialize_driver_logging="true" --isolation="posix/cpu,posix/mem"
--launcher_dir="/mesos/mesos-1.0.0/_build/src" --logbufsecs="0" --logging_level="INFO" --oversubscribed_resources_interval="15secs"
--perf_duration="10secs" --perf_interval="1mins" --qos_correction_interval_min="0ns" --quiet="false"
--recover="reconnect" --recovery_timeout="15mins" --registration_backoff_factor="10ms" --resources="cpus:2;gpus:0;mem:1024;disk:1024;ports:[31000-32000]"
--revocable_cpu_low_priority="true" --sandbox_directory="/mnt/mesos/sandbox" --strict="true"
--switch_user="true" --systemd_enable_support="true" --systemd_runtime_directory="/run/systemd/system"
--version="false" --work_dir="/tmp/Endpoint_SlaveEndpointTest_NoAuthorizer_1_O2W94J"
I0629 17:39:57.730929 29935 credentials.hpp:86] Loading credential for authentication from
'/tmp/Endpoint_SlaveEndpointTest_NoAuthorizer_1_O2W94J/credential'
I0629 17:39:57.731055 29935 slave.cpp:341] Agent using credential for: test-principal
I0629 17:39:57.731081 29935 credentials.hpp:37] Loading credentials for authentication from
'/tmp/Endpoint_SlaveEndpointTest_NoAuthorizer_1_O2W94J/http_credentials'
I0629 17:39:57.731356 29935 slave.cpp:393] Using default 'basic' HTTP authenticator
I0629 17:39:57.731698 29935 resources.cpp:572] Parsing resources as JSON failed: cpus:2;gpus:0;mem:1024;disk:1024;ports:[31000-32000]
Trying semicolon-delimited string format instead
I0629 17:39:57.732043 29935 resources.cpp:572] Parsing resources as JSON failed: cpus:2;gpus:0;mem:1024;disk:1024;ports:[31000-32000]
Trying semicolon-delimited string format instead
I0629 17:39:57.732437 29935 slave.cpp:592] Agent resources: cpus(*):2; mem(*):1024; disk(*):1024;
ports(*):[31000-32000]
I0629 17:39:57.732511 29935 slave.cpp:600] Agent attributes: [  ]
I0629 17:39:57.732524 29935 slave.cpp:605] Agent hostname: 57c58d38b3aa
I0629 17:39:57.733973 29928 state.cpp:57] Recovering state from '/tmp/Endpoint_SlaveEndpointTest_NoAuthorizer_1_O2W94J/meta'
I0629 17:39:57.734032 29935 process.cpp:3279] Handling HTTP event for process 'slave(537)'
with path: '/slave(537)/monitor/statistics.json'
I0629 17:39:57.734429 29928 status_update_manager.cpp:200] Recovering status update manager
I0629 17:39:57.734572 29942 containerizer.cpp:514] Recovering containerizer
I0629 17:39:57.734956 29932 http.cpp:1306] Authorizing principal 'test-principal' to GET the
'/monitor/statistics.json' endpoint
I0629 17:39:57.735592 29939 provisioner.cpp:253] Provisioner recovery complete
I0629 17:39:57.736217 29935 slave.cpp:4840] Finished recovery
I0629 17:39:57.736747 29935 slave.cpp:5012] Querying resource estimator for oversubscribable
resources
I0629 17:39:57.736909 29933 slave.cpp:5026] Received oversubscribable resources  from the
resource estimator
I0629 17:39:57.737756 29934 slave.cpp:839] Agent terminating
[       OK ] Endpoint/SlaveEndpointTest.NoAuthorizer/1 (20 ms)
[ RUN      ] Endpoint/SlaveEndpointTest.NoAuthorizer/2
I0629 17:39:57.745759 29909 containerizer.cpp:201] Using isolation: posix/cpu,posix/mem,filesystem/posix,network/cni
W0629 17:39:57.746520 29909 backend.cpp:75] Failed to create 'aufs' backend: AufsBackend requires
root privileges, but is running as user mesos
W0629 17:39:57.746687 29909 backend.cpp:75] Failed to create 'bind' backend: BindBackend requires
root privileges
I0629 17:39:57.748132 29909 cluster.cpp:432] Creating default 'local' authorizer
I0629 17:39:57.749853 29935 slave.cpp:203] Agent started on 538)@172.17.0.2:36458
I0629 17:39:57.749877 29935 slave.cpp:204] Flags at startup: --acls="" --appc_simple_discovery_uri_prefix="http://"
--appc_store_dir="/tmp/mesos/store/appc" --authenticate_http="true" --authenticatee="crammd5"
--authorizer="local" --cgroups_cpu_enable_pids_and_tids_count="false" --cgroups_enable_cfs="false"
--cgroups_hierarchy="/sys/fs/cgroup" --cgroups_limit_swap="false" --cgroups_root="mesos" --container_disk_watch_interval="15secs"
--containerizers="mesos" --credential="/tmp/Endpoint_SlaveEndpointTest_NoAuthorizer_2_eXX43V/credential"
--default_role="*" --disk_watch_interval="1mins" --docker="docker" --docker_kill_orphans="true"
--docker_registry="https://registry-1.docker.io" --docker_remove_delay="6hrs" --docker_socket="/var/run/docker.sock"
--docker_stop_timeout="0ns" --docker_store_dir="/tmp/mesos/store/docker" --docker_volume_checkpoint_dir="/var/run/mesos/isolators/docker/volume"
--enforce_container_disk_quota="false" --executor_registration_timeout="1mins" --executor_shutdown_grace_period="5secs"
--fetcher_cache_dir="/tmp/Endpoint_SlaveEndpointTest_NoAuthorizer_2_eXX43V/fetch" --fetcher_cache_size="2GB"
--frameworks_home="" --gc_delay="1weeks" --gc_disk_headroom="0.1" --hadoop_home="" --help="false"
--hostname_lookup="true" --http_authenticators="basic" --http_command_executor="false" --http_credentials="/tmp/Endpoint_SlaveEndpointTest_NoAuthorizer_2_eXX43V/http_credentials"
--image_provisioner_backend="copy" --initialize_driver_logging="true" --isolation="posix/cpu,posix/mem"
--launcher_dir="/mesos/mesos-1.0.0/_build/src" --logbufsecs="0" --logging_level="INFO" --oversubscribed_resources_interval="15secs"
--perf_duration="10secs" --perf_interval="1mins" --qos_correction_interval_min="0ns" --quiet="false"
--recover="reconnect" --recovery_timeout="15mins" --registration_backoff_factor="10ms" --resources="cpus:2;gpus:0;mem:1024;disk:1024;ports:[31000-32000]"
--revocable_cpu_low_priority="true" --sandbox_directory="/mnt/mesos/sandbox" --strict="true"
--switch_user="true" --systemd_enable_support="true" --systemd_runtime_directory="/run/systemd/system"
--version="false" --work_dir="/tmp/Endpoint_SlaveEndpointTest_NoAuthorizer_2_eXX43V"
I0629 17:39:57.750392 29935 credentials.hpp:86] Loading credential for authentication from
'/tmp/Endpoint_SlaveEndpointTest_NoAuthorizer_2_eXX43V/credential'
I0629 17:39:57.750525 29935 slave.cpp:341] Agent using credential for: test-principal
I0629 17:39:57.750553 29935 credentials.hpp:37] Loading credentials for authentication from
'/tmp/Endpoint_SlaveEndpointTest_NoAuthorizer_2_eXX43V/http_credentials'
I0629 17:39:57.750748 29935 slave.cpp:393] Using default 'basic' HTTP authenticator
I0629 17:39:57.751552 29935 resources.cpp:572] Parsing resources as JSON failed: cpus:2;gpus:0;mem:1024;disk:1024;ports:[31000-32000]
Trying semicolon-delimited string format instead
I0629 17:39:57.751811 29935 resources.cpp:572] Parsing resources as JSON failed: cpus:2;gpus:0;mem:1024;disk:1024;ports:[31000-32000]
Trying semicolon-delimited string format instead
I0629 17:39:57.752169 29935 slave.cpp:592] Agent resources: cpus(*):2; mem(*):1024; disk(*):1024;
ports(*):[31000-32000]
I0629 17:39:57.752223 29935 slave.cpp:600] Agent attributes: [  ]
I0629 17:39:57.752238 29935 slave.cpp:605] Agent hostname: 57c58d38b3aa
I0629 17:39:57.753623 29939 state.cpp:57] Recovering state from '/tmp/Endpoint_SlaveEndpointTest_NoAuthorizer_2_eXX43V/meta'
I0629 17:39:57.753705 29935 process.cpp:3279] Handling HTTP event for process 'slave(538)'
with path: '/slave(538)/containers'
I0629 17:39:57.754137 29942 status_update_manager.cpp:200] Recovering status update manager
I0629 17:39:57.754269 29931 containerizer.cpp:514] Recovering containerizer
I0629 17:39:57.754536 29930 http.cpp:1306] Authorizing principal 'test-principal' to GET the
'/containers' endpoint
I0629 17:39:57.755388 29928 provisioner.cpp:253] Provisioner recovery complete
I0629 17:39:57.755604 29942 slave.cpp:4840] Finished recovery
I0629 17:39:57.756006 29942 slave.cpp:5012] Querying resource estimator for oversubscribable
resources
I0629 17:39:57.756157 29932 slave.cpp:5026] Received oversubscribable resources  from the
resource estimator
I0629 17:39:57.756875 29928 slave.cpp:839] Agent terminating
[       OK ] Endpoint/SlaveEndpointTest.NoAuthorizer/2 (19 ms)
[----------] 9 tests from Endpoint/SlaveEndpointTest (188 ms total)

[----------] Global test environment tear-down
[==========] 1203 tests from 138 test cases ran. (381862 ms total)
[  PASSED  ] 1202 tests.
[  FAILED  ] 1 test, listed below:
[  FAILED  ] ProvisionerDockerLocalStoreTest.MetadataManagerInitialization

 1 FAILED TEST
  YOU HAVE 6 DISABLED TESTS

make[4]: *** [check-local] Error 1
make[4]: Leaving directory `/mesos/mesos-1.0.0/_build/src'
make[3]: *** [check-am] Error 2
make[3]: Leaving directory `/mesos/mesos-1.0.0/_build/src'
make[2]: *** [check] Error 2
make[2]: Leaving directory `/mesos/mesos-1.0.0/_build/src'
make[1]: *** [check-recursive] Error 1
make[1]: Leaving directory `/mesos/mesos-1.0.0/_build'
make: *** [distcheck] Error 1
+ docker rmi mesos-1467219935-640
Untagged: mesos-1467219935-640:latest
Deleted: 705d4fe7df68e0b399d22288483917e51b9caaaa685ead6f68c0ab037789f35b
Deleted: 4765ce7614af80ee44cc884d91ca558b24408f575a718caf239242e0a9d8f264
Deleted: 710b28e7cef9104170d757e8d5536f468cad5243ac7fb9110b1f72b3158d5468
Deleted: ad62c8d0ba864362b40ff86977cd8b315eb6df78c72b802641660c7335a83c80
Deleted: 6c8d382e7575c7bfbfe12ea7bbfbc489ec6133adef64d00e11b44c1a679536c5
Deleted: 77dfbff2152e879cd1db5e8108fcdd860a69121150d44f7217c8ad51c1cfa75d
Deleted: e98ead77757b7b53408752019e729711c60e5682800694031f9764105ec27cb1
Deleted: 950b1d383e03decc6fc2ec1dc344a3aefbb0dad3031cd6509b6902216aa2d6f6
Deleted: 714c16202668ed475f8f7281bea5f73a943c8a65ac9dbe11a56bd262357909a6
Deleted: 3f2f4a92515f8ac1bc9b37eb8e63abbf24e8c22fb4bb392966657aa6913c334d
Deleted: 5a819ea419c2da8447d406b2562daddafc35aeb8041477766b81b146aa71c956
Deleted: 1c42b6c7ee23ed58f9939fa49c062f728e7b1a41dd814c025c6ad28567f1708a
Deleted: c9317941dd503e0d868752cbbc4895defb95f7abb60565713b7fa97714b61577
Deleted: c49b76f1848761dbfc02882c3c4cf588201ec06cd0cecc93d2d721ed7bd8a1d5
Deleted: 1d2ec8b1319c269a9705146706af5ebf85c7e87a4b000f6e98038e48f9a995f7
Deleted: cdec4bcba7d76f65eb36161b64623606d253f4d667976eb81c87f5a1556bfc52
Build step 'Execute shell' marked build as failure

Mime
View raw message