mesos-builds mailing list archives

Site index · List index
Message view « Date » · « Thread »
Top « Date » · « Thread »
From Apache Jenkins Server <jenk...@builds.apache.org>
Subject Build failed in Jenkins: Mesos » cmake,gcc,--verbose --enable-libevent --enable-ssl,GLOG_v=1 MESOS_VERBOSE=1,ubuntu:14.04,(docker||Hadoop)&&(!ubuntu-us1) #2296
Date Thu, 16 Jun 2016 23:54:44 GMT
See <https://builds.apache.org/job/Mesos/BUILDTOOL=cmake,COMPILER=gcc,CONFIGURATION=--verbose%20--enable-libevent%20--enable-ssl,ENVIRONMENT=GLOG_v=1%20MESOS_VERBOSE=1,OS=ubuntu%3A14.04,label_exp=(docker%7C%7CHadoop)&&(!ubuntu-us1)/2296/changes>

Changes:

[bmahler] Added auto-discovery of GPUs for Nvidia GPU support.

[bmahler] Added tests for GPU auto-discovery and flag validation.

------------------------------------------
[...truncated 9515 lines...]
/usr/bin/cmake -E cmake_progress_report /mesos/build/CMakeFiles 
[ 40%] Performing install step for 'zookeeper-3.4.8'
cd /mesos/build/3rdparty/zookeeper-3.4.8/src/zookeeper-3.4.8-build && cd /mesos/build/3rdparty/zookeeper-3.4.8/src/zookeeper-3.4.8/src/c
&& make install
make[3]: warning: jobserver unavailable: using -j1.  Add `+' to parent make rule.
make[3]: Entering directory `/mesos/build/3rdparty/zookeeper-3.4.8/src/zookeeper-3.4.8/src/c'
make[4]: Entering directory `/mesos/build/3rdparty/zookeeper-3.4.8/src/zookeeper-3.4.8/src/c'
 /bin/mkdir -p '/mesos/build/3rdparty/zookeeper-3.4.8/src/zookeeper-3.4.8/src/c/lib'
 /bin/bash ./libtool   --mode=install /usr/bin/install -c   libzookeeper_st.la libzookeeper_mt.la
'/mesos/build/3rdparty/zookeeper-3.4.8/src/zookeeper-3.4.8/src/c/lib'
libtool: install: /usr/bin/install -c .libs/libzookeeper_st.lai /mesos/build/3rdparty/zookeeper-3.4.8/src/zookeeper-3.4.8/src/c/lib/libzookeeper_st.la
libtool: install: /usr/bin/install -c .libs/libzookeeper_mt.lai /mesos/build/3rdparty/zookeeper-3.4.8/src/zookeeper-3.4.8/src/c/lib/libzookeeper_mt.la
libtool: install: /usr/bin/install -c .libs/libzookeeper_st.a /mesos/build/3rdparty/zookeeper-3.4.8/src/zookeeper-3.4.8/src/c/lib/libzookeeper_st.a
libtool: install: chmod 644 /mesos/build/3rdparty/zookeeper-3.4.8/src/zookeeper-3.4.8/src/c/lib/libzookeeper_st.a
libtool: install: ranlib /mesos/build/3rdparty/zookeeper-3.4.8/src/zookeeper-3.4.8/src/c/lib/libzookeeper_st.a
libtool: install: /usr/bin/install -c .libs/libzookeeper_mt.a /mesos/build/3rdparty/zookeeper-3.4.8/src/zookeeper-3.4.8/src/c/lib/libzookeeper_mt.a
libtool: install: chmod 644 /mesos/build/3rdparty/zookeeper-3.4.8/src/zookeeper-3.4.8/src/c/lib/libzookeeper_mt.a
libtool: install: ranlib /mesos/build/3rdparty/zookeeper-3.4.8/src/zookeeper-3.4.8/src/c/lib/libzookeeper_mt.a
libtool: finish: PATH="/usr/local/sbin:/usr/local/bin:/usr/sbin:/usr/bin:/sbin:/bin:/sbin"
ldconfig -n /mesos/build/3rdparty/zookeeper-3.4.8/src/zookeeper-3.4.8/src/c/lib
----------------------------------------------------------------------
Libraries have been installed in:
   /mesos/build/3rdparty/zookeeper-3.4.8/src/zookeeper-3.4.8/src/c/lib

If you ever happen to want to link against installed libraries
in a given directory, LIBDIR, you must either use libtool, and
specify the full pathname of the library, or use the '-LLIBDIR'
flag during linking and do at least one of the following:
   - add LIBDIR to the 'LD_LIBRARY_PATH' environment variable
     during execution
   - add LIBDIR to the 'LD_RUN_PATH' environment variable
     during linking
   - use the '-Wl,-rpath -Wl,LIBDIR' linker flag
   - have your system administrator add LIBDIR to '/etc/ld.so.conf'

See any operating system documentation about shared libraries for
more information, such as the ld(1) and ld.so(8) manual pages.
----------------------------------------------------------------------
 /bin/mkdir -p '/mesos/build/3rdparty/zookeeper-3.4.8/src/zookeeper-3.4.8/src/c/bin'
  /bin/bash ./libtool   --mode=install /usr/bin/install -c cli_st cli_mt load_gen '/mesos/build/3rdparty/zookeeper-3.4.8/src/zookeeper-3.4.8/src/c/bin'
libtool: install: /usr/bin/install -c cli_st /mesos/build/3rdparty/zookeeper-3.4.8/src/zookeeper-3.4.8/src/c/bin/cli_st
libtool: install: /usr/bin/install -c cli_mt /mesos/build/3rdparty/zookeeper-3.4.8/src/zookeeper-3.4.8/src/c/bin/cli_mt
libtool: install: /usr/bin/install -c load_gen /mesos/build/3rdparty/zookeeper-3.4.8/src/zookeeper-3.4.8/src/c/bin/load_gen
 /bin/mkdir -p '/mesos/build/3rdparty/zookeeper-3.4.8/src/zookeeper-3.4.8/src/c/include/zookeeper'
 /usr/bin/install -c -m 644 include/zookeeper.h include/zookeeper_version.h include/zookeeper_log.h
include/proto.h include/recordio.h generated/zookeeper.jute.h '/mesos/build/3rdparty/zookeeper-3.4.8/src/zookeeper-3.4.8/src/c/include/zookeeper'
make[4]: Leaving directory `/mesos/build/3rdparty/zookeeper-3.4.8/src/zookeeper-3.4.8/src/c'
make[3]: Leaving directory `/mesos/build/3rdparty/zookeeper-3.4.8/src/zookeeper-3.4.8/src/c'
cd /mesos/build/3rdparty/zookeeper-3.4.8/src/zookeeper-3.4.8-build && /usr/bin/cmake
-E touch /mesos/build/3rdparty/zookeeper-3.4.8/src/zookeeper-3.4.8-stamp/zookeeper-3.4.8-install
/usr/bin/cmake -E cmake_progress_report /mesos/build/CMakeFiles 
[ 40%] Completed 'zookeeper-3.4.8'
cd /mesos/build/3rdparty && /usr/bin/cmake -E make_directory /mesos/build/3rdparty/CMakeFiles
cd /mesos/build/3rdparty && /usr/bin/cmake -E touch /mesos/build/3rdparty/CMakeFiles/zookeeper-3.4.8-complete
cd /mesos/build/3rdparty && /usr/bin/cmake -E touch /mesos/build/3rdparty/zookeeper-3.4.8/src/zookeeper-3.4.8-stamp/zookeeper-3.4.8-done
make[2]: Leaving directory `/mesos/build'
/usr/bin/cmake -E cmake_progress_report /mesos/build/CMakeFiles  99 100
[ 40%] Built target zookeeper-3.4.8
ln -fs libleveldb.so.1.4 libleveldb.so
ln -fs libleveldb.so.1.4 libleveldb.so.1
g++ -I. -I./include -fno-builtin-memcmp -pthread -DOS_LINUX -DLEVELDB_PLATFORM_POSIX -O2 -DNDEBUG
       -c db/builder.cc -o db/builder.o
g++ -I. -I./include -fno-builtin-memcmp -pthread -DOS_LINUX -DLEVELDB_PLATFORM_POSIX -O2 -DNDEBUG
       -c db/c.cc -o db/c.o
g++ -I. -I./include -fno-builtin-memcmp -pthread -DOS_LINUX -DLEVELDB_PLATFORM_POSIX -O2 -DNDEBUG
       -c db/db_impl.cc -o db/db_impl.o
g++ -I. -I./include -fno-builtin-memcmp -pthread -DOS_LINUX -DLEVELDB_PLATFORM_POSIX -O2 -DNDEBUG
       -c db/db_iter.cc -o db/db_iter.o
g++ -I. -I./include -fno-builtin-memcmp -pthread -DOS_LINUX -DLEVELDB_PLATFORM_POSIX -O2 -DNDEBUG
       -c db/dbformat.cc -o db/dbformat.o
g++ -I. -I./include -fno-builtin-memcmp -pthread -DOS_LINUX -DLEVELDB_PLATFORM_POSIX -O2 -DNDEBUG
       -c db/filename.cc -o db/filename.o
g++ -I. -I./include -fno-builtin-memcmp -pthread -DOS_LINUX -DLEVELDB_PLATFORM_POSIX -O2 -DNDEBUG
       -c db/log_reader.cc -o db/log_reader.o
g++ -I. -I./include -fno-builtin-memcmp -pthread -DOS_LINUX -DLEVELDB_PLATFORM_POSIX -O2 -DNDEBUG
       -c db/log_writer.cc -o db/log_writer.o
g++ -I. -I./include -fno-builtin-memcmp -pthread -DOS_LINUX -DLEVELDB_PLATFORM_POSIX -O2 -DNDEBUG
       -c db/memtable.cc -o db/memtable.o
g++ -I. -I./include -fno-builtin-memcmp -pthread -DOS_LINUX -DLEVELDB_PLATFORM_POSIX -O2 -DNDEBUG
       -c db/repair.cc -o db/repair.o
g++ -I. -I./include -fno-builtin-memcmp -pthread -DOS_LINUX -DLEVELDB_PLATFORM_POSIX -O2 -DNDEBUG
       -c db/table_cache.cc -o db/table_cache.o
g++ -I. -I./include -fno-builtin-memcmp -pthread -DOS_LINUX -DLEVELDB_PLATFORM_POSIX -O2 -DNDEBUG
       -c db/version_edit.cc -o db/version_edit.o
g++ -I. -I./include -fno-builtin-memcmp -pthread -DOS_LINUX -DLEVELDB_PLATFORM_POSIX -O2 -DNDEBUG
       -c db/version_set.cc -o db/version_set.o
g++ -I. -I./include -fno-builtin-memcmp -pthread -DOS_LINUX -DLEVELDB_PLATFORM_POSIX -O2 -DNDEBUG
       -c db/write_batch.cc -o db/write_batch.o
g++ -I. -I./include -fno-builtin-memcmp -pthread -DOS_LINUX -DLEVELDB_PLATFORM_POSIX -O2 -DNDEBUG
       -c table/block.cc -o table/block.o
g++ -I. -I./include -fno-builtin-memcmp -pthread -DOS_LINUX -DLEVELDB_PLATFORM_POSIX -O2 -DNDEBUG
       -c table/block_builder.cc -o table/block_builder.o
g++ -I. -I./include -fno-builtin-memcmp -pthread -DOS_LINUX -DLEVELDB_PLATFORM_POSIX -O2 -DNDEBUG
       -c table/filter_block.cc -o table/filter_block.o
g++ -I. -I./include -fno-builtin-memcmp -pthread -DOS_LINUX -DLEVELDB_PLATFORM_POSIX -O2 -DNDEBUG
       -c table/format.cc -o table/format.o
g++ -I. -I./include -fno-builtin-memcmp -pthread -DOS_LINUX -DLEVELDB_PLATFORM_POSIX -O2 -DNDEBUG
       -c table/iterator.cc -o table/iterator.o
g++ -I. -I./include -fno-builtin-memcmp -pthread -DOS_LINUX -DLEVELDB_PLATFORM_POSIX -O2 -DNDEBUG
       -c table/merger.cc -o table/merger.o
g++ -I. -I./include -fno-builtin-memcmp -pthread -DOS_LINUX -DLEVELDB_PLATFORM_POSIX -O2 -DNDEBUG
       -c table/table.cc -o table/table.o
g++ -I. -I./include -fno-builtin-memcmp -pthread -DOS_LINUX -DLEVELDB_PLATFORM_POSIX -O2 -DNDEBUG
       -c table/table_builder.cc -o table/table_builder.o
g++ -I. -I./include -fno-builtin-memcmp -pthread -DOS_LINUX -DLEVELDB_PLATFORM_POSIX -O2 -DNDEBUG
       -c table/two_level_iterator.cc -o table/two_level_iterator.o
g++ -I. -I./include -fno-builtin-memcmp -pthread -DOS_LINUX -DLEVELDB_PLATFORM_POSIX -O2 -DNDEBUG
       -c util/arena.cc -o util/arena.o
g++ -I. -I./include -fno-builtin-memcmp -pthread -DOS_LINUX -DLEVELDB_PLATFORM_POSIX -O2 -DNDEBUG
       -c util/bloom.cc -o util/bloom.o
g++ -I. -I./include -fno-builtin-memcmp -pthread -DOS_LINUX -DLEVELDB_PLATFORM_POSIX -O2 -DNDEBUG
       -c util/cache.cc -o util/cache.o
g++ -I. -I./include -fno-builtin-memcmp -pthread -DOS_LINUX -DLEVELDB_PLATFORM_POSIX -O2 -DNDEBUG
       -c util/coding.cc -o util/coding.o
g++ -I. -I./include -fno-builtin-memcmp -pthread -DOS_LINUX -DLEVELDB_PLATFORM_POSIX -O2 -DNDEBUG
       -c util/comparator.cc -o util/comparator.o
g++ -I. -I./include -fno-builtin-memcmp -pthread -DOS_LINUX -DLEVELDB_PLATFORM_POSIX -O2 -DNDEBUG
       -c util/crc32c.cc -o util/crc32c.o
g++ -I. -I./include -fno-builtin-memcmp -pthread -DOS_LINUX -DLEVELDB_PLATFORM_POSIX -O2 -DNDEBUG
       -c util/env.cc -o util/env.o
g++ -I. -I./include -fno-builtin-memcmp -pthread -DOS_LINUX -DLEVELDB_PLATFORM_POSIX -O2 -DNDEBUG
       -c util/env_posix.cc -o util/env_posix.o
g++ -I. -I./include -fno-builtin-memcmp -pthread -DOS_LINUX -DLEVELDB_PLATFORM_POSIX -O2 -DNDEBUG
       -c util/filter_policy.cc -o util/filter_policy.o
g++ -I. -I./include -fno-builtin-memcmp -pthread -DOS_LINUX -DLEVELDB_PLATFORM_POSIX -O2 -DNDEBUG
       -c util/hash.cc -o util/hash.o
g++ -I. -I./include -fno-builtin-memcmp -pthread -DOS_LINUX -DLEVELDB_PLATFORM_POSIX -O2 -DNDEBUG
       -c util/histogram.cc -o util/histogram.o
g++ -I. -I./include -fno-builtin-memcmp -pthread -DOS_LINUX -DLEVELDB_PLATFORM_POSIX -O2 -DNDEBUG
       -c util/logging.cc -o util/logging.o
g++ -I. -I./include -fno-builtin-memcmp -pthread -DOS_LINUX -DLEVELDB_PLATFORM_POSIX -O2 -DNDEBUG
       -c util/options.cc -o util/options.o
g++ -I. -I./include -fno-builtin-memcmp -pthread -DOS_LINUX -DLEVELDB_PLATFORM_POSIX -O2 -DNDEBUG
       -c util/status.cc -o util/status.o
g++ -I. -I./include -fno-builtin-memcmp -pthread -DOS_LINUX -DLEVELDB_PLATFORM_POSIX -O2 -DNDEBUG
       -c port/port_posix.cc -o port/port_posix.o
rm -f libleveldb.a
ar -rs libleveldb.a db/builder.o db/c.o db/db_impl.o db/db_iter.o db/dbformat.o db/filename.o
db/log_reader.o db/log_writer.o db/memtable.o db/repair.o db/table_cache.o db/version_edit.o
db/version_set.o db/write_batch.o table/block.o table/block_builder.o table/filter_block.o
table/format.o table/iterator.o table/merger.o table/table.o table/table_builder.o table/two_level_iterator.o
util/arena.o util/bloom.o util/cache.o util/coding.o util/comparator.o util/crc32c.o util/env.o
util/env_posix.o util/filter_policy.o util/hash.o util/histogram.o util/logging.o util/options.o
util/status.o port/port_posix.o
ar: creating libleveldb.a
make[3]: Leaving directory `/mesos/build/3rdparty/leveldb-1.4/src/leveldb-1.4'
cd /mesos/build/3rdparty/leveldb-1.4/src/leveldb-1.4-build && /usr/bin/cmake -E touch
/mesos/build/3rdparty/leveldb-1.4/src/leveldb-1.4-stamp/leveldb-1.4-build
/usr/bin/cmake -E cmake_progress_report /mesos/build/CMakeFiles 
[ 40%] Performing install step for 'leveldb-1.4'
cd /mesos/build/3rdparty/leveldb-1.4/src/leveldb-1.4-build && /usr/bin/cmake -E echo

cd /mesos/build/3rdparty/leveldb-1.4/src/leveldb-1.4-build && /usr/bin/cmake -E touch
/mesos/build/3rdparty/leveldb-1.4/src/leveldb-1.4-stamp/leveldb-1.4-install
/usr/bin/cmake -E cmake_progress_report /mesos/build/CMakeFiles 10
[ 41%] Completed 'leveldb-1.4'
cd /mesos/build/3rdparty && /usr/bin/cmake -E make_directory /mesos/build/3rdparty/CMakeFiles
cd /mesos/build/3rdparty && /usr/bin/cmake -E touch /mesos/build/3rdparty/CMakeFiles/leveldb-1.4-complete
cd /mesos/build/3rdparty && /usr/bin/cmake -E touch /mesos/build/3rdparty/leveldb-1.4/src/leveldb-1.4-stamp/leveldb-1.4-done
make[2]: Leaving directory `/mesos/build'
/usr/bin/cmake -E cmake_progress_report /mesos/build/CMakeFiles  10 11
[ 41%] Built target leveldb-1.4
make -f src/CMakeFiles/mesos-1.0.0.dir/build.make src/CMakeFiles/mesos-1.0.0.dir/depend
make[2]: Entering directory `/mesos/build'
/usr/bin/cmake -E cmake_progress_report /mesos/build/CMakeFiles 
/usr/bin/cmake -E cmake_progress_report /mesos/build/CMakeFiles 14
/usr/bin/cmake -E cmake_progress_report /mesos/build/CMakeFiles 
/usr/bin/cmake -E cmake_progress_report /mesos/build/CMakeFiles 
/usr/bin/cmake -E cmake_progress_report /mesos/build/CMakeFiles 
[ 41%] /usr/bin/cmake -E cmake_progress_report /mesos/build/CMakeFiles 15
[ 41%] /usr/bin/cmake -E cmake_progress_report /mesos/build/CMakeFiles 
/usr/bin/cmake -E cmake_progress_report /mesos/build/CMakeFiles 
[ 42%] [ 42%] [ 42%] [ 42%] Generating ../include/mesos/master/allocator.pb.cc, ../include/mesos/master/allocator.pb.h
[ 43%] [ 43%] Generating ../include/mesos/v1/scheduler/scheduler.pb.cc, ../include/mesos/v1/scheduler/scheduler.pb.h
/mesos/build/3rdparty/protobuf-2.6.1/src/protobuf-2.6.1-lib/lib/bin/protoc -I/mesos/include
-I/mesos/src --cpp_out=/mesos/build/include /mesos/include/mesos/master/allocator.proto
Generating ../include/mesos/authorizer/acls.pb.cc, ../include/mesos/authorizer/acls.pb.h
/mesos/build/3rdparty/protobuf-2.6.1/src/protobuf-2.6.1-lib/lib/bin/protoc -I/mesos/include
-I/mesos/src --cpp_out=/mesos/build/include /mesos/include/mesos/v1/scheduler/scheduler.proto
Generating ../include/mesos/authentication/authentication.pb.cc, ../include/mesos/authentication/authentication.pb.h
/mesos/build/3rdparty/protobuf-2.6.1/src/protobuf-2.6.1-lib/lib/bin/protoc -I/mesos/include
-I/mesos/src --cpp_out=/mesos/build/include /mesos/include/mesos/authorizer/acls.proto
Generating ../include/mesos/appc/spec.pb.cc, ../include/mesos/appc/spec.pb.h
/mesos/build/3rdparty/protobuf-2.6.1/src/protobuf-2.6.1-lib/lib/bin/protoc -I/mesos/include
-I/mesos/src --cpp_out=/mesos/build/include /mesos/include/mesos/authentication/authentication.proto
Generating ../include/mesos/authorizer/authorizer.pb.cc, ../include/mesos/authorizer/authorizer.pb.h
/mesos/build/3rdparty/protobuf-2.6.1/src/protobuf-2.6.1-lib/lib/bin/protoc -I/mesos/include
-I/mesos/src --cpp_out=/mesos/build/include /mesos/include/mesos/appc/spec.proto
Generating ../include/mesos/containerizer/containerizer.pb.cc, ../include/mesos/containerizer/containerizer.pb.h
/mesos/build/3rdparty/protobuf-2.6.1/src/protobuf-2.6.1-lib/lib/bin/protoc -I/mesos/include
-I/mesos/src --cpp_out=/mesos/build/include /mesos/include/mesos/authorizer/authorizer.proto
Generating ../include/mesos/docker/spec.pb.cc, ../include/mesos/docker/spec.pb.h
/mesos/build/3rdparty/protobuf-2.6.1/src/protobuf-2.6.1-lib/lib/bin/protoc -I/mesos/include
-I/mesos/src --cpp_out=/mesos/build/include /mesos/include/mesos/containerizer/containerizer.proto
/mesos/build/3rdparty/protobuf-2.6.1/src/protobuf-2.6.1-lib/lib/bin/protoc -I/mesos/include
-I/mesos/src --cpp_out=/mesos/build/include /mesos/include/mesos/docker/spec.proto
/usr/bin/cmake -E cmake_progress_report /mesos/build/CMakeFiles 
/usr/bin/cmake -E cmake_progress_report /mesos/build/CMakeFiles 16
/usr/bin/cmake -E cmake_progress_report /mesos/build/CMakeFiles 
/usr/bin/cmake -E cmake_progress_report /mesos/build/CMakeFiles 
/usr/bin/cmake -E cmake_progress_report /mesos/build/CMakeFiles 
[ 43%] /usr/bin/cmake -E cmake_progress_report /mesos/build/CMakeFiles 17
[ 43%] /usr/bin/cmake -E cmake_progress_report /mesos/build/CMakeFiles 
[ 44%] /usr/bin/cmake -E cmake_progress_report /mesos/build/CMakeFiles 
[ 43%] [ 44%] [ 44%] Generating ../include/mesos/docker/v1.pb.cc, ../include/mesos/docker/v1.pb.h
[ 44%] Generating messages/flags.pb.cc, messages/flags.pb.h
Generating ../include/mesos/executor/executor.pb.cc, ../include/mesos/executor/executor.pb.h
[ 45%] /mesos/build/3rdparty/protobuf-2.6.1/src/protobuf-2.6.1-lib/lib/bin/protoc -I/mesos/include
-I/mesos/src --cpp_out=/mesos/build/include /mesos/include/mesos/docker/v1.proto
/mesos/build/3rdparty/protobuf-2.6.1/src/protobuf-2.6.1-lib/lib/bin/protoc -I/mesos/include
-I/mesos/src --cpp_out=/mesos/build/include /mesos/include/mesos/executor/executor.proto
Generating ../include/mesos/docker/v2.pb.cc, ../include/mesos/docker/v2.pb.h
/mesos/build/3rdparty/protobuf-2.6.1/src/protobuf-2.6.1-lib/lib/bin/protoc -I/mesos/include
-I/mesos/src --cpp_out=/mesos/build/src /mesos/src/messages/flags.proto
Generating ../include/mesos/fetcher/fetcher.pb.cc, ../include/mesos/fetcher/fetcher.pb.h
/mesos/build/3rdparty/protobuf-2.6.1/src/protobuf-2.6.1-lib/lib/bin/protoc -I/mesos/include
-I/mesos/src --cpp_out=/mesos/build/include /mesos/include/mesos/docker/v2.proto
/mesos/build/3rdparty/protobuf-2.6.1/src/protobuf-2.6.1-lib/lib/bin/protoc -I/mesos/include
-I/mesos/src --cpp_out=/mesos/build/include /mesos/include/mesos/fetcher/fetcher.proto
Generating messages/messages.pb.cc, messages/messages.pb.h
/mesos/build/3rdparty/protobuf-2.6.1/src/protobuf-2.6.1-lib/lib/bin/protoc -I/mesos/include
-I/mesos/src --cpp_out=/mesos/build/src /mesos/src/messages/messages.proto
/usr/bin/cmake -E cmake_progress_report /mesos/build/CMakeFiles 
/usr/bin/cmake -E cmake_progress_report /mesos/build/CMakeFiles 18
[ 45%] Generating messages/log.pb.cc, messages/log.pb.h
Generating messages/state.pb.cc, messages/state.pb.h
/usr/bin/cmake -E cmake_progress_report /mesos/build/CMakeFiles 
[ 46%] /mesos/build/3rdparty/protobuf-2.6.1/src/protobuf-2.6.1-lib/lib/bin/protoc -I/mesos/include
-I/mesos/src --cpp_out=/mesos/build/src /mesos/src/messages/log.proto
/mesos/build/3rdparty/protobuf-2.6.1/src/protobuf-2.6.1-lib/lib/bin/protoc -I/mesos/include
-I/mesos/src --cpp_out=/mesos/build/src /mesos/src/messages/state.proto
/usr/bin/cmake -E cmake_progress_report /mesos/build/CMakeFiles 
Generating ../include/mesos/slave/isolator.pb.cc, ../include/mesos/slave/isolator.pb.h
/mesos/build/3rdparty/protobuf-2.6.1/src/protobuf-2.6.1-lib/lib/bin/protoc -I/mesos/include
-I/mesos/src --cpp_out=/mesos/build/include /mesos/include/mesos/slave/isolator.proto
/usr/bin/cmake -E cmake_progress_report /mesos/build/CMakeFiles 
Generating slave/containerizer/mesos/isolators/network/cni/spec.pb.cc, slave/containerizer/mesos/isolators/network/cni/spec.pb.h
[ 46%] /usr/bin/cmake -E cmake_progress_report /mesos/build/CMakeFiles 19
/mesos/build/3rdparty/protobuf-2.6.1/src/protobuf-2.6.1-lib/lib/bin/protoc -I/mesos/include
-I/mesos/src --cpp_out=/mesos/build/src /mesos/src/slave/containerizer/mesos/isolators/network/cni/spec.proto
[ 46%] /usr/bin/cmake -E cmake_progress_report /mesos/build/CMakeFiles 
/usr/bin/cmake -E cmake_progress_report /mesos/build/CMakeFiles 
[ 47%] [ 47%] Generating slave/containerizer/mesos/isolators/docker/volume/state.pb.cc, slave/containerizer/mesos/isolators/docker/volume/state.pb.h
/mesos/build/3rdparty/protobuf-2.6.1/src/protobuf-2.6.1-lib/lib/bin/protoc -I/mesos/include
-I/mesos/src --cpp_out=/mesos/build/src /mesos/src/slave/containerizer/mesos/isolators/docker/volume/state.proto
/usr/bin/cmake -E cmake_progress_report /mesos/build/CMakeFiles 
/usr/bin/cmake -E cmake_progress_report /mesos/build/CMakeFiles 20
[ 47%] Generating ../include/mesos/maintenance/maintenance.pb.cc, ../include/mesos/maintenance/maintenance.pb.h
Generating ../include/mesos/mesos.pb.cc, ../include/mesos/mesos.pb.h
/mesos/build/3rdparty/protobuf-2.6.1/src/protobuf-2.6.1-lib/lib/bin/protoc -I/mesos/include
-I/mesos/src --cpp_out=/mesos/build/include /mesos/include/mesos/maintenance/maintenance.proto
/usr/bin/cmake -E cmake_progress_report /mesos/build/CMakeFiles 
/mesos/build/3rdparty/protobuf-2.6.1/src/protobuf-2.6.1-lib/lib/bin/protoc -I/mesos/include
-I/mesos/src --cpp_out=/mesos/build/include /mesos/include/mesos/mesos.proto
[ 47%] Generating ../include/mesos/module/module.pb.cc, ../include/mesos/module/module.pb.h
[ 47%] /mesos/build/3rdparty/protobuf-2.6.1/src/protobuf-2.6.1-lib/lib/bin/protoc -I/mesos/include
-I/mesos/src --cpp_out=/mesos/build/include /mesos/include/mesos/module/module.proto
Generating ../include/mesos/quota/quota.pb.cc, ../include/mesos/quota/quota.pb.h
/mesos/build/3rdparty/protobuf-2.6.1/src/protobuf-2.6.1-lib/lib/bin/protoc -I/mesos/include
-I/mesos/src --cpp_out=/mesos/build/include /mesos/include/mesos/quota/quota.proto
[ 48%] [ 48%] Generating slave/containerizer/mesos/provisioner/docker/message.pb.cc, slave/containerizer/mesos/provisioner/docker/message.pb.h
Generating ../include/mesos/slave/oversubscription.pb.cc, ../include/mesos/slave/oversubscription.pb.h
/mesos/build/3rdparty/protobuf-2.6.1/src/protobuf-2.6.1-lib/lib/bin/protoc -I/mesos/include
-I/mesos/src --cpp_out=/mesos/build/src /mesos/src/slave/containerizer/mesos/provisioner/docker/message.proto
/mesos/build/3rdparty/protobuf-2.6.1/src/protobuf-2.6.1-lib/lib/bin/protoc -I/mesos/include
-I/mesos/src --cpp_out=/mesos/build/include /mesos/include/mesos/slave/oversubscription.proto
/usr/bin/cmake -E cmake_progress_report /mesos/build/CMakeFiles 
Generating master/registry.pb.cc, master/registry.pb.h
Generating ../include/mesos/scheduler/scheduler.pb.cc, ../include/mesos/scheduler/scheduler.pb.h
/usr/bin/cmake -E cmake_progress_report /mesos/build/CMakeFiles 
/mesos/build/3rdparty/protobuf-2.6.1/src/protobuf-2.6.1-lib/lib/bin/protoc -I/mesos/include
-I/mesos/src --cpp_out=/mesos/build/include /mesos/include/mesos/scheduler/scheduler.proto
/mesos/build/3rdparty/protobuf-2.6.1/src/protobuf-2.6.1-lib/lib/bin/protoc -I/mesos/include
-I/mesos/src --cpp_out=/mesos/build/src /mesos/src/master/registry.proto
/usr/bin/cmake -E cmake_progress_report /mesos/build/CMakeFiles 
[ 48%] /usr/bin/cmake -E cmake_progress_report /mesos/build/CMakeFiles 21
[ 48%] /usr/bin/cmake -E cmake_progress_report /mesos/build/CMakeFiles 
[ 48%] [ 49%] Generating ../include/mesos/state/state.pb.cc, ../include/mesos/state/state.pb.h
/mesos/build/3rdparty/protobuf-2.6.1/src/protobuf-2.6.1-lib/lib/bin/protoc -I/mesos/include
-I/mesos/src --cpp_out=/mesos/build/include /mesos/include/mesos/state/state.proto
Generating ../include/mesos/uri/uri.pb.cc, ../include/mesos/uri/uri.pb.h
[ 49%] /mesos/build/3rdparty/protobuf-2.6.1/src/protobuf-2.6.1-lib/lib/bin/protoc -I/mesos/include
-I/mesos/src --cpp_out=/mesos/build/include /mesos/include/mesos/uri/uri.proto
Generating ../include/mesos/v1/agent.pb.cc, ../include/mesos/v1/agent.pb.h
/mesos/build/3rdparty/protobuf-2.6.1/src/protobuf-2.6.1-lib/lib/bin/protoc -I/mesos/include
-I/mesos/src --cpp_out=/mesos/build/include /mesos/include/mesos/v1/agent.proto
/usr/bin/cmake -E cmake_progress_report /mesos/build/CMakeFiles 
Generating ../include/mesos/v1/master/allocator.pb.cc, ../include/mesos/v1/master/allocator.pb.h
/usr/bin/cmake -E cmake_progress_report /mesos/build/CMakeFiles 
/mesos/include/mesos/v1/agent.proto: No such file or directory
Generating ../include/mesos/v1/executor/executor.pb.cc, ../include/mesos/v1/executor/executor.pb.h
/mesos/build/3rdparty/protobuf-2.6.1/src/protobuf-2.6.1-lib/lib/bin/protoc -I/mesos/include
-I/mesos/src --cpp_out=/mesos/build/include /mesos/include/mesos/v1/master/allocator.proto
/mesos/build/3rdparty/protobuf-2.6.1/src/protobuf-2.6.1-lib/lib/bin/protoc -I/mesos/include
-I/mesos/src --cpp_out=/mesos/build/include /mesos/include/mesos/v1/executor/executor.proto
make[2]: *** [include/mesos/v1/agent.pb.cc] Error 1
make[2]: *** Waiting for unfinished jobs....
[ 49%] [ 49%] Generating ../include/mesos/v1/master.pb.cc, ../include/mesos/v1/master.pb.h
/mesos/build/3rdparty/protobuf-2.6.1/src/protobuf-2.6.1-lib/lib/bin/protoc -I/mesos/include
-I/mesos/src --cpp_out=/mesos/build/include /mesos/include/mesos/v1/master.proto
/mesos/include/mesos/v1/master.proto: No such file or directory
make[2]: *** [include/mesos/v1/master.pb.cc] Error 1
Generating ../include/mesos/v1/maintenance/maintenance.pb.cc, ../include/mesos/v1/maintenance/maintenance.pb.h
/mesos/build/3rdparty/protobuf-2.6.1/src/protobuf-2.6.1-lib/lib/bin/protoc -I/mesos/include
-I/mesos/src --cpp_out=/mesos/build/include /mesos/include/mesos/v1/maintenance/maintenance.proto
make[2]: Leaving directory `/mesos/build'
make[1]: *** [src/CMakeFiles/mesos-1.0.0.dir/all] Error 2
make[1]: Leaving directory `/mesos/build'
make: *** [all] Error 2
+ docker rmi mesos-1466120553-30975
Untagged: mesos-1466120553-30975:latest
Deleted: sha256:65a18b3909e2945c7a1ecde459c344325835fffe0340bc784d5c143177cb2e4e
Deleted: sha256:e4892baa23ba9cc7d39496332513dd1b8b385f28fc93f598b5e076d30812ff71
Deleted: sha256:00abc69f6c90860a1d985377a8575bbecf8a4d8f0f78da7fbe29cb253292c761
Deleted: sha256:0018528de323daab16d72af6e4cf631f0d390299c5d4737f0536890269d439ee
Deleted: sha256:0931f5a484d4992c269f2d7ab545b7a47fb8329193e4097e8779aa103a624f25
Deleted: sha256:694725e182b552ac097f7e9aa3d9725e58ea423cb4046d53a4b30898bf9ba9eb
Deleted: sha256:d035482c4e8d83c07080b7b0aa1dd2751ee8cdae4ce32d0980d9f9710c4c8056
Deleted: sha256:4a61e4f0f955d15fd2f6a5a957ce5d721cdd207a52961826555b4300ca9ed1e3
Deleted: sha256:b17c9b681204d080954ee31af0c8f0b3589a24a39491f73e0190c2029dc01215
Deleted: sha256:6e4f49fc45b6060b59287f1bb3d2bd18d7b33197b45e931bd38738a0065818d1
Deleted: sha256:2e219ed43d144873984b163522a834d1c50645373ddbd8b375564a712ca31de9
Deleted: sha256:5c8fd38f757c383793338f43d648a7205e20cb1f25a6f22d5cd08453debfb0d5
Deleted: sha256:7a4f6f742558cb774d7af2b2a0f885a665816d6e22d8a40c6e60d2953b69b0ea
Deleted: sha256:9925629c9f20239c4e72828a8338cde7b4ace53c6ff08f4f9b3f8eb828112e78
Deleted: sha256:6345baf207cdaba7c811a2c4d8be78bb0290529a469c9a9d6d8c1b8bd5d7f557
Deleted: sha256:0fe50a15a2681eeeb541df48435e4b10988c0f3b6211b33408ba2b60d33773d3
Deleted: sha256:fb162c75ad16fd7330d94b29ce88f372e14176aec62da875138c0d8d888dc28f
Deleted: sha256:5a19bd0dced4a5d02594853702b57df54b16e3a656d98b62a2fa311b6c943597
Deleted: sha256:86d55fe1c166b6795f8f236276679e14410b26cebb2b291363010d78ae906211
Deleted: sha256:49ea8bfa6ddbc721bcf7dd2e3c5daedc30a7f991bd9d7a184b8bad6601f9c640
Deleted: sha256:c5e09e1a742e12d9cb7af629da10bf7e6d935a737da7de078a00c6bcfaaa8d72
Deleted: sha256:51838960b337b98fbdb1bdf1bf0fd8d5b5a97cb588701bc88bae352a41a12071
Build step 'Execute shell' marked build as failure

Mime
View raw message