mesos-builds mailing list archives

Site index · List index
Message view « Date » · « Thread »
Top « Date » · « Thread »
From Apache Jenkins Server <jenk...@builds.apache.org>
Subject Build failed in Jenkins: Mesos » cmake,gcc,--verbose --enable-libevent --enable-ssl,GLOG_v=1 MESOS_VERBOSE=1,ubuntu:14.04,(docker||Hadoop)&&(!ubuntu-us1) #2295
Date Thu, 16 Jun 2016 23:01:48 GMT
See <https://builds.apache.org/job/Mesos/BUILDTOOL=cmake,COMPILER=gcc,CONFIGURATION=--verbose%20--enable-libevent%20--enable-ssl,ENVIRONMENT=GLOG_v=1%20MESOS_VERBOSE=1,OS=ubuntu%3A14.04,label_exp=(docker%7C%7CHadoop)&&(!ubuntu-us1)/2295/changes>

Changes:

[toenshoff] Added Berlin usergroup to community page.

[bmahler] Added a comment to clarify granting of NVIDIA control devices.

[yujie.jay] Added a metric to replicated log.

[yujie.jay] Added a metrics prefix for registrar replicated log.

[yujie.jay] Added a test for replicated log metrics.

[yujie.jay] Added a TODO about a bug in RecoverProtocolProcess discard logic.

------------------------------------------
[...truncated 9504 lines...]
gcc -DHAVE_CONFIG_H -I.  -I./include -I./tests -I./generated   -Wall -Werror  -g -O2 -D_GNU_SOURCE
-MT cli.o -MD -MP -MF .deps/cli.Tpo -c -o cli.o `test -f 'src/cli.c' || echo './'`src/cli.c
mv -f .deps/cli.Tpo .deps/cli.Po
/bin/bash ./libtool  --tag=CC   --mode=link gcc -Wall -Werror  -g -O2 -D_GNU_SOURCE   -o cli_st
cli.o libzookeeper_st.la 
libtool: link: gcc -Wall -Werror -g -O2 -D_GNU_SOURCE -o cli_st cli.o  ./.libs/libzookeeper_st.a
-lm
gcc -DHAVE_CONFIG_H -I.  -I./include -I./tests -I./generated   -DTHREADED -g -O2 -D_GNU_SOURCE
-MT cli_mt-cli.o -MD -MP -MF .deps/cli_mt-cli.Tpo -c -o cli_mt-cli.o `test -f 'src/cli.c'
|| echo './'`src/cli.c
mv -f .deps/cli_mt-cli.Tpo .deps/cli_mt-cli.Po
/bin/bash ./libtool  --tag=CC   --mode=link gcc -DTHREADED -g -O2 -D_GNU_SOURCE   -o cli_mt
cli_mt-cli.o libzookeeper_mt.la 
libtool: link: gcc -DTHREADED -g -O2 -D_GNU_SOURCE -o cli_mt cli_mt-cli.o  ./.libs/libzookeeper_mt.a
-lm -lpthread
gcc -DHAVE_CONFIG_H -I.  -I./include -I./tests -I./generated   -DTHREADED -g -O2 -D_GNU_SOURCE
-MT load_gen-load_gen.o -MD -MP -MF .deps/load_gen-load_gen.Tpo -c -o load_gen-load_gen.o
`test -f 'src/load_gen.c' || echo './'`src/load_gen.c
mv -f .deps/load_gen-load_gen.Tpo .deps/load_gen-load_gen.Po
/bin/bash ./libtool  --tag=CC   --mode=link gcc -DTHREADED -g -O2 -D_GNU_SOURCE   -o load_gen
load_gen-load_gen.o libzookeeper_mt.la 
libtool: link: gcc -DTHREADED -g -O2 -D_GNU_SOURCE -o load_gen load_gen-load_gen.o  ./.libs/libzookeeper_mt.a
-lm -lpthread
make[4]: Leaving directory `/mesos/build/3rdparty/zookeeper-3.4.8/src/zookeeper-3.4.8/src/c'
make[3]: Leaving directory `/mesos/build/3rdparty/zookeeper-3.4.8/src/zookeeper-3.4.8/src/c'
cd /mesos/build/3rdparty/zookeeper-3.4.8/src/zookeeper-3.4.8-build && /usr/bin/cmake
-E touch /mesos/build/3rdparty/zookeeper-3.4.8/src/zookeeper-3.4.8-stamp/zookeeper-3.4.8-build
/usr/bin/cmake -E cmake_progress_report /mesos/build/CMakeFiles 
[ 40%] Performing install step for 'zookeeper-3.4.8'
cd /mesos/build/3rdparty/zookeeper-3.4.8/src/zookeeper-3.4.8-build && cd /mesos/build/3rdparty/zookeeper-3.4.8/src/zookeeper-3.4.8/src/c
&& make install
make[3]: warning: jobserver unavailable: using -j1.  Add `+' to parent make rule.
make[3]: Entering directory `/mesos/build/3rdparty/zookeeper-3.4.8/src/zookeeper-3.4.8/src/c'
make[4]: Entering directory `/mesos/build/3rdparty/zookeeper-3.4.8/src/zookeeper-3.4.8/src/c'
 /bin/mkdir -p '/mesos/build/3rdparty/zookeeper-3.4.8/src/zookeeper-3.4.8/src/c/lib'
 /bin/bash ./libtool   --mode=install /usr/bin/install -c   libzookeeper_st.la libzookeeper_mt.la
'/mesos/build/3rdparty/zookeeper-3.4.8/src/zookeeper-3.4.8/src/c/lib'
libtool: install: /usr/bin/install -c .libs/libzookeeper_st.lai /mesos/build/3rdparty/zookeeper-3.4.8/src/zookeeper-3.4.8/src/c/lib/libzookeeper_st.la
libtool: install: /usr/bin/install -c .libs/libzookeeper_mt.lai /mesos/build/3rdparty/zookeeper-3.4.8/src/zookeeper-3.4.8/src/c/lib/libzookeeper_mt.la
libtool: install: /usr/bin/install -c .libs/libzookeeper_st.a /mesos/build/3rdparty/zookeeper-3.4.8/src/zookeeper-3.4.8/src/c/lib/libzookeeper_st.a
libtool: install: chmod 644 /mesos/build/3rdparty/zookeeper-3.4.8/src/zookeeper-3.4.8/src/c/lib/libzookeeper_st.a
libtool: install: ranlib /mesos/build/3rdparty/zookeeper-3.4.8/src/zookeeper-3.4.8/src/c/lib/libzookeeper_st.a
libtool: install: /usr/bin/install -c .libs/libzookeeper_mt.a /mesos/build/3rdparty/zookeeper-3.4.8/src/zookeeper-3.4.8/src/c/lib/libzookeeper_mt.a
libtool: install: chmod 644 /mesos/build/3rdparty/zookeeper-3.4.8/src/zookeeper-3.4.8/src/c/lib/libzookeeper_mt.a
libtool: install: ranlib /mesos/build/3rdparty/zookeeper-3.4.8/src/zookeeper-3.4.8/src/c/lib/libzookeeper_mt.a
libtool: finish: PATH="/usr/local/sbin:/usr/local/bin:/usr/sbin:/usr/bin:/sbin:/bin:/sbin"
ldconfig -n /mesos/build/3rdparty/zookeeper-3.4.8/src/zookeeper-3.4.8/src/c/lib
----------------------------------------------------------------------
Libraries have been installed in:
   /mesos/build/3rdparty/zookeeper-3.4.8/src/zookeeper-3.4.8/src/c/lib

If you ever happen to want to link against installed libraries
in a given directory, LIBDIR, you must either use libtool, and
specify the full pathname of the library, or use the '-LLIBDIR'
flag during linking and do at least one of the following:
   - add LIBDIR to the 'LD_LIBRARY_PATH' environment variable
     during execution
   - add LIBDIR to the 'LD_RUN_PATH' environment variable
     during linking
   - use the '-Wl,-rpath -Wl,LIBDIR' linker flag
   - have your system administrator add LIBDIR to '/etc/ld.so.conf'

See any operating system documentation about shared libraries for
more information, such as the ld(1) and ld.so(8) manual pages.
----------------------------------------------------------------------
 /bin/mkdir -p '/mesos/build/3rdparty/zookeeper-3.4.8/src/zookeeper-3.4.8/src/c/bin'
  /bin/bash ./libtool   --mode=install /usr/bin/install -c cli_st cli_mt load_gen '/mesos/build/3rdparty/zookeeper-3.4.8/src/zookeeper-3.4.8/src/c/bin'
libtool: install: /usr/bin/install -c cli_st /mesos/build/3rdparty/zookeeper-3.4.8/src/zookeeper-3.4.8/src/c/bin/cli_st
libtool: install: /usr/bin/install -c cli_mt /mesos/build/3rdparty/zookeeper-3.4.8/src/zookeeper-3.4.8/src/c/bin/cli_mt
libtool: install: /usr/bin/install -c load_gen /mesos/build/3rdparty/zookeeper-3.4.8/src/zookeeper-3.4.8/src/c/bin/load_gen
 /bin/mkdir -p '/mesos/build/3rdparty/zookeeper-3.4.8/src/zookeeper-3.4.8/src/c/include/zookeeper'
 /usr/bin/install -c -m 644 include/zookeeper.h include/zookeeper_version.h include/zookeeper_log.h
include/proto.h include/recordio.h generated/zookeeper.jute.h '/mesos/build/3rdparty/zookeeper-3.4.8/src/zookeeper-3.4.8/src/c/include/zookeeper'
make[4]: Leaving directory `/mesos/build/3rdparty/zookeeper-3.4.8/src/zookeeper-3.4.8/src/c'
make[3]: Leaving directory `/mesos/build/3rdparty/zookeeper-3.4.8/src/zookeeper-3.4.8/src/c'
cd /mesos/build/3rdparty/zookeeper-3.4.8/src/zookeeper-3.4.8-build && /usr/bin/cmake
-E touch /mesos/build/3rdparty/zookeeper-3.4.8/src/zookeeper-3.4.8-stamp/zookeeper-3.4.8-install
/usr/bin/cmake -E cmake_progress_report /mesos/build/CMakeFiles 
[ 40%] Completed 'zookeeper-3.4.8'
cd /mesos/build/3rdparty && /usr/bin/cmake -E make_directory /mesos/build/3rdparty/CMakeFiles
cd /mesos/build/3rdparty && /usr/bin/cmake -E touch /mesos/build/3rdparty/CMakeFiles/zookeeper-3.4.8-complete
cd /mesos/build/3rdparty && /usr/bin/cmake -E touch /mesos/build/3rdparty/zookeeper-3.4.8/src/zookeeper-3.4.8-stamp/zookeeper-3.4.8-done
make[2]: Leaving directory `/mesos/build'
/usr/bin/cmake -E cmake_progress_report /mesos/build/CMakeFiles  99 100
[ 40%] Built target zookeeper-3.4.8
ln -fs libleveldb.so.1.4 libleveldb.so
ln -fs libleveldb.so.1.4 libleveldb.so.1
g++ -I. -I./include -fno-builtin-memcmp -pthread -DOS_LINUX -DLEVELDB_PLATFORM_POSIX -O2 -DNDEBUG
       -c db/builder.cc -o db/builder.o
g++ -I. -I./include -fno-builtin-memcmp -pthread -DOS_LINUX -DLEVELDB_PLATFORM_POSIX -O2 -DNDEBUG
       -c db/c.cc -o db/c.o
g++ -I. -I./include -fno-builtin-memcmp -pthread -DOS_LINUX -DLEVELDB_PLATFORM_POSIX -O2 -DNDEBUG
       -c db/db_impl.cc -o db/db_impl.o
g++ -I. -I./include -fno-builtin-memcmp -pthread -DOS_LINUX -DLEVELDB_PLATFORM_POSIX -O2 -DNDEBUG
       -c db/db_iter.cc -o db/db_iter.o
g++ -I. -I./include -fno-builtin-memcmp -pthread -DOS_LINUX -DLEVELDB_PLATFORM_POSIX -O2 -DNDEBUG
       -c db/dbformat.cc -o db/dbformat.o
g++ -I. -I./include -fno-builtin-memcmp -pthread -DOS_LINUX -DLEVELDB_PLATFORM_POSIX -O2 -DNDEBUG
       -c db/filename.cc -o db/filename.o
g++ -I. -I./include -fno-builtin-memcmp -pthread -DOS_LINUX -DLEVELDB_PLATFORM_POSIX -O2 -DNDEBUG
       -c db/log_reader.cc -o db/log_reader.o
g++ -I. -I./include -fno-builtin-memcmp -pthread -DOS_LINUX -DLEVELDB_PLATFORM_POSIX -O2 -DNDEBUG
       -c db/log_writer.cc -o db/log_writer.o
g++ -I. -I./include -fno-builtin-memcmp -pthread -DOS_LINUX -DLEVELDB_PLATFORM_POSIX -O2 -DNDEBUG
       -c db/memtable.cc -o db/memtable.o
g++ -I. -I./include -fno-builtin-memcmp -pthread -DOS_LINUX -DLEVELDB_PLATFORM_POSIX -O2 -DNDEBUG
       -c db/repair.cc -o db/repair.o
g++ -I. -I./include -fno-builtin-memcmp -pthread -DOS_LINUX -DLEVELDB_PLATFORM_POSIX -O2 -DNDEBUG
       -c db/table_cache.cc -o db/table_cache.o
g++ -I. -I./include -fno-builtin-memcmp -pthread -DOS_LINUX -DLEVELDB_PLATFORM_POSIX -O2 -DNDEBUG
       -c db/version_edit.cc -o db/version_edit.o
g++ -I. -I./include -fno-builtin-memcmp -pthread -DOS_LINUX -DLEVELDB_PLATFORM_POSIX -O2 -DNDEBUG
       -c db/version_set.cc -o db/version_set.o
g++ -I. -I./include -fno-builtin-memcmp -pthread -DOS_LINUX -DLEVELDB_PLATFORM_POSIX -O2 -DNDEBUG
       -c db/write_batch.cc -o db/write_batch.o
g++ -I. -I./include -fno-builtin-memcmp -pthread -DOS_LINUX -DLEVELDB_PLATFORM_POSIX -O2 -DNDEBUG
       -c table/block.cc -o table/block.o
g++ -I. -I./include -fno-builtin-memcmp -pthread -DOS_LINUX -DLEVELDB_PLATFORM_POSIX -O2 -DNDEBUG
       -c table/block_builder.cc -o table/block_builder.o
g++ -I. -I./include -fno-builtin-memcmp -pthread -DOS_LINUX -DLEVELDB_PLATFORM_POSIX -O2 -DNDEBUG
       -c table/filter_block.cc -o table/filter_block.o
g++ -I. -I./include -fno-builtin-memcmp -pthread -DOS_LINUX -DLEVELDB_PLATFORM_POSIX -O2 -DNDEBUG
       -c table/format.cc -o table/format.o
g++ -I. -I./include -fno-builtin-memcmp -pthread -DOS_LINUX -DLEVELDB_PLATFORM_POSIX -O2 -DNDEBUG
       -c table/iterator.cc -o table/iterator.o
g++ -I. -I./include -fno-builtin-memcmp -pthread -DOS_LINUX -DLEVELDB_PLATFORM_POSIX -O2 -DNDEBUG
       -c table/merger.cc -o table/merger.o
g++ -I. -I./include -fno-builtin-memcmp -pthread -DOS_LINUX -DLEVELDB_PLATFORM_POSIX -O2 -DNDEBUG
       -c table/table.cc -o table/table.o
g++ -I. -I./include -fno-builtin-memcmp -pthread -DOS_LINUX -DLEVELDB_PLATFORM_POSIX -O2 -DNDEBUG
       -c table/table_builder.cc -o table/table_builder.o
g++ -I. -I./include -fno-builtin-memcmp -pthread -DOS_LINUX -DLEVELDB_PLATFORM_POSIX -O2 -DNDEBUG
       -c table/two_level_iterator.cc -o table/two_level_iterator.o
g++ -I. -I./include -fno-builtin-memcmp -pthread -DOS_LINUX -DLEVELDB_PLATFORM_POSIX -O2 -DNDEBUG
       -c util/arena.cc -o util/arena.o
g++ -I. -I./include -fno-builtin-memcmp -pthread -DOS_LINUX -DLEVELDB_PLATFORM_POSIX -O2 -DNDEBUG
       -c util/bloom.cc -o util/bloom.o
g++ -I. -I./include -fno-builtin-memcmp -pthread -DOS_LINUX -DLEVELDB_PLATFORM_POSIX -O2 -DNDEBUG
       -c util/cache.cc -o util/cache.o
g++ -I. -I./include -fno-builtin-memcmp -pthread -DOS_LINUX -DLEVELDB_PLATFORM_POSIX -O2 -DNDEBUG
       -c util/coding.cc -o util/coding.o
g++ -I. -I./include -fno-builtin-memcmp -pthread -DOS_LINUX -DLEVELDB_PLATFORM_POSIX -O2 -DNDEBUG
       -c util/comparator.cc -o util/comparator.o
g++ -I. -I./include -fno-builtin-memcmp -pthread -DOS_LINUX -DLEVELDB_PLATFORM_POSIX -O2 -DNDEBUG
       -c util/crc32c.cc -o util/crc32c.o
g++ -I. -I./include -fno-builtin-memcmp -pthread -DOS_LINUX -DLEVELDB_PLATFORM_POSIX -O2 -DNDEBUG
       -c util/env.cc -o util/env.o
g++ -I. -I./include -fno-builtin-memcmp -pthread -DOS_LINUX -DLEVELDB_PLATFORM_POSIX -O2 -DNDEBUG
       -c util/env_posix.cc -o util/env_posix.o
g++ -I. -I./include -fno-builtin-memcmp -pthread -DOS_LINUX -DLEVELDB_PLATFORM_POSIX -O2 -DNDEBUG
       -c util/filter_policy.cc -o util/filter_policy.o
g++ -I. -I./include -fno-builtin-memcmp -pthread -DOS_LINUX -DLEVELDB_PLATFORM_POSIX -O2 -DNDEBUG
       -c util/hash.cc -o util/hash.o
g++ -I. -I./include -fno-builtin-memcmp -pthread -DOS_LINUX -DLEVELDB_PLATFORM_POSIX -O2 -DNDEBUG
       -c util/histogram.cc -o util/histogram.o
g++ -I. -I./include -fno-builtin-memcmp -pthread -DOS_LINUX -DLEVELDB_PLATFORM_POSIX -O2 -DNDEBUG
       -c util/logging.cc -o util/logging.o
g++ -I. -I./include -fno-builtin-memcmp -pthread -DOS_LINUX -DLEVELDB_PLATFORM_POSIX -O2 -DNDEBUG
       -c util/options.cc -o util/options.o
g++ -I. -I./include -fno-builtin-memcmp -pthread -DOS_LINUX -DLEVELDB_PLATFORM_POSIX -O2 -DNDEBUG
       -c util/status.cc -o util/status.o
g++ -I. -I./include -fno-builtin-memcmp -pthread -DOS_LINUX -DLEVELDB_PLATFORM_POSIX -O2 -DNDEBUG
       -c port/port_posix.cc -o port/port_posix.o
rm -f libleveldb.a
ar -rs libleveldb.a db/builder.o db/c.o db/db_impl.o db/db_iter.o db/dbformat.o db/filename.o
db/log_reader.o db/log_writer.o db/memtable.o db/repair.o db/table_cache.o db/version_edit.o
db/version_set.o db/write_batch.o table/block.o table/block_builder.o table/filter_block.o
table/format.o table/iterator.o table/merger.o table/table.o table/table_builder.o table/two_level_iterator.o
util/arena.o util/bloom.o util/cache.o util/coding.o util/comparator.o util/crc32c.o util/env.o
util/env_posix.o util/filter_policy.o util/hash.o util/histogram.o util/logging.o util/options.o
util/status.o port/port_posix.o
ar: creating libleveldb.a
make[3]: Leaving directory `/mesos/build/3rdparty/leveldb-1.4/src/leveldb-1.4'
cd /mesos/build/3rdparty/leveldb-1.4/src/leveldb-1.4-build && /usr/bin/cmake -E touch
/mesos/build/3rdparty/leveldb-1.4/src/leveldb-1.4-stamp/leveldb-1.4-build
/usr/bin/cmake -E cmake_progress_report /mesos/build/CMakeFiles 
[ 40%] Performing install step for 'leveldb-1.4'
cd /mesos/build/3rdparty/leveldb-1.4/src/leveldb-1.4-build && /usr/bin/cmake -E echo

cd /mesos/build/3rdparty/leveldb-1.4/src/leveldb-1.4-build && /usr/bin/cmake -E touch
/mesos/build/3rdparty/leveldb-1.4/src/leveldb-1.4-stamp/leveldb-1.4-install
/usr/bin/cmake -E cmake_progress_report /mesos/build/CMakeFiles 10
[ 41%] Completed 'leveldb-1.4'
cd /mesos/build/3rdparty && /usr/bin/cmake -E make_directory /mesos/build/3rdparty/CMakeFiles
cd /mesos/build/3rdparty && /usr/bin/cmake -E touch /mesos/build/3rdparty/CMakeFiles/leveldb-1.4-complete
cd /mesos/build/3rdparty && /usr/bin/cmake -E touch /mesos/build/3rdparty/leveldb-1.4/src/leveldb-1.4-stamp/leveldb-1.4-done
make[2]: Leaving directory `/mesos/build'
/usr/bin/cmake -E cmake_progress_report /mesos/build/CMakeFiles  10 11
[ 41%] Built target leveldb-1.4
make -f src/CMakeFiles/mesos-1.0.0.dir/build.make src/CMakeFiles/mesos-1.0.0.dir/depend
make[2]: Entering directory `/mesos/build'
/usr/bin/cmake -E cmake_progress_report /mesos/build/CMakeFiles 
/usr/bin/cmake -E cmake_progress_report /mesos/build/CMakeFiles 14
/usr/bin/cmake -E cmake_progress_report /mesos/build/CMakeFiles 
/usr/bin/cmake -E cmake_progress_report /mesos/build/CMakeFiles 
/usr/bin/cmake -E cmake_progress_report /mesos/build/CMakeFiles 
/usr/bin/cmake -E cmake_progress_report /mesos/build/CMakeFiles 15
/usr/bin/cmake -E cmake_progress_report /mesos/build/CMakeFiles 
/usr/bin/cmake -E cmake_progress_report /mesos/build/CMakeFiles 
[ 42%] [ 42%] [ 42%] [ 42%] [ 42%] [ 43%] [ 43%] [ 43%] Generating ../include/mesos/authorizer/authorizer.pb.cc,
../include/mesos/authorizer/authorizer.pb.h
Generating ../include/mesos/v1/scheduler/scheduler.pb.cc, ../include/mesos/v1/scheduler/scheduler.pb.h
Generating ../include/mesos/authorizer/acls.pb.cc, ../include/mesos/authorizer/acls.pb.h
/mesos/build/3rdparty/protobuf-2.6.1/src/protobuf-2.6.1-lib/lib/bin/protoc -I/mesos/include
-I/mesos/src --cpp_out=/mesos/build/include /mesos/include/mesos/authorizer/authorizer.proto
/mesos/build/3rdparty/protobuf-2.6.1/src/protobuf-2.6.1-lib/lib/bin/protoc -I/mesos/include
-I/mesos/src --cpp_out=/mesos/build/include /mesos/include/mesos/v1/scheduler/scheduler.proto
Generating ../include/mesos/master/allocator.pb.cc, ../include/mesos/master/allocator.pb.h
/mesos/build/3rdparty/protobuf-2.6.1/src/protobuf-2.6.1-lib/lib/bin/protoc -I/mesos/include
-I/mesos/src --cpp_out=/mesos/build/include /mesos/include/mesos/authorizer/acls.proto
Generating ../include/mesos/containerizer/containerizer.pb.cc, ../include/mesos/containerizer/containerizer.pb.h
Generating ../include/mesos/docker/spec.pb.cc, ../include/mesos/docker/spec.pb.h
/mesos/build/3rdparty/protobuf-2.6.1/src/protobuf-2.6.1-lib/lib/bin/protoc -I/mesos/include
-I/mesos/src --cpp_out=/mesos/build/include /mesos/include/mesos/master/allocator.proto
Generating ../include/mesos/appc/spec.pb.cc, ../include/mesos/appc/spec.pb.h
Generating ../include/mesos/authentication/authentication.pb.cc, ../include/mesos/authentication/authentication.pb.h
/mesos/build/3rdparty/protobuf-2.6.1/src/protobuf-2.6.1-lib/lib/bin/protoc -I/mesos/include
-I/mesos/src --cpp_out=/mesos/build/include /mesos/include/mesos/containerizer/containerizer.proto
/mesos/build/3rdparty/protobuf-2.6.1/src/protobuf-2.6.1-lib/lib/bin/protoc -I/mesos/include
-I/mesos/src --cpp_out=/mesos/build/include /mesos/include/mesos/docker/spec.proto
/mesos/build/3rdparty/protobuf-2.6.1/src/protobuf-2.6.1-lib/lib/bin/protoc -I/mesos/include
-I/mesos/src --cpp_out=/mesos/build/include /mesos/include/mesos/appc/spec.proto
/mesos/build/3rdparty/protobuf-2.6.1/src/protobuf-2.6.1-lib/lib/bin/protoc -I/mesos/include
-I/mesos/src --cpp_out=/mesos/build/include /mesos/include/mesos/authentication/authentication.proto
/usr/bin/cmake -E cmake_progress_report /mesos/build/CMakeFiles 
/usr/bin/cmake -E cmake_progress_report /mesos/build/CMakeFiles 16
/usr/bin/cmake -E cmake_progress_report /mesos/build/CMakeFiles 
[ 44%] [ 44%] /usr/bin/cmake -E cmake_progress_report /mesos/build/CMakeFiles 
[ 44%] /usr/bin/cmake -E cmake_progress_report /mesos/build/CMakeFiles 
/usr/bin/cmake -E cmake_progress_report /mesos/build/CMakeFiles 17
/usr/bin/cmake -E cmake_progress_report /mesos/build/CMakeFiles 
[ 44%] Generating ../include/mesos/docker/v1.pb.cc, ../include/mesos/docker/v1.pb.h
/mesos/build/3rdparty/protobuf-2.6.1/src/protobuf-2.6.1-lib/lib/bin/protoc -I/mesos/include
-I/mesos/src --cpp_out=/mesos/build/include /mesos/include/mesos/docker/v1.proto
Generating ../include/mesos/docker/v2.pb.cc, ../include/mesos/docker/v2.pb.h
/mesos/build/3rdparty/protobuf-2.6.1/src/protobuf-2.6.1-lib/lib/bin/protoc -I/mesos/include
-I/mesos/src --cpp_out=/mesos/build/include /mesos/include/mesos/docker/v2.proto
/usr/bin/cmake -E cmake_progress_report /mesos/build/CMakeFiles 
Generating ../include/mesos/executor/executor.pb.cc, ../include/mesos/executor/executor.pb.h
[ 44%] Generating ../include/mesos/fetcher/fetcher.pb.cc, ../include/mesos/fetcher/fetcher.pb.h
/mesos/build/3rdparty/protobuf-2.6.1/src/protobuf-2.6.1-lib/lib/bin/protoc -I/mesos/include
-I/mesos/src --cpp_out=/mesos/build/include /mesos/include/mesos/executor/executor.proto
[ 45%] [ 45%] /mesos/build/3rdparty/protobuf-2.6.1/src/protobuf-2.6.1-lib/lib/bin/protoc -I/mesos/include
-I/mesos/src --cpp_out=/mesos/build/include /mesos/include/mesos/fetcher/fetcher.proto
/usr/bin/cmake -E cmake_progress_report /mesos/build/CMakeFiles 
[ 45%] /usr/bin/cmake -E cmake_progress_report /mesos/build/CMakeFiles 18
[ 45%] Generating messages/flags.pb.cc, messages/flags.pb.h
/mesos/build/3rdparty/protobuf-2.6.1/src/protobuf-2.6.1-lib/lib/bin/protoc -I/mesos/include
-I/mesos/src --cpp_out=/mesos/build/src /mesos/src/messages/flags.proto
Generating messages/log.pb.cc, messages/log.pb.h
Generating messages/messages.pb.cc, messages/messages.pb.h
/mesos/build/3rdparty/protobuf-2.6.1/src/protobuf-2.6.1-lib/lib/bin/protoc -I/mesos/include
-I/mesos/src --cpp_out=/mesos/build/src /mesos/src/messages/log.proto
/mesos/build/3rdparty/protobuf-2.6.1/src/protobuf-2.6.1-lib/lib/bin/protoc -I/mesos/include
-I/mesos/src --cpp_out=/mesos/build/src /mesos/src/messages/messages.proto
Generating messages/state.pb.cc, messages/state.pb.h
/mesos/build/3rdparty/protobuf-2.6.1/src/protobuf-2.6.1-lib/lib/bin/protoc -I/mesos/include
-I/mesos/src --cpp_out=/mesos/build/src /mesos/src/messages/state.proto
/usr/bin/cmake -E cmake_progress_report /mesos/build/CMakeFiles 
/usr/bin/cmake -E cmake_progress_report /mesos/build/CMakeFiles 
[ 46%] /usr/bin/cmake -E cmake_progress_report /mesos/build/CMakeFiles 
/usr/bin/cmake -E cmake_progress_report /mesos/build/CMakeFiles 19
Generating ../include/mesos/slave/isolator.pb.cc, ../include/mesos/slave/isolator.pb.h
/mesos/build/3rdparty/protobuf-2.6.1/src/protobuf-2.6.1-lib/lib/bin/protoc -I/mesos/include
-I/mesos/src --cpp_out=/mesos/build/include /mesos/include/mesos/slave/isolator.proto
[ 46%] [ 46%] /usr/bin/cmake -E cmake_progress_report /mesos/build/CMakeFiles 
Generating slave/containerizer/mesos/isolators/network/cni/spec.pb.cc, slave/containerizer/mesos/isolators/network/cni/spec.pb.h
/mesos/build/3rdparty/protobuf-2.6.1/src/protobuf-2.6.1-lib/lib/bin/protoc -I/mesos/include
-I/mesos/src --cpp_out=/mesos/build/src /mesos/src/slave/containerizer/mesos/isolators/network/cni/spec.proto
[ 46%] [ 47%] [ 47%] /usr/bin/cmake -E cmake_progress_report /mesos/build/CMakeFiles 
Generating slave/containerizer/mesos/isolators/docker/volume/state.pb.cc, slave/containerizer/mesos/isolators/docker/volume/state.pb.h
/mesos/build/3rdparty/protobuf-2.6.1/src/protobuf-2.6.1-lib/lib/bin/protoc -I/mesos/include
-I/mesos/src --cpp_out=/mesos/build/src /mesos/src/slave/containerizer/mesos/isolators/docker/volume/state.proto
Generating ../include/mesos/maintenance/maintenance.pb.cc, ../include/mesos/maintenance/maintenance.pb.h
/usr/bin/cmake -E cmake_progress_report /mesos/build/CMakeFiles 
/mesos/build/3rdparty/protobuf-2.6.1/src/protobuf-2.6.1-lib/lib/bin/protoc -I/mesos/include
-I/mesos/src --cpp_out=/mesos/build/include /mesos/include/mesos/maintenance/maintenance.proto
Generating ../include/mesos/mesos.pb.cc, ../include/mesos/mesos.pb.h
/mesos/build/3rdparty/protobuf-2.6.1/src/protobuf-2.6.1-lib/lib/bin/protoc -I/mesos/include
-I/mesos/src --cpp_out=/mesos/build/include /mesos/include/mesos/mesos.proto
Generating ../include/mesos/module/module.pb.cc, ../include/mesos/module/module.pb.h
Generating ../include/mesos/quota/quota.pb.cc, ../include/mesos/quota/quota.pb.h
/mesos/build/3rdparty/protobuf-2.6.1/src/protobuf-2.6.1-lib/lib/bin/protoc -I/mesos/include
-I/mesos/src --cpp_out=/mesos/build/include /mesos/include/mesos/module/module.proto
/mesos/build/3rdparty/protobuf-2.6.1/src/protobuf-2.6.1-lib/lib/bin/protoc -I/mesos/include
-I/mesos/src --cpp_out=/mesos/build/include /mesos/include/mesos/quota/quota.proto
[ 47%] /usr/bin/cmake -E cmake_progress_report /mesos/build/CMakeFiles 20
/usr/bin/cmake -E cmake_progress_report /mesos/build/CMakeFiles 
[ 47%] Generating ../include/mesos/slave/oversubscription.pb.cc, ../include/mesos/slave/oversubscription.pb.h
[ 47%] [ 48%] /mesos/build/3rdparty/protobuf-2.6.1/src/protobuf-2.6.1-lib/lib/bin/protoc -I/mesos/include
-I/mesos/src --cpp_out=/mesos/build/include /mesos/include/mesos/slave/oversubscription.proto
Generating slave/containerizer/mesos/provisioner/docker/message.pb.cc, slave/containerizer/mesos/provisioner/docker/message.pb.h
/mesos/build/3rdparty/protobuf-2.6.1/src/protobuf-2.6.1-lib/lib/bin/protoc -I/mesos/include
-I/mesos/src --cpp_out=/mesos/build/src /mesos/src/slave/containerizer/mesos/provisioner/docker/message.proto
/usr/bin/cmake -E cmake_progress_report /mesos/build/CMakeFiles 
/usr/bin/cmake -E cmake_progress_report /mesos/build/CMakeFiles 
/usr/bin/cmake -E cmake_progress_report /mesos/build/CMakeFiles 
/usr/bin/cmake -E cmake_progress_report /mesos/build/CMakeFiles 21
Generating master/registry.pb.cc, master/registry.pb.h
[ 48%] [ 48%] /mesos/build/3rdparty/protobuf-2.6.1/src/protobuf-2.6.1-lib/lib/bin/protoc -I/mesos/include
-I/mesos/src --cpp_out=/mesos/build/src /mesos/src/master/registry.proto
Generating ../include/mesos/scheduler/scheduler.pb.cc, ../include/mesos/scheduler/scheduler.pb.h
/mesos/build/3rdparty/protobuf-2.6.1/src/protobuf-2.6.1-lib/lib/bin/protoc -I/mesos/include
-I/mesos/src --cpp_out=/mesos/build/include /mesos/include/mesos/scheduler/scheduler.proto
[ 48%] [ 49%] /usr/bin/cmake -E cmake_progress_report /mesos/build/CMakeFiles 
Generating ../include/mesos/state/state.pb.cc, ../include/mesos/state/state.pb.h
/mesos/build/3rdparty/protobuf-2.6.1/src/protobuf-2.6.1-lib/lib/bin/protoc -I/mesos/include
-I/mesos/src --cpp_out=/mesos/build/include /mesos/include/mesos/state/state.proto
Generating ../include/mesos/v1/agent.pb.cc, ../include/mesos/v1/agent.pb.h
/mesos/build/3rdparty/protobuf-2.6.1/src/protobuf-2.6.1-lib/lib/bin/protoc -I/mesos/include
-I/mesos/src --cpp_out=/mesos/build/include /mesos/include/mesos/v1/agent.proto
Generating ../include/mesos/uri/uri.pb.cc, ../include/mesos/uri/uri.pb.h
/mesos/build/3rdparty/protobuf-2.6.1/src/protobuf-2.6.1-lib/lib/bin/protoc -I/mesos/include
-I/mesos/src --cpp_out=/mesos/build/include /mesos/include/mesos/uri/uri.proto
Generating ../include/mesos/v1/master/allocator.pb.cc, ../include/mesos/v1/master/allocator.pb.h
[ 49%] /mesos/include/mesos/v1/agent.proto: No such file or directory
make[2]: *** [include/mesos/v1/agent.pb.cc] Error 1
make[2]: *** Waiting for unfinished jobs....
/mesos/build/3rdparty/protobuf-2.6.1/src/protobuf-2.6.1-lib/lib/bin/protoc -I/mesos/include
-I/mesos/src --cpp_out=/mesos/build/include /mesos/include/mesos/v1/master/allocator.proto
Generating ../include/mesos/v1/executor/executor.pb.cc, ../include/mesos/v1/executor/executor.pb.h
/mesos/build/3rdparty/protobuf-2.6.1/src/protobuf-2.6.1-lib/lib/bin/protoc -I/mesos/include
-I/mesos/src --cpp_out=/mesos/build/include /mesos/include/mesos/v1/executor/executor.proto
make[2]: Leaving directory `/mesos/build'
make[1]: *** [src/CMakeFiles/mesos-1.0.0.dir/all] Error 2
make: *** [all] Error 2
make[1]: Leaving directory `/mesos/build'
+ docker rmi mesos-1466117508-6362
Untagged: mesos-1466117508-6362:latest
Deleted: 970c181f9ca12db25221765a19d2608873278b1341a5f5ba42595cdb620a827f
Deleted: 49a868208db7eb40752d207e8a4de24d8c5ac917d9ee730702fab7e3aa6b3d27
Deleted: eee5e68304a7e76c3d77bc04cc241967e9cf95c8edfa69a650097b879ffb0b7d
Deleted: 6d8bf5969dc9b4d8b169b1e60803586981b821df6d651f8be1a8ab6d5aace07f
Deleted: 1c44d49671ecf163c12646a28ef51ddfccb4f3a2d1f4beecd4da14a3303a08e2
Deleted: 25a5cab2c1a53a1b7e303d5072b83cb344769376361aece534c91775ea305f23
Deleted: d07f1b3d79db7cd4d9da2db4150a59c26b1acd3c452589d4df0e1e4793f88fe0
Deleted: bcfafaf3b032959dcde97193323211c50d7b68bf1cd6a5a25971e393d43f1013
Deleted: 052637ea6e4de743928f8023bd6229b08eaca4ccb952a49725ed7fb790c028f1
Deleted: 7ab623ca63f13b3c0d84710cbcca34d4aa3d93d784fac02c08907c34928c8153
Deleted: 131411e37729c05a89065c39da28bd4054315833c613ba08a9e414225eafeec8
Deleted: 1ed93773732e9b05e33cc230896b7e14c77367947ce4e3f30ac1d5a38825eae3
Deleted: bd7d4ac8633124e44556fec4307848b108e560a02fdbd3296b07c45ca2ebc818
Deleted: 2671d3432ec4304fac5a8c323981b1b43bbdf2102b071398ac67318479415604
Deleted: 609b67cf52158eed2447e93b9e5536fcb59147d606085637d85065ce74517a4b
Build step 'Execute shell' marked build as failure

Mime
View raw message