mesos-builds mailing list archives

Site index · List index
Message view « Date » · « Thread »
Top « Date » · « Thread »
From Apache Jenkins Server <jenk...@builds.apache.org>
Subject Build failed in Jenkins: Mesos » cmake,clang,--verbose --enable-libevent --enable-ssl,GLOG_v=1 MESOS_VERBOSE=1,ubuntu:14.04,(docker||Hadoop)&&(!ubuntu-us1)&&(!ubuntu-6) #2402
Date Thu, 30 Jun 2016 07:42:24 GMT
See <https://builds.apache.org/job/Mesos/BUILDTOOL=cmake,COMPILER=clang,CONFIGURATION=--verbose%20--enable-libevent%20--enable-ssl,ENVIRONMENT=GLOG_v=1%20MESOS_VERBOSE=1,OS=ubuntu%3A14.04,label_exp=(docker%7C%7CHadoop)&&(!ubuntu-us1)&&(!ubuntu-6)/2402/changes>

Changes:

[josephwu] Fix CMake build.

------------------------------------------
[...truncated 8616 lines...]
I0630 07:42:33.901957 18755 process.cpp:3322] Handling HTTP event for process '(63)' with
path: '/(63)/authenticated'
[       OK ] HttpAuthenticationTest.NoAuthenticator (2 ms)
[ RUN      ] HttpAuthenticationTest.Unauthorized
I0630 07:42:33.904258 18758 process.cpp:3322] Handling HTTP event for process '(66)' with
path: '/(66)/authenticated'
[       OK ] HttpAuthenticationTest.Unauthorized (2 ms)
[ RUN      ] HttpAuthenticationTest.Forbidden
I0630 07:42:33.906744 18757 process.cpp:3322] Handling HTTP event for process '(69)' with
path: '/(69)/authenticated'
[       OK ] HttpAuthenticationTest.Forbidden (2 ms)
[ RUN      ] HttpAuthenticationTest.Authenticated
I0630 07:42:33.908861 18754 process.cpp:3322] Handling HTTP event for process '(72)' with
path: '/(72)/authenticated'
[       OK ] HttpAuthenticationTest.Authenticated (2 ms)
[ RUN      ] HttpAuthenticationTest.Pipelining
I0630 07:42:33.911779 18756 process.cpp:3322] Handling HTTP event for process '(75)' with
path: '/(75)/authenticated'
I0630 07:42:33.912087 18756 process.cpp:3322] Handling HTTP event for process '(75)' with
path: '/(75)/authenticated'
[       OK ] HttpAuthenticationTest.Pipelining (8 ms)
[ RUN      ] HttpAuthenticationTest.Basic
I0630 07:42:33.920064 18750 process.cpp:3322] Handling HTTP event for process '(78)' with
path: '/(78)/authenticated'
I0630 07:42:33.923566 18754 process.cpp:3322] Handling HTTP event for process '(78)' with
path: '/(78)/authenticated'
I0630 07:42:33.927476 18762 process.cpp:3322] Handling HTTP event for process '(78)' with
path: '/(78)/authenticated'
I0630 07:42:33.931794 18759 process.cpp:3322] Handling HTTP event for process '(78)' with
path: '/(78)/authenticated'
[       OK ] HttpAuthenticationTest.Basic (24 ms)
[----------] 6 tests from HttpAuthenticationTest (41 ms total)

[----------] 6 tests from IOTest
[ RUN      ] IOTest.Poll
[       OK ] IOTest.Poll (2 ms)
[ RUN      ] IOTest.Read
[       OK ] IOTest.Read (1 ms)
[ RUN      ] IOTest.BufferedRead
[       OK ] IOTest.BufferedRead (3 ms)
[ RUN      ] IOTest.Write
[       OK ] IOTest.Write (9 ms)
[ RUN      ] IOTest.Redirect
[       OK ] IOTest.Redirect (35 ms)
[ RUN      ] IOTest.Peek
[       OK ] IOTest.Peek (3 ms)
[----------] 6 tests from IOTest (54 ms total)

[----------] 9 tests from MetricsTest
[ RUN      ] MetricsTest.Counter
[       OK ] MetricsTest.Counter (2 ms)
[ RUN      ] MetricsTest.Gauge
[       OK ] MetricsTest.Gauge (2 ms)
[ RUN      ] MetricsTest.Statistics
[       OK ] MetricsTest.Statistics (20 ms)
[ RUN      ] MetricsTest.Snapshot
I0630 07:42:34.053473 18750 process.cpp:3322] Handling HTTP event for process 'metrics' with
path: '/metrics/snapshot'
I0630 07:42:34.103277 18752 process.cpp:3322] Handling HTTP event for process 'metrics' with
path: '/metrics/snapshot'
[       OK ] MetricsTest.Snapshot (92 ms)
[ RUN      ] MetricsTest.SnapshotTimeout
I0630 07:42:34.113790 18762 process.cpp:3322] Handling HTTP event for process 'metrics' with
path: '/metrics/snapshot'
I0630 07:42:34.164924 18756 process.cpp:3322] Handling HTTP event for process 'metrics' with
path: '/metrics/snapshot'
I0630 07:42:34.174659 18765 metrics.cpp:260] Exceeded timeout of 2secs when attempting to
get metric 'test/gauge_timeout'
I0630 07:42:34.236261 18764 process.cpp:3322] Handling HTTP event for process 'metrics' with
path: '/metrics/snapshot'
[       OK ] MetricsTest.SnapshotTimeout (138 ms)
[ RUN      ] MetricsTest.SnapshotStatistics
I0630 07:42:34.263710 18752 process.cpp:3322] Handling HTTP event for process 'metrics' with
path: '/metrics/snapshot'
[       OK ] MetricsTest.SnapshotStatistics (31 ms)
[ RUN      ] MetricsTest.Timer
[       OK ] MetricsTest.Timer (22 ms)
[ RUN      ] MetricsTest.AsyncTimer
[       OK ] MetricsTest.AsyncTimer (31 ms)
[ RUN      ] MetricsTest.SnapshotAuthenticationEnabled
I0630 07:42:34.337177 18752 process.cpp:3322] Handling HTTP event for process 'metrics' with
path: '/metrics/snapshot'
[       OK ] MetricsTest.SnapshotAuthenticationEnabled (31 ms)
[----------] 9 tests from MetricsTest (370 ms total)

[----------] 30 tests from ProcessTest
[ RUN      ] ProcessTest.Event
[       OK ] ProcessTest.Event (0 ms)
[ RUN      ] ProcessTest.Spawn
[       OK ] ProcessTest.Spawn (2 ms)
[ RUN      ] ProcessTest.Dispatch
[       OK ] ProcessTest.Dispatch (9 ms)
[ RUN      ] ProcessTest.Defer1
[       OK ] ProcessTest.Defer1 (2 ms)
[ RUN      ] ProcessTest.Defer2
[       OK ] ProcessTest.Defer2 (0 ms)
[ RUN      ] ProcessTest.Defer3
[       OK ] ProcessTest.Defer3 (1 ms)
[ RUN      ] ProcessTest.Handlers
[       OK ] ProcessTest.Handlers (0 ms)
[ RUN      ] ProcessTest.Expect
[       OK ] ProcessTest.Expect (1 ms)
[ RUN      ] ProcessTest.Action
[       OK ] ProcessTest.Action (1 ms)
[ RUN      ] ProcessTest.Inheritance
[       OK ] ProcessTest.Inheritance (0 ms)
[ RUN      ] ProcessTest.Thunk
[       OK ] ProcessTest.Thunk (0 ms)
[ RUN      ] ProcessTest.Delegate
I0630 07:42:34.382621 18762 process.cpp:3305] Delegating message 'func' to (111)@172.17.0.2:33155
[       OK ] ProcessTest.Delegate (2 ms)
[ RUN      ] ProcessTest.Delay
[       OK ] ProcessTest.Delay (0 ms)
[ RUN      ] ProcessTest.Order
[       OK ] ProcessTest.Order (1 ms)
[ RUN      ] ProcessTest.Donate
[       OK ] ProcessTest.Donate (0 ms)
[ RUN      ] ProcessTest.Exited
[       OK ] ProcessTest.Exited (0 ms)
[ RUN      ] ProcessTest.InjectExited
[       OK ] ProcessTest.InjectExited (1 ms)
[ RUN      ] ProcessTest.Settle
[       OK ] ProcessTest.Settle (40 ms)
[ RUN      ] ProcessTest.Pid
[       OK ] ProcessTest.Pid (0 ms)
[ RUN      ] ProcessTest.Listener
[       OK ] ProcessTest.Listener (1 ms)
[ RUN      ] ProcessTest.Executor
[       OK ] ProcessTest.Executor (0 ms)
[ RUN      ] ProcessTest.Remote
[       OK ] ProcessTest.Remote (2 ms)
[ RUN      ] ProcessTest.Http1
[       OK ] ProcessTest.Http1 (1 ms)
[ RUN      ] ProcessTest.Http2
[       OK ] ProcessTest.Http2 (2 ms)
[ RUN      ] ProcessTest.Async
[       OK ] ProcessTest.Async (2 ms)
[ RUN      ] ProcessTest.Provide
I0630 07:42:34.435150 18763 process.cpp:3322] Handling HTTP event for process '(132)' with
path: '/(132)'
I0630 07:42:34.435322 18757 process.cpp:1279] Sending file at '/tmp/OHwsOT/lorem.txt' with
length 446
[       OK ] ProcessTest.Provide (2 ms)
[ RUN      ] ProcessTest.Defers
[       OK ] ProcessTest.Defers (0 ms)
[ RUN      ] ProcessTest.PercentEncodedURLs
I0630 07:42:34.438499 18749 process.cpp:3322] Handling HTTP event for process 'id(42)' with
path: '/id(42)/handler2'
[       OK ] ProcessTest.PercentEncodedURLs (4 ms)
[ RUN      ] ProcessTest.FirewallDisablePaths
I0630 07:42:34.441005 18765 process.cpp:2542] Returning '403 Forbidden' for '/testprocess/handler1'
(firewall rule forbids request)
I0630 07:42:34.442294 18762 process.cpp:3322] Handling HTTP event for process 'testprocess'
with path: '/testprocess/handler2'
I0630 07:42:34.443529 18765 process.cpp:2542] Returning '403 Forbidden' for '/testprocess/handler2/nested'
(firewall rule forbids request)
I0630 07:42:34.444703 18763 process.cpp:3322] Handling HTTP event for process 'testprocess'
with path: '/testprocess/handler2/nested/path'
I0630 07:42:34.446336 18752 process.cpp:3322] Handling HTTP event for process 'testprocess'
with path: '/testprocess/handler3'
I0630 07:42:34.447945 18751 process.cpp:3322] Handling HTTP event for process 'testprocess'
with path: '/testprocess/handler3/nested'
[       OK ] ProcessTest.FirewallDisablePaths (9 ms)
[ RUN      ] ProcessTest.FirewallUninstall
I0630 07:42:34.449940 18765 process.cpp:2542] Returning '403 Forbidden' for '/testprocess/handler1'
(firewall rule forbids request)
I0630 07:42:34.451320 18765 process.cpp:2542] Returning '403 Forbidden' for '/testprocess/handler2'
(firewall rule forbids request)
I0630 07:42:34.452865 18757 process.cpp:3322] Handling HTTP event for process 'testprocess'
with path: '/testprocess/handler1'
I0630 07:42:34.457304 18755 process.cpp:3322] Handling HTTP event for process 'testprocess'
with path: '/testprocess/handler2'
[       OK ] ProcessTest.FirewallUninstall (9 ms)
[----------] 30 tests from ProcessTest (92 ms total)

[----------] 6 tests from ProcessRemoteLinkTest
[ RUN      ] ProcessRemoteLinkTest.RemoteLink
WARNING: Logging before InitGoogleLogging() is written to STDERR
I0630 07:42:34.475396 18793 process.cpp:1066] libprocess is initialized on 172.17.0.2:39603
with 16 worker threads
[       OK ] ProcessRemoteLinkTest.RemoteLink (35 ms)
[ RUN      ] ProcessRemoteLinkTest.RemoteRelink
WARNING: Logging before InitGoogleLogging() is written to STDERR
I0630 07:42:34.506522 18812 process.cpp:1066] libprocess is initialized on 172.17.0.2:39982
with 16 worker threads
[       OK ] ProcessRemoteLinkTest.RemoteRelink (30 ms)
[ RUN      ] ProcessRemoteLinkTest.RemoteLinkRelink
WARNING: Logging before InitGoogleLogging() is written to STDERR
I0630 07:42:34.536617 18831 process.cpp:1066] libprocess is initialized on 172.17.0.2:33316
with 16 worker threads
[       OK ] ProcessRemoteLinkTest.RemoteLinkRelink (30 ms)
[ RUN      ] ProcessRemoteLinkTest.RemoteDoubleLinkRelink
WARNING: Logging before InitGoogleLogging() is written to STDERR
I0630 07:42:34.565871 18850 process.cpp:1066] libprocess is initialized on 172.17.0.2:36371
with 16 worker threads
[       OK ] ProcessRemoteLinkTest.RemoteDoubleLinkRelink (29 ms)
[ RUN      ] ProcessRemoteLinkTest.RemoteUseStaleLink
WARNING: Logging before InitGoogleLogging() is written to STDERR
I0630 07:42:34.607107 18869 process.cpp:1066] libprocess is initialized on 172.17.0.2:37256
with 16 worker threads
E0630 07:42:34.609964 18765 process.cpp:2104] Failed to shutdown socket with fd 7: Transport
endpoint is not connected
I0630 07:42:34.610074 18748 poll_socket.cpp:189] Socket error while sending: Broken pipe
[       OK ] ProcessRemoteLinkTest.RemoteUseStaleLink (54 ms)
[ RUN      ] ProcessRemoteLinkTest.RemoteStaleLinkRelink
WARNING: Logging before InitGoogleLogging() is written to STDERR
I0630 07:42:34.661110 18888 process.cpp:1066] libprocess is initialized on 172.17.0.2:56294
with 16 worker threads
E0630 07:42:34.666393 18765 process.cpp:2104] Failed to shutdown socket with fd 7: Transport
endpoint is not connected
/mesos/3rdparty/libprocess/src/tests/process_tests.cpp:1059: Failure
Value of: exitedPid.isPending()
  Actual: false
Expected: true
[  FAILED  ] ProcessRemoteLinkTest.RemoteStaleLinkRelink (56 ms)
[----------] 6 tests from ProcessRemoteLinkTest (234 ms total)

[----------] 3 tests from ReapTest
[ RUN      ] ReapTest.NonChildProcess
[       OK ] ReapTest.NonChildProcess (45 ms)
[ RUN      ] ReapTest.ChildProcess
[       OK ] ReapTest.ChildProcess (33 ms)
[ RUN      ] ReapTest.TerminatedChildProcess
[       OK ] ReapTest.TerminatedChildProcess (22 ms)
[----------] 3 tests from ReapTest (100 ms total)

[----------] 4 tests from SequenceTest
[ RUN      ] SequenceTest.Serialize
[       OK ] SequenceTest.Serialize (12 ms)
[ RUN      ] SequenceTest.DiscardOne
[       OK ] SequenceTest.DiscardOne (11 ms)
[ RUN      ] SequenceTest.DiscardAll
[       OK ] SequenceTest.DiscardAll (11 ms)
[ RUN      ] SequenceTest.Random
[       OK ] SequenceTest.Random (11 ms)
[----------] 4 tests from SequenceTest (45 ms total)

[----------] Global test environment tear-down
[==========] 165 tests from 24 test cases ran. (1602 ms total)
[  PASSED  ] 164 tests.
[  FAILED  ] 1 test, listed below:
[  FAILED  ] ProcessRemoteLinkTest.RemoteStaleLinkRelink

 1 FAILED TEST
  YOU HAVE 2 DISABLED TESTS

Reached unreachable statement at /mesos/3rdparty/stout/include/stout/ip.hpp:141
*** Aborted at 1467272554 (unix time) try "date -d @1467272554" if you are using GNU date
***
PC: @     0x2b4bb6c08c37 (unknown)
*** SIGABRT (@0x3e80000493c) received by PID 18748 (TID 0x2b4bb4900e80) from PID 18748; stack
trace: ***
    @     0x2b4bb61a4330 (unknown)
    @     0x2b4bb6c08c37 (unknown)
    @     0x2b4bb6c0c028 (unknown)
    @           0xa0fa8d Unreachable()
    @           0xa0fa12 net::IP::isAny()
    @           0xa0f7b7 process::UPID::operator!()
    @           0xdb70b5 process::wait()
    @           0xab42be process::wait()
    @           0xdafdb9 process::ProcessManager::~ProcessManager()
    @           0xda559e process::finalize()
    @           0x9e297a main
    @     0x2b4bb6bf3f45 (unknown)
    @           0x9e27e8 (unknown)
make[3]: *** [CMakeFiles/check] Aborted
make[3]: Leaving directory `/mesos/build'
make[2]: *** [CMakeFiles/check.dir/all] Error 2
make[2]: Leaving directory `/mesos/build'
make[1]: Leaving directory `/mesos/build'
make[1]: *** [CMakeFiles/check.dir/rule] Error 2
make: *** [check] Error 2
+ docker rmi mesos-1467271656-30699
Untagged: mesos-1467271656-30699:latest
Deleted: 6124daadccce1bfa98a4e76d5eafdc892c80ec5843735c5b8bb4027372ab74af
Deleted: a769b7303cff0af0eba19c8abd901994a8a32a00377ce90b428e45871125d3f5
Deleted: 6135eb32acc35f4c7c1bfcd787ac76681efc231c8e4889a75b2927f796eea2eb
Deleted: 628c8948ca4352b732106eae644380156ce1c2df692643229852409b859f05b3
Deleted: 40cfc85b230186232a173c855f01bb90dc59c7a6642f8a147378536dad0b119d
Deleted: b8ae04e3bd2d2f73b9e835bf23db0e99d49179d54bce359b07f54be128c161d8
Deleted: c642db2c74e095337524075fe10bc93d9d18021fe7dce636a0a9e0f379b6f3c5
Deleted: 48f07b5210eb936fe4a81242ee2198004f9d66baa41388f81000a02f5cdfde2e
Deleted: f7ade13deaf01932befabce1ce4fd2881c41fa8198d767ffb6a42b8c8c38a0c0
Deleted: 1535bacbaeb7ded24f51e252e6235e7adaae48cb9629d43527c2a1e23db867ab
Deleted: 5261d601cd7f6fdacca586db67c449e42f3bb35843ab8fa9c7d09f84cc25223b
Deleted: 549a3bbcc48794245e0c180290685f112c7f357e5a159043d05edfa336de2f31
Deleted: 3aad167437d8294b190c44764d7a7f1b11f00cffa8f02a2875437ca93de2b404
Deleted: f209a16fda6502ea1683a7345f35e2aa535601a8b11dc667e8d1099c69547617
Deleted: 5a0a50c48945660131513194efe3635e0389c54c04676aaf810550a0042faac0
Build step 'Execute shell' marked build as failure

Mime
View raw message