mesos-builds mailing list archives

Site index · List index
Message view « Date » · « Thread »
Top « Date » · « Thread »
From Apache Jenkins Server <jenk...@builds.apache.org>
Subject Build failed in Jenkins: Mesos » cmake,gcc,--verbose --enable-libevent --enable-ssl,GLOG_v=1 MESOS_VERBOSE=1,ubuntu:14.04,(docker||Hadoop)&&(!ubuntu-us1) #2292
Date Thu, 16 Jun 2016 20:04:00 GMT
See <https://builds.apache.org/job/Mesos/BUILDTOOL=cmake,COMPILER=gcc,CONFIGURATION=--verbose%20--enable-libevent%20--enable-ssl,ENVIRONMENT=GLOG_v=1%20MESOS_VERBOSE=1,OS=ubuntu%3A14.04,label_exp=(docker%7C%7CHadoop)&&(!ubuntu-us1)/2292/changes>

Changes:

[yujie.jay] Enhanced log message if the absolute path does not exist.

[toenshoff] Refactored sandbox authorization logic to use ObjectAuthorizer.

[toenshoff] Added 'labels' and 'discovery' to derived ExecutorInfo.

[toenshoff] Added tests for sandbox authorization.

[toenshoff] Added note about generation of ExecutorInfo for CommandInfo.

[vinodkone] Added `VersionInfo`, `Flag`, `Metrics` to unversioned mesos protos.

[vinodkone] Added unversioned protos for master API.

[vinodkone] Devolved v1 operator protos to unversioned operator protos in Master.

[vinodkone] Moved `v1/master.proto` to `v1/master/master.proto`.

[vinodkone] Added unversioned protos for agent API.

[vinodkone] Devolved v1 operator protos to unversioned operator protos in Agent.

[vinodkone] Moved `v1/agent.proto` to `v1/agent/agent.proto`.

[vinodkone] Exposed the logging process `PID` in libprocess.

[vinodkone] Added comments for `Call::SET_LOGGING_LEVEL`.

[vinodkone] Implemented v1::master::Call::SET_LOGGING_LEVEL.

[vinodkone] Implemented v1::agent::Call::SET_LOGGING_LEVEL.

[vinodkone] Used `DurationInfo` as `timeout` type in `GetMetrics` operation APIs.

[vinodkone] Exposed metrics information via `process::metrics::snapshot`.

[vinodkone] Implemented v1::master::Call::GET_METRICS.

[vinodkone] Implemented v1::agent::Call::GET_METRICS.

------------------------------------------
[...truncated 9443 lines...]
gcc -DHAVE_CONFIG_H -I.  -I./include -I./tests -I./generated   -Wall -Werror  -g -O2 -D_GNU_SOURCE
-MT cli.o -MD -MP -MF .deps/cli.Tpo -c -o cli.o `test -f 'src/cli.c' || echo './'`src/cli.c
mv -f .deps/cli.Tpo .deps/cli.Po
/bin/bash ./libtool  --tag=CC   --mode=link gcc -Wall -Werror  -g -O2 -D_GNU_SOURCE   -o cli_st
cli.o libzookeeper_st.la 
libtool: link: gcc -Wall -Werror -g -O2 -D_GNU_SOURCE -o cli_st cli.o  ./.libs/libzookeeper_st.a
-lm
gcc -DHAVE_CONFIG_H -I.  -I./include -I./tests -I./generated   -DTHREADED -g -O2 -D_GNU_SOURCE
-MT cli_mt-cli.o -MD -MP -MF .deps/cli_mt-cli.Tpo -c -o cli_mt-cli.o `test -f 'src/cli.c'
|| echo './'`src/cli.c
mv -f .deps/cli_mt-cli.Tpo .deps/cli_mt-cli.Po
/bin/bash ./libtool  --tag=CC   --mode=link gcc -DTHREADED -g -O2 -D_GNU_SOURCE   -o cli_mt
cli_mt-cli.o libzookeeper_mt.la 
libtool: link: gcc -DTHREADED -g -O2 -D_GNU_SOURCE -o cli_mt cli_mt-cli.o  ./.libs/libzookeeper_mt.a
-lm -lpthread
gcc -DHAVE_CONFIG_H -I.  -I./include -I./tests -I./generated   -DTHREADED -g -O2 -D_GNU_SOURCE
-MT load_gen-load_gen.o -MD -MP -MF .deps/load_gen-load_gen.Tpo -c -o load_gen-load_gen.o
`test -f 'src/load_gen.c' || echo './'`src/load_gen.c
mv -f .deps/load_gen-load_gen.Tpo .deps/load_gen-load_gen.Po
/bin/bash ./libtool  --tag=CC   --mode=link gcc -DTHREADED -g -O2 -D_GNU_SOURCE   -o load_gen
load_gen-load_gen.o libzookeeper_mt.la 
libtool: link: gcc -DTHREADED -g -O2 -D_GNU_SOURCE -o load_gen load_gen-load_gen.o  ./.libs/libzookeeper_mt.a
-lm -lpthread
make[4]: Leaving directory `/mesos/build/3rdparty/zookeeper-3.4.8/src/zookeeper-3.4.8/src/c'
make[3]: Leaving directory `/mesos/build/3rdparty/zookeeper-3.4.8/src/zookeeper-3.4.8/src/c'
cd /mesos/build/3rdparty/zookeeper-3.4.8/src/zookeeper-3.4.8-build && /usr/bin/cmake
-E touch /mesos/build/3rdparty/zookeeper-3.4.8/src/zookeeper-3.4.8-stamp/zookeeper-3.4.8-build
/usr/bin/cmake -E cmake_progress_report /mesos/build/CMakeFiles 
[ 40%] Performing install step for 'zookeeper-3.4.8'
cd /mesos/build/3rdparty/zookeeper-3.4.8/src/zookeeper-3.4.8-build && cd /mesos/build/3rdparty/zookeeper-3.4.8/src/zookeeper-3.4.8/src/c
&& make install
make[3]: Entering directory `/mesos/build/3rdparty/zookeeper-3.4.8/src/zookeeper-3.4.8/src/c'
make[3]: warning: jobserver unavailable: using -j1.  Add `+' to parent make rule.
make[4]: Entering directory `/mesos/build/3rdparty/zookeeper-3.4.8/src/zookeeper-3.4.8/src/c'
 /bin/mkdir -p '/mesos/build/3rdparty/zookeeper-3.4.8/src/zookeeper-3.4.8/src/c/lib'
 /bin/bash ./libtool   --mode=install /usr/bin/install -c   libzookeeper_st.la libzookeeper_mt.la
'/mesos/build/3rdparty/zookeeper-3.4.8/src/zookeeper-3.4.8/src/c/lib'
libtool: install: /usr/bin/install -c .libs/libzookeeper_st.lai /mesos/build/3rdparty/zookeeper-3.4.8/src/zookeeper-3.4.8/src/c/lib/libzookeeper_st.la
libtool: install: /usr/bin/install -c .libs/libzookeeper_mt.lai /mesos/build/3rdparty/zookeeper-3.4.8/src/zookeeper-3.4.8/src/c/lib/libzookeeper_mt.la
libtool: install: /usr/bin/install -c .libs/libzookeeper_st.a /mesos/build/3rdparty/zookeeper-3.4.8/src/zookeeper-3.4.8/src/c/lib/libzookeeper_st.a
libtool: install: chmod 644 /mesos/build/3rdparty/zookeeper-3.4.8/src/zookeeper-3.4.8/src/c/lib/libzookeeper_st.a
libtool: install: ranlib /mesos/build/3rdparty/zookeeper-3.4.8/src/zookeeper-3.4.8/src/c/lib/libzookeeper_st.a
libtool: install: /usr/bin/install -c .libs/libzookeeper_mt.a /mesos/build/3rdparty/zookeeper-3.4.8/src/zookeeper-3.4.8/src/c/lib/libzookeeper_mt.a
libtool: install: chmod 644 /mesos/build/3rdparty/zookeeper-3.4.8/src/zookeeper-3.4.8/src/c/lib/libzookeeper_mt.a
libtool: install: ranlib /mesos/build/3rdparty/zookeeper-3.4.8/src/zookeeper-3.4.8/src/c/lib/libzookeeper_mt.a
libtool: finish: PATH="/usr/local/sbin:/usr/local/bin:/usr/sbin:/usr/bin:/sbin:/bin:/sbin"
ldconfig -n /mesos/build/3rdparty/zookeeper-3.4.8/src/zookeeper-3.4.8/src/c/lib
----------------------------------------------------------------------
Libraries have been installed in:
   /mesos/build/3rdparty/zookeeper-3.4.8/src/zookeeper-3.4.8/src/c/lib

If you ever happen to want to link against installed libraries
in a given directory, LIBDIR, you must either use libtool, and
specify the full pathname of the library, or use the '-LLIBDIR'
flag during linking and do at least one of the following:
   - add LIBDIR to the 'LD_LIBRARY_PATH' environment variable
     during execution
   - add LIBDIR to the 'LD_RUN_PATH' environment variable
     during linking
   - use the '-Wl,-rpath -Wl,LIBDIR' linker flag
   - have your system administrator add LIBDIR to '/etc/ld.so.conf'

See any operating system documentation about shared libraries for
more information, such as the ld(1) and ld.so(8) manual pages.
----------------------------------------------------------------------
 /bin/mkdir -p '/mesos/build/3rdparty/zookeeper-3.4.8/src/zookeeper-3.4.8/src/c/bin'
  /bin/bash ./libtool   --mode=install /usr/bin/install -c cli_st cli_mt load_gen '/mesos/build/3rdparty/zookeeper-3.4.8/src/zookeeper-3.4.8/src/c/bin'
libtool: install: /usr/bin/install -c cli_st /mesos/build/3rdparty/zookeeper-3.4.8/src/zookeeper-3.4.8/src/c/bin/cli_st
libtool: install: /usr/bin/install -c cli_mt /mesos/build/3rdparty/zookeeper-3.4.8/src/zookeeper-3.4.8/src/c/bin/cli_mt
libtool: install: /usr/bin/install -c load_gen /mesos/build/3rdparty/zookeeper-3.4.8/src/zookeeper-3.4.8/src/c/bin/load_gen
 /bin/mkdir -p '/mesos/build/3rdparty/zookeeper-3.4.8/src/zookeeper-3.4.8/src/c/include/zookeeper'
 /usr/bin/install -c -m 644 include/zookeeper.h include/zookeeper_version.h include/zookeeper_log.h
include/proto.h include/recordio.h generated/zookeeper.jute.h '/mesos/build/3rdparty/zookeeper-3.4.8/src/zookeeper-3.4.8/src/c/include/zookeeper'
make[4]: Leaving directory `/mesos/build/3rdparty/zookeeper-3.4.8/src/zookeeper-3.4.8/src/c'
make[3]: Leaving directory `/mesos/build/3rdparty/zookeeper-3.4.8/src/zookeeper-3.4.8/src/c'
cd /mesos/build/3rdparty/zookeeper-3.4.8/src/zookeeper-3.4.8-build && /usr/bin/cmake
-E touch /mesos/build/3rdparty/zookeeper-3.4.8/src/zookeeper-3.4.8-stamp/zookeeper-3.4.8-install
/usr/bin/cmake -E cmake_progress_report /mesos/build/CMakeFiles 98
[ 41%] Completed 'zookeeper-3.4.8'
cd /mesos/build/3rdparty && /usr/bin/cmake -E make_directory /mesos/build/3rdparty/CMakeFiles
cd /mesos/build/3rdparty && /usr/bin/cmake -E touch /mesos/build/3rdparty/CMakeFiles/zookeeper-3.4.8-complete
cd /mesos/build/3rdparty && /usr/bin/cmake -E touch /mesos/build/3rdparty/zookeeper-3.4.8/src/zookeeper-3.4.8-stamp/zookeeper-3.4.8-done
make[2]: Leaving directory `/mesos/build'
/usr/bin/cmake -E cmake_progress_report /mesos/build/CMakeFiles  98 99 100
[ 41%] Built target zookeeper-3.4.8
ln -fs libleveldb.so.1.4 libleveldb.so
ln -fs libleveldb.so.1.4 libleveldb.so.1
g++ -I. -I./include -fno-builtin-memcmp -pthread -DOS_LINUX -DLEVELDB_PLATFORM_POSIX -O2 -DNDEBUG
       -c db/builder.cc -o db/builder.o
g++ -I. -I./include -fno-builtin-memcmp -pthread -DOS_LINUX -DLEVELDB_PLATFORM_POSIX -O2 -DNDEBUG
       -c db/c.cc -o db/c.o
g++ -I. -I./include -fno-builtin-memcmp -pthread -DOS_LINUX -DLEVELDB_PLATFORM_POSIX -O2 -DNDEBUG
       -c db/db_impl.cc -o db/db_impl.o
g++ -I. -I./include -fno-builtin-memcmp -pthread -DOS_LINUX -DLEVELDB_PLATFORM_POSIX -O2 -DNDEBUG
       -c db/db_iter.cc -o db/db_iter.o
g++ -I. -I./include -fno-builtin-memcmp -pthread -DOS_LINUX -DLEVELDB_PLATFORM_POSIX -O2 -DNDEBUG
       -c db/dbformat.cc -o db/dbformat.o
g++ -I. -I./include -fno-builtin-memcmp -pthread -DOS_LINUX -DLEVELDB_PLATFORM_POSIX -O2 -DNDEBUG
       -c db/filename.cc -o db/filename.o
g++ -I. -I./include -fno-builtin-memcmp -pthread -DOS_LINUX -DLEVELDB_PLATFORM_POSIX -O2 -DNDEBUG
       -c db/log_reader.cc -o db/log_reader.o
g++ -I. -I./include -fno-builtin-memcmp -pthread -DOS_LINUX -DLEVELDB_PLATFORM_POSIX -O2 -DNDEBUG
       -c db/log_writer.cc -o db/log_writer.o
g++ -I. -I./include -fno-builtin-memcmp -pthread -DOS_LINUX -DLEVELDB_PLATFORM_POSIX -O2 -DNDEBUG
       -c db/memtable.cc -o db/memtable.o
g++ -I. -I./include -fno-builtin-memcmp -pthread -DOS_LINUX -DLEVELDB_PLATFORM_POSIX -O2 -DNDEBUG
       -c db/repair.cc -o db/repair.o
g++ -I. -I./include -fno-builtin-memcmp -pthread -DOS_LINUX -DLEVELDB_PLATFORM_POSIX -O2 -DNDEBUG
       -c db/table_cache.cc -o db/table_cache.o
g++ -I. -I./include -fno-builtin-memcmp -pthread -DOS_LINUX -DLEVELDB_PLATFORM_POSIX -O2 -DNDEBUG
       -c db/version_edit.cc -o db/version_edit.o
g++ -I. -I./include -fno-builtin-memcmp -pthread -DOS_LINUX -DLEVELDB_PLATFORM_POSIX -O2 -DNDEBUG
       -c db/version_set.cc -o db/version_set.o
g++ -I. -I./include -fno-builtin-memcmp -pthread -DOS_LINUX -DLEVELDB_PLATFORM_POSIX -O2 -DNDEBUG
       -c db/write_batch.cc -o db/write_batch.o
g++ -I. -I./include -fno-builtin-memcmp -pthread -DOS_LINUX -DLEVELDB_PLATFORM_POSIX -O2 -DNDEBUG
       -c table/block.cc -o table/block.o
g++ -I. -I./include -fno-builtin-memcmp -pthread -DOS_LINUX -DLEVELDB_PLATFORM_POSIX -O2 -DNDEBUG
       -c table/block_builder.cc -o table/block_builder.o
g++ -I. -I./include -fno-builtin-memcmp -pthread -DOS_LINUX -DLEVELDB_PLATFORM_POSIX -O2 -DNDEBUG
       -c table/filter_block.cc -o table/filter_block.o
g++ -I. -I./include -fno-builtin-memcmp -pthread -DOS_LINUX -DLEVELDB_PLATFORM_POSIX -O2 -DNDEBUG
       -c table/format.cc -o table/format.o
g++ -I. -I./include -fno-builtin-memcmp -pthread -DOS_LINUX -DLEVELDB_PLATFORM_POSIX -O2 -DNDEBUG
       -c table/iterator.cc -o table/iterator.o
g++ -I. -I./include -fno-builtin-memcmp -pthread -DOS_LINUX -DLEVELDB_PLATFORM_POSIX -O2 -DNDEBUG
       -c table/merger.cc -o table/merger.o
g++ -I. -I./include -fno-builtin-memcmp -pthread -DOS_LINUX -DLEVELDB_PLATFORM_POSIX -O2 -DNDEBUG
       -c table/table.cc -o table/table.o
g++ -I. -I./include -fno-builtin-memcmp -pthread -DOS_LINUX -DLEVELDB_PLATFORM_POSIX -O2 -DNDEBUG
       -c table/table_builder.cc -o table/table_builder.o
g++ -I. -I./include -fno-builtin-memcmp -pthread -DOS_LINUX -DLEVELDB_PLATFORM_POSIX -O2 -DNDEBUG
       -c table/two_level_iterator.cc -o table/two_level_iterator.o
g++ -I. -I./include -fno-builtin-memcmp -pthread -DOS_LINUX -DLEVELDB_PLATFORM_POSIX -O2 -DNDEBUG
       -c util/arena.cc -o util/arena.o
g++ -I. -I./include -fno-builtin-memcmp -pthread -DOS_LINUX -DLEVELDB_PLATFORM_POSIX -O2 -DNDEBUG
       -c util/bloom.cc -o util/bloom.o
g++ -I. -I./include -fno-builtin-memcmp -pthread -DOS_LINUX -DLEVELDB_PLATFORM_POSIX -O2 -DNDEBUG
       -c util/cache.cc -o util/cache.o
g++ -I. -I./include -fno-builtin-memcmp -pthread -DOS_LINUX -DLEVELDB_PLATFORM_POSIX -O2 -DNDEBUG
       -c util/coding.cc -o util/coding.o
g++ -I. -I./include -fno-builtin-memcmp -pthread -DOS_LINUX -DLEVELDB_PLATFORM_POSIX -O2 -DNDEBUG
       -c util/comparator.cc -o util/comparator.o
g++ -I. -I./include -fno-builtin-memcmp -pthread -DOS_LINUX -DLEVELDB_PLATFORM_POSIX -O2 -DNDEBUG
       -c util/crc32c.cc -o util/crc32c.o
g++ -I. -I./include -fno-builtin-memcmp -pthread -DOS_LINUX -DLEVELDB_PLATFORM_POSIX -O2 -DNDEBUG
       -c util/env.cc -o util/env.o
g++ -I. -I./include -fno-builtin-memcmp -pthread -DOS_LINUX -DLEVELDB_PLATFORM_POSIX -O2 -DNDEBUG
       -c util/env_posix.cc -o util/env_posix.o
g++ -I. -I./include -fno-builtin-memcmp -pthread -DOS_LINUX -DLEVELDB_PLATFORM_POSIX -O2 -DNDEBUG
       -c util/filter_policy.cc -o util/filter_policy.o
g++ -I. -I./include -fno-builtin-memcmp -pthread -DOS_LINUX -DLEVELDB_PLATFORM_POSIX -O2 -DNDEBUG
       -c util/hash.cc -o util/hash.o
g++ -I. -I./include -fno-builtin-memcmp -pthread -DOS_LINUX -DLEVELDB_PLATFORM_POSIX -O2 -DNDEBUG
       -c util/histogram.cc -o util/histogram.o
g++ -I. -I./include -fno-builtin-memcmp -pthread -DOS_LINUX -DLEVELDB_PLATFORM_POSIX -O2 -DNDEBUG
       -c util/logging.cc -o util/logging.o
g++ -I. -I./include -fno-builtin-memcmp -pthread -DOS_LINUX -DLEVELDB_PLATFORM_POSIX -O2 -DNDEBUG
       -c util/options.cc -o util/options.o
g++ -I. -I./include -fno-builtin-memcmp -pthread -DOS_LINUX -DLEVELDB_PLATFORM_POSIX -O2 -DNDEBUG
       -c util/status.cc -o util/status.o
g++ -I. -I./include -fno-builtin-memcmp -pthread -DOS_LINUX -DLEVELDB_PLATFORM_POSIX -O2 -DNDEBUG
       -c port/port_posix.cc -o port/port_posix.o
rm -f libleveldb.a
ar -rs libleveldb.a db/builder.o db/c.o db/db_impl.o db/db_iter.o db/dbformat.o db/filename.o
db/log_reader.o db/log_writer.o db/memtable.o db/repair.o db/table_cache.o db/version_edit.o
db/version_set.o db/write_batch.o table/block.o table/block_builder.o table/filter_block.o
table/format.o table/iterator.o table/merger.o table/table.o table/table_builder.o table/two_level_iterator.o
util/arena.o util/bloom.o util/cache.o util/coding.o util/comparator.o util/crc32c.o util/env.o
util/env_posix.o util/filter_policy.o util/hash.o util/histogram.o util/logging.o util/options.o
util/status.o port/port_posix.o
ar: creating libleveldb.a
make[3]: Leaving directory `/mesos/build/3rdparty/leveldb-1.4/src/leveldb-1.4'
cd /mesos/build/3rdparty/leveldb-1.4/src/leveldb-1.4-build && /usr/bin/cmake -E touch
/mesos/build/3rdparty/leveldb-1.4/src/leveldb-1.4-stamp/leveldb-1.4-build
/usr/bin/cmake -E cmake_progress_report /mesos/build/CMakeFiles 
[ 41%] Performing install step for 'leveldb-1.4'
cd /mesos/build/3rdparty/leveldb-1.4/src/leveldb-1.4-build && /usr/bin/cmake -E echo

cd /mesos/build/3rdparty/leveldb-1.4/src/leveldb-1.4-build && /usr/bin/cmake -E touch
/mesos/build/3rdparty/leveldb-1.4/src/leveldb-1.4-stamp/leveldb-1.4-install
/usr/bin/cmake -E cmake_progress_report /mesos/build/CMakeFiles 
[ 41%] Completed 'leveldb-1.4'
cd /mesos/build/3rdparty && /usr/bin/cmake -E make_directory /mesos/build/3rdparty/CMakeFiles
cd /mesos/build/3rdparty && /usr/bin/cmake -E touch /mesos/build/3rdparty/CMakeFiles/leveldb-1.4-complete
cd /mesos/build/3rdparty && /usr/bin/cmake -E touch /mesos/build/3rdparty/leveldb-1.4/src/leveldb-1.4-stamp/leveldb-1.4-done
make[2]: Leaving directory `/mesos/build'
/usr/bin/cmake -E cmake_progress_report /mesos/build/CMakeFiles  9 10
[ 41%] Built target leveldb-1.4
make -f src/CMakeFiles/mesos-1.0.0.dir/build.make src/CMakeFiles/mesos-1.0.0.dir/depend
make[2]: Entering directory `/mesos/build'
/usr/bin/cmake -E cmake_progress_report /mesos/build/CMakeFiles 21
/usr/bin/cmake -E cmake_progress_report /mesos/build/CMakeFiles 
/usr/bin/cmake -E cmake_progress_report /mesos/build/CMakeFiles 
/usr/bin/cmake -E cmake_progress_report /mesos/build/CMakeFiles 
/usr/bin/cmake -E cmake_progress_report /mesos/build/CMakeFiles 13
/usr/bin/cmake -E cmake_progress_report /mesos/build/CMakeFiles 
/usr/bin/cmake -E cmake_progress_report /mesos/build/CMakeFiles 
/usr/bin/cmake -E cmake_progress_report /mesos/build/CMakeFiles 
[ 41%] [ 41%] [ 41%] [ 43%] [ 43%] [ 43%] [ 43%] [ 43%] Generating ../include/mesos/master/allocator.pb.cc,
../include/mesos/master/allocator.pb.h
Generating ../include/mesos/authorizer/authorizer.pb.cc, ../include/mesos/authorizer/authorizer.pb.h
/mesos/build/3rdparty/protobuf-2.6.1/src/protobuf-2.6.1-lib/lib/bin/protoc -I/mesos/include
-I/mesos/src --cpp_out=/mesos/build/include /mesos/include/mesos/master/allocator.proto
Generating ../include/mesos/authorizer/acls.pb.cc, ../include/mesos/authorizer/acls.pb.h
Generating ../include/mesos/v1/scheduler/scheduler.pb.cc, ../include/mesos/v1/scheduler/scheduler.pb.h
Generating ../include/mesos/authentication/authentication.pb.cc, ../include/mesos/authentication/authentication.pb.h
/mesos/build/3rdparty/protobuf-2.6.1/src/protobuf-2.6.1-lib/lib/bin/protoc -I/mesos/include
-I/mesos/src --cpp_out=/mesos/build/include /mesos/include/mesos/authorizer/acls.proto
/mesos/build/3rdparty/protobuf-2.6.1/src/protobuf-2.6.1-lib/lib/bin/protoc -I/mesos/include
-I/mesos/src --cpp_out=/mesos/build/include /mesos/include/mesos/authorizer/authorizer.proto
Generating ../include/mesos/docker/spec.pb.cc, ../include/mesos/docker/spec.pb.h
Generating ../include/mesos/containerizer/containerizer.pb.cc, ../include/mesos/containerizer/containerizer.pb.h
/mesos/build/3rdparty/protobuf-2.6.1/src/protobuf-2.6.1-lib/lib/bin/protoc -I/mesos/include
-I/mesos/src --cpp_out=/mesos/build/include /mesos/include/mesos/authentication/authentication.proto
/mesos/build/3rdparty/protobuf-2.6.1/src/protobuf-2.6.1-lib/lib/bin/protoc -I/mesos/include
-I/mesos/src --cpp_out=/mesos/build/include /mesos/include/mesos/v1/scheduler/scheduler.proto
/mesos/build/3rdparty/protobuf-2.6.1/src/protobuf-2.6.1-lib/lib/bin/protoc -I/mesos/include
-I/mesos/src --cpp_out=/mesos/build/include /mesos/include/mesos/containerizer/containerizer.proto
Generating ../include/mesos/appc/spec.pb.cc, ../include/mesos/appc/spec.pb.h
/mesos/build/3rdparty/protobuf-2.6.1/src/protobuf-2.6.1-lib/lib/bin/protoc -I/mesos/include
-I/mesos/src --cpp_out=/mesos/build/include /mesos/include/mesos/appc/spec.proto
/mesos/build/3rdparty/protobuf-2.6.1/src/protobuf-2.6.1-lib/lib/bin/protoc -I/mesos/include
-I/mesos/src --cpp_out=/mesos/build/include /mesos/include/mesos/docker/spec.proto
/usr/bin/cmake -E cmake_progress_report /mesos/build/CMakeFiles 14
/usr/bin/cmake -E cmake_progress_report /mesos/build/CMakeFiles 
/usr/bin/cmake -E cmake_progress_report /mesos/build/CMakeFiles 
/usr/bin/cmake -E cmake_progress_report /mesos/build/CMakeFiles 
[ 44%] /usr/bin/cmake -E cmake_progress_report /mesos/build/CMakeFiles 15
[ 44%] [ 44%] [ 45%] /usr/bin/cmake -E cmake_progress_report /mesos/build/CMakeFiles 
[ 45%] /usr/bin/cmake -E cmake_progress_report /mesos/build/CMakeFiles 
[ 45%] Generating ../include/mesos/docker/v2.pb.cc, ../include/mesos/docker/v2.pb.h
Generating ../include/mesos/executor/executor.pb.cc, ../include/mesos/executor/executor.pb.h
Generating ../include/mesos/docker/v1.pb.cc, ../include/mesos/docker/v1.pb.h
/mesos/build/3rdparty/protobuf-2.6.1/src/protobuf-2.6.1-lib/lib/bin/protoc -I/mesos/include
-I/mesos/src --cpp_out=/mesos/build/include /mesos/include/mesos/executor/executor.proto
/usr/bin/cmake -E cmake_progress_report /mesos/build/CMakeFiles 
Generating messages/flags.pb.cc, messages/flags.pb.h
/mesos/build/3rdparty/protobuf-2.6.1/src/protobuf-2.6.1-lib/lib/bin/protoc -I/mesos/include
-I/mesos/src --cpp_out=/mesos/build/include /mesos/include/mesos/docker/v1.proto
/mesos/build/3rdparty/protobuf-2.6.1/src/protobuf-2.6.1-lib/lib/bin/protoc -I/mesos/include
-I/mesos/src --cpp_out=/mesos/build/include /mesos/include/mesos/docker/v2.proto
Generating ../include/mesos/fetcher/fetcher.pb.cc, ../include/mesos/fetcher/fetcher.pb.h
/mesos/build/3rdparty/protobuf-2.6.1/src/protobuf-2.6.1-lib/lib/bin/protoc -I/mesos/include
-I/mesos/src --cpp_out=/mesos/build/src /mesos/src/messages/flags.proto
[ 45%] [ 45%] /mesos/build/3rdparty/protobuf-2.6.1/src/protobuf-2.6.1-lib/lib/bin/protoc -I/mesos/include
-I/mesos/src --cpp_out=/mesos/build/include /mesos/include/mesos/fetcher/fetcher.proto
/usr/bin/cmake -E cmake_progress_report /mesos/build/CMakeFiles 16
/usr/bin/cmake -E cmake_progress_report /mesos/build/CMakeFiles 
Generating messages/log.pb.cc, messages/log.pb.h
/mesos/build/3rdparty/protobuf-2.6.1/src/protobuf-2.6.1-lib/lib/bin/protoc -I/mesos/include
-I/mesos/src --cpp_out=/mesos/build/src /mesos/src/messages/log.proto
/usr/bin/cmake -E cmake_progress_report /mesos/build/CMakeFiles 
[ 45%] [ 46%] Generating messages/messages.pb.cc, messages/messages.pb.h
Generating messages/state.pb.cc, messages/state.pb.h
/mesos/build/3rdparty/protobuf-2.6.1/src/protobuf-2.6.1-lib/lib/bin/protoc -I/mesos/include
-I/mesos/src --cpp_out=/mesos/build/src /mesos/src/messages/messages.proto
/mesos/build/3rdparty/protobuf-2.6.1/src/protobuf-2.6.1-lib/lib/bin/protoc -I/mesos/include
-I/mesos/src --cpp_out=/mesos/build/src /mesos/src/messages/state.proto
/usr/bin/cmake -E cmake_progress_report /mesos/build/CMakeFiles 
[ 46%] /usr/bin/cmake -E cmake_progress_report /mesos/build/CMakeFiles 17
/usr/bin/cmake -E cmake_progress_report /mesos/build/CMakeFiles 
Generating ../include/mesos/slave/isolator.pb.cc, ../include/mesos/slave/isolator.pb.h
Generating slave/containerizer/mesos/isolators/network/cni/spec.pb.cc, slave/containerizer/mesos/isolators/network/cni/spec.pb.h
/mesos/build/3rdparty/protobuf-2.6.1/src/protobuf-2.6.1-lib/lib/bin/protoc -I/mesos/include
-I/mesos/src --cpp_out=/mesos/build/include /mesos/include/mesos/slave/isolator.proto
/mesos/build/3rdparty/protobuf-2.6.1/src/protobuf-2.6.1-lib/lib/bin/protoc -I/mesos/include
-I/mesos/src --cpp_out=/mesos/build/src /mesos/src/slave/containerizer/mesos/isolators/network/cni/spec.proto
[ 46%] /usr/bin/cmake -E cmake_progress_report /mesos/build/CMakeFiles 
[ 47%] [ 47%] [ 47%] Generating ../include/mesos/mesos.pb.cc, ../include/mesos/mesos.pb.h
/mesos/build/3rdparty/protobuf-2.6.1/src/protobuf-2.6.1-lib/lib/bin/protoc -I/mesos/include
-I/mesos/src --cpp_out=/mesos/build/include /mesos/include/mesos/mesos.proto
Generating slave/containerizer/mesos/isolators/docker/volume/state.pb.cc, slave/containerizer/mesos/isolators/docker/volume/state.pb.h
Generating ../include/mesos/maintenance/maintenance.pb.cc, ../include/mesos/maintenance/maintenance.pb.h
/mesos/build/3rdparty/protobuf-2.6.1/src/protobuf-2.6.1-lib/lib/bin/protoc -I/mesos/include
-I/mesos/src --cpp_out=/mesos/build/include /mesos/include/mesos/maintenance/maintenance.proto
/usr/bin/cmake -E cmake_progress_report /mesos/build/CMakeFiles 
/mesos/build/3rdparty/protobuf-2.6.1/src/protobuf-2.6.1-lib/lib/bin/protoc -I/mesos/include
-I/mesos/src --cpp_out=/mesos/build/src /mesos/src/slave/containerizer/mesos/isolators/docker/volume/state.proto
Generating ../include/mesos/module/module.pb.cc, ../include/mesos/module/module.pb.h
/usr/bin/cmake -E cmake_progress_report /mesos/build/CMakeFiles 18
Generating ../include/mesos/quota/quota.pb.cc, ../include/mesos/quota/quota.pb.h
/mesos/build/3rdparty/protobuf-2.6.1/src/protobuf-2.6.1-lib/lib/bin/protoc -I/mesos/include
-I/mesos/src --cpp_out=/mesos/build/include /mesos/include/mesos/module/module.proto
/mesos/build/3rdparty/protobuf-2.6.1/src/protobuf-2.6.1-lib/lib/bin/protoc -I/mesos/include
-I/mesos/src --cpp_out=/mesos/build/include /mesos/include/mesos/quota/quota.proto
/usr/bin/cmake -E cmake_progress_report /mesos/build/CMakeFiles 
[ 47%] [ 48%] /usr/bin/cmake -E cmake_progress_report /mesos/build/CMakeFiles 
[ 48%] /usr/bin/cmake -E cmake_progress_report /mesos/build/CMakeFiles 
/usr/bin/cmake -E cmake_progress_report /mesos/build/CMakeFiles 19
Generating slave/containerizer/mesos/provisioner/docker/message.pb.cc, slave/containerizer/mesos/provisioner/docker/message.pb.h
/usr/bin/cmake -E cmake_progress_report /mesos/build/CMakeFiles 
/mesos/build/3rdparty/protobuf-2.6.1/src/protobuf-2.6.1-lib/lib/bin/protoc -I/mesos/include
-I/mesos/src --cpp_out=/mesos/build/src /mesos/src/slave/containerizer/mesos/provisioner/docker/message.proto
Generating ../include/mesos/slave/oversubscription.pb.cc, ../include/mesos/slave/oversubscription.pb.h
[ 48%] /mesos/build/3rdparty/protobuf-2.6.1/src/protobuf-2.6.1-lib/lib/bin/protoc -I/mesos/include
-I/mesos/src --cpp_out=/mesos/build/include /mesos/include/mesos/slave/oversubscription.proto
Generating master/registry.pb.cc, master/registry.pb.h
[ 48%] [ 49%] /mesos/build/3rdparty/protobuf-2.6.1/src/protobuf-2.6.1-lib/lib/bin/protoc -I/mesos/include
-I/mesos/src --cpp_out=/mesos/build/src /mesos/src/master/registry.proto
[ 49%] Generating ../include/mesos/scheduler/scheduler.pb.cc, ../include/mesos/scheduler/scheduler.pb.h
/mesos/build/3rdparty/protobuf-2.6.1/src/protobuf-2.6.1-lib/lib/bin/protoc -I/mesos/include
-I/mesos/src --cpp_out=/mesos/build/include /mesos/include/mesos/scheduler/scheduler.proto
/usr/bin/cmake -E cmake_progress_report /mesos/build/CMakeFiles 
[ 49%] Generating ../include/mesos/v1/agent.pb.cc, ../include/mesos/v1/agent.pb.h
/mesos/build/3rdparty/protobuf-2.6.1/src/protobuf-2.6.1-lib/lib/bin/protoc -I/mesos/include
-I/mesos/src --cpp_out=/mesos/build/include /mesos/include/mesos/v1/agent.proto
Generating ../include/mesos/uri/uri.pb.cc, ../include/mesos/uri/uri.pb.h
Generating ../include/mesos/state/state.pb.cc, ../include/mesos/state/state.pb.h
/usr/bin/cmake -E cmake_progress_report /mesos/build/CMakeFiles 
/mesos/build/3rdparty/protobuf-2.6.1/src/protobuf-2.6.1-lib/lib/bin/protoc -I/mesos/include
-I/mesos/src --cpp_out=/mesos/build/include /mesos/include/mesos/uri/uri.proto
/mesos/build/3rdparty/protobuf-2.6.1/src/protobuf-2.6.1-lib/lib/bin/protoc -I/mesos/include
-I/mesos/src --cpp_out=/mesos/build/include /mesos/include/mesos/state/state.proto
/mesos/include/mesos/v1/agent.proto: No such file or directory
make[2]: *** [include/mesos/v1/agent.pb.cc] Error 1
make[2]: *** Waiting for unfinished jobs....
Generating ../include/mesos/v1/master/allocator.pb.cc, ../include/mesos/v1/master/allocator.pb.h
[ 49%] /mesos/build/3rdparty/protobuf-2.6.1/src/protobuf-2.6.1-lib/lib/bin/protoc -I/mesos/include
-I/mesos/src --cpp_out=/mesos/build/include /mesos/include/mesos/v1/master/allocator.proto
Generating ../include/mesos/v1/executor/executor.pb.cc, ../include/mesos/v1/executor/executor.pb.h
/mesos/build/3rdparty/protobuf-2.6.1/src/protobuf-2.6.1-lib/lib/bin/protoc -I/mesos/include
-I/mesos/src --cpp_out=/mesos/build/include /mesos/include/mesos/v1/executor/executor.proto
make[2]: Leaving directory `/mesos/build'
make[1]: *** [src/CMakeFiles/mesos-1.0.0.dir/all] Error 2
make: *** [all] Error 2
make[1]: Leaving directory `/mesos/build'
+ docker rmi mesos-1466106768-27533
Untagged: mesos-1466106768-27533:latest
Deleted: deb4c57f382dc9711c7d1db6a4086268912a94acfdba0c95d31a354b142704c6
Deleted: d4791722b12ae9b5d5882b98e971298e5732a1c8eb7adac9bb1487ce682e08f3
Deleted: 2cd2815f70008aa8753032af5794abb37b1a0e9b30ef06b5599bef80088ab60a
Deleted: 146b6820112858f00e5bdc37c9255762ac4bdef977c14ed9c21e3de339126704
Deleted: 4d6b1ed3ca9fcaafe3ce433215e955e1c893b8ccef881735b54b1dec83cca763
Deleted: 10f9dafdf06e4834ad9776197aa99336ba61d2a2c37a0ddabfc093176feca419
Deleted: a393cc4fa33af8a4c3394ec59d8f7bc852f1c68a7cf8ad2be57160dbc04f6d52
Deleted: 439d124a444868a84560aca2638c77cb3d69dd359301b9a5431b68a9de83cd6d
Deleted: 401974830f334d3ebf50d5aa278d43a0ea279f6f632602b5ce8ff30bc4353451
Deleted: f8221228695f3b90c009408d3e41f09234dc0218acfdef62c8fa21103ea98a8f
Deleted: 0ec99918f21a677192615be5f37607c84a15749e9840f8100469c10c415ee679
Deleted: 96233be7f10c28fe79ac867211ec337fd9fa2014c3842b64ef454303380a0655
Deleted: 28cd37354048e4819d38b0a51ca4486b42e7347a384090099c5a5f3ffa397f01
Deleted: 24a243c50967d2abb0942ea1ed5c0f1932e04c79fa28c805623e65158ad71ff6
Deleted: 699ba8e246dfc5c8282b13578f9b45952cc2dacf88322972e083db8dc9898d18
Build step 'Execute shell' marked build as failure

Mime
View raw message