mesos-builds mailing list archives

Site index · List index
Message view « Date » · « Thread »
Top « Date » · « Thread »
From Apache Jenkins Server <jenk...@builds.apache.org>
Subject Build failed in Jenkins: Mesos » cmake,gcc,--verbose,GLOG_v=1 MESOS_VERBOSE=1,ubuntu:14.04,(docker||Hadoop)&&(!ubuntu-us1) #2295
Date Thu, 16 Jun 2016 22:56:54 GMT
See <https://builds.apache.org/job/Mesos/BUILDTOOL=cmake,COMPILER=gcc,CONFIGURATION=--verbose,ENVIRONMENT=GLOG_v=1%20MESOS_VERBOSE=1,OS=ubuntu%3A14.04,label_exp=(docker%7C%7CHadoop)&&(!ubuntu-us1)/2295/changes>

Changes:

[toenshoff] Added Berlin usergroup to community page.

[bmahler] Added a comment to clarify granting of NVIDIA control devices.

[yujie.jay] Added a metric to replicated log.

[yujie.jay] Added a metrics prefix for registrar replicated log.

[yujie.jay] Added a test for replicated log metrics.

[yujie.jay] Added a TODO about a bug in RecoverProtocolProcess discard logic.

------------------------------------------
[...truncated 8890 lines...]
gcc -DHAVE_CONFIG_H -I.  -I./include -I./tests -I./generated   -DTHREADED -g -O2 -D_GNU_SOURCE
-MT load_gen-load_gen.o -MD -MP -MF .deps/load_gen-load_gen.Tpo -c -o load_gen-load_gen.o
`test -f 'src/load_gen.c' || echo './'`src/load_gen.c
mv -f .deps/load_gen-load_gen.Tpo .deps/load_gen-load_gen.Po
/bin/bash ./libtool  --tag=CC   --mode=link gcc -DTHREADED -g -O2 -D_GNU_SOURCE   -o load_gen
load_gen-load_gen.o libzookeeper_mt.la 
libtool: link: gcc -DTHREADED -g -O2 -D_GNU_SOURCE -o load_gen load_gen-load_gen.o  ./.libs/libzookeeper_mt.a
-lm -lpthread
make[4]: Leaving directory `/mesos/build/3rdparty/zookeeper-3.4.8/src/zookeeper-3.4.8/src/c'
make[3]: Leaving directory `/mesos/build/3rdparty/zookeeper-3.4.8/src/zookeeper-3.4.8/src/c'
cd /mesos/build/3rdparty/zookeeper-3.4.8/src/zookeeper-3.4.8-build && /usr/bin/cmake
-E touch /mesos/build/3rdparty/zookeeper-3.4.8/src/zookeeper-3.4.8-stamp/zookeeper-3.4.8-build
/usr/bin/cmake -E cmake_progress_report /mesos/build/CMakeFiles 
[ 40%] Performing install step for 'zookeeper-3.4.8'
cd /mesos/build/3rdparty/zookeeper-3.4.8/src/zookeeper-3.4.8-build && cd /mesos/build/3rdparty/zookeeper-3.4.8/src/zookeeper-3.4.8/src/c
&& make install
make[3]: Entering directory `/mesos/build/3rdparty/zookeeper-3.4.8/src/zookeeper-3.4.8/src/c'
make[3]: warning: jobserver unavailable: using -j1.  Add `+' to parent make rule.
make[4]: Entering directory `/mesos/build/3rdparty/zookeeper-3.4.8/src/zookeeper-3.4.8/src/c'
 /bin/mkdir -p '/mesos/build/3rdparty/zookeeper-3.4.8/src/zookeeper-3.4.8/src/c/lib'
 /bin/bash ./libtool   --mode=install /usr/bin/install -c   libzookeeper_st.la libzookeeper_mt.la
'/mesos/build/3rdparty/zookeeper-3.4.8/src/zookeeper-3.4.8/src/c/lib'
libtool: install: /usr/bin/install -c .libs/libzookeeper_st.lai /mesos/build/3rdparty/zookeeper-3.4.8/src/zookeeper-3.4.8/src/c/lib/libzookeeper_st.la
libtool: install: /usr/bin/install -c .libs/libzookeeper_mt.lai /mesos/build/3rdparty/zookeeper-3.4.8/src/zookeeper-3.4.8/src/c/lib/libzookeeper_mt.la
libtool: install: /usr/bin/install -c .libs/libzookeeper_st.a /mesos/build/3rdparty/zookeeper-3.4.8/src/zookeeper-3.4.8/src/c/lib/libzookeeper_st.a
libtool: install: chmod 644 /mesos/build/3rdparty/zookeeper-3.4.8/src/zookeeper-3.4.8/src/c/lib/libzookeeper_st.a
libtool: install: ranlib /mesos/build/3rdparty/zookeeper-3.4.8/src/zookeeper-3.4.8/src/c/lib/libzookeeper_st.a
libtool: install: /usr/bin/install -c .libs/libzookeeper_mt.a /mesos/build/3rdparty/zookeeper-3.4.8/src/zookeeper-3.4.8/src/c/lib/libzookeeper_mt.a
libtool: install: chmod 644 /mesos/build/3rdparty/zookeeper-3.4.8/src/zookeeper-3.4.8/src/c/lib/libzookeeper_mt.a
libtool: install: ranlib /mesos/build/3rdparty/zookeeper-3.4.8/src/zookeeper-3.4.8/src/c/lib/libzookeeper_mt.a
libtool: finish: PATH="/usr/local/sbin:/usr/local/bin:/usr/sbin:/usr/bin:/sbin:/bin:/sbin"
ldconfig -n /mesos/build/3rdparty/zookeeper-3.4.8/src/zookeeper-3.4.8/src/c/lib
----------------------------------------------------------------------
Libraries have been installed in:
   /mesos/build/3rdparty/zookeeper-3.4.8/src/zookeeper-3.4.8/src/c/lib

If you ever happen to want to link against installed libraries
in a given directory, LIBDIR, you must either use libtool, and
specify the full pathname of the library, or use the '-LLIBDIR'
flag during linking and do at least one of the following:
   - add LIBDIR to the 'LD_LIBRARY_PATH' environment variable
     during execution
   - add LIBDIR to the 'LD_RUN_PATH' environment variable
     during linking
   - use the '-Wl,-rpath -Wl,LIBDIR' linker flag
   - have your system administrator add LIBDIR to '/etc/ld.so.conf'

See any operating system documentation about shared libraries for
more information, such as the ld(1) and ld.so(8) manual pages.
----------------------------------------------------------------------
 /bin/mkdir -p '/mesos/build/3rdparty/zookeeper-3.4.8/src/zookeeper-3.4.8/src/c/bin'
  /bin/bash ./libtool   --mode=install /usr/bin/install -c cli_st cli_mt load_gen '/mesos/build/3rdparty/zookeeper-3.4.8/src/zookeeper-3.4.8/src/c/bin'
libtool: install: /usr/bin/install -c cli_st /mesos/build/3rdparty/zookeeper-3.4.8/src/zookeeper-3.4.8/src/c/bin/cli_st
libtool: install: /usr/bin/install -c cli_mt /mesos/build/3rdparty/zookeeper-3.4.8/src/zookeeper-3.4.8/src/c/bin/cli_mt
libtool: install: /usr/bin/install -c load_gen /mesos/build/3rdparty/zookeeper-3.4.8/src/zookeeper-3.4.8/src/c/bin/load_gen
 /bin/mkdir -p '/mesos/build/3rdparty/zookeeper-3.4.8/src/zookeeper-3.4.8/src/c/include/zookeeper'
 /usr/bin/install -c -m 644 include/zookeeper.h include/zookeeper_version.h include/zookeeper_log.h
include/proto.h include/recordio.h generated/zookeeper.jute.h '/mesos/build/3rdparty/zookeeper-3.4.8/src/zookeeper-3.4.8/src/c/include/zookeeper'
make[4]: Leaving directory `/mesos/build/3rdparty/zookeeper-3.4.8/src/zookeeper-3.4.8/src/c'
make[3]: Leaving directory `/mesos/build/3rdparty/zookeeper-3.4.8/src/zookeeper-3.4.8/src/c'
cd /mesos/build/3rdparty/zookeeper-3.4.8/src/zookeeper-3.4.8-build && /usr/bin/cmake
-E touch /mesos/build/3rdparty/zookeeper-3.4.8/src/zookeeper-3.4.8-stamp/zookeeper-3.4.8-install
/usr/bin/cmake -E cmake_progress_report /mesos/build/CMakeFiles 
[ 40%] Completed 'zookeeper-3.4.8'
cd /mesos/build/3rdparty && /usr/bin/cmake -E make_directory /mesos/build/3rdparty/CMakeFiles
cd /mesos/build/3rdparty && /usr/bin/cmake -E touch /mesos/build/3rdparty/CMakeFiles/zookeeper-3.4.8-complete
cd /mesos/build/3rdparty && /usr/bin/cmake -E touch /mesos/build/3rdparty/zookeeper-3.4.8/src/zookeeper-3.4.8-stamp/zookeeper-3.4.8-done
make[2]: Leaving directory `/mesos/build'
/usr/bin/cmake -E cmake_progress_report /mesos/build/CMakeFiles  99 100
[ 40%] Built target zookeeper-3.4.8
ln -fs libleveldb.so.1.4 libleveldb.so
ln -fs libleveldb.so.1.4 libleveldb.so.1
g++ -I. -I./include -fno-builtin-memcmp -pthread -DOS_LINUX -DLEVELDB_PLATFORM_POSIX -O2 -DNDEBUG
       -c db/builder.cc -o db/builder.o
g++ -I. -I./include -fno-builtin-memcmp -pthread -DOS_LINUX -DLEVELDB_PLATFORM_POSIX -O2 -DNDEBUG
       -c db/c.cc -o db/c.o
g++ -I. -I./include -fno-builtin-memcmp -pthread -DOS_LINUX -DLEVELDB_PLATFORM_POSIX -O2 -DNDEBUG
       -c db/db_impl.cc -o db/db_impl.o
g++ -I. -I./include -fno-builtin-memcmp -pthread -DOS_LINUX -DLEVELDB_PLATFORM_POSIX -O2 -DNDEBUG
       -c db/db_iter.cc -o db/db_iter.o
g++ -I. -I./include -fno-builtin-memcmp -pthread -DOS_LINUX -DLEVELDB_PLATFORM_POSIX -O2 -DNDEBUG
       -c db/dbformat.cc -o db/dbformat.o
g++ -I. -I./include -fno-builtin-memcmp -pthread -DOS_LINUX -DLEVELDB_PLATFORM_POSIX -O2 -DNDEBUG
       -c db/filename.cc -o db/filename.o
g++ -I. -I./include -fno-builtin-memcmp -pthread -DOS_LINUX -DLEVELDB_PLATFORM_POSIX -O2 -DNDEBUG
       -c db/log_reader.cc -o db/log_reader.o
g++ -I. -I./include -fno-builtin-memcmp -pthread -DOS_LINUX -DLEVELDB_PLATFORM_POSIX -O2 -DNDEBUG
       -c db/log_writer.cc -o db/log_writer.o
g++ -I. -I./include -fno-builtin-memcmp -pthread -DOS_LINUX -DLEVELDB_PLATFORM_POSIX -O2 -DNDEBUG
       -c db/memtable.cc -o db/memtable.o
g++ -I. -I./include -fno-builtin-memcmp -pthread -DOS_LINUX -DLEVELDB_PLATFORM_POSIX -O2 -DNDEBUG
       -c db/repair.cc -o db/repair.o
g++ -I. -I./include -fno-builtin-memcmp -pthread -DOS_LINUX -DLEVELDB_PLATFORM_POSIX -O2 -DNDEBUG
       -c db/table_cache.cc -o db/table_cache.o
g++ -I. -I./include -fno-builtin-memcmp -pthread -DOS_LINUX -DLEVELDB_PLATFORM_POSIX -O2 -DNDEBUG
       -c db/version_edit.cc -o db/version_edit.o
g++ -I. -I./include -fno-builtin-memcmp -pthread -DOS_LINUX -DLEVELDB_PLATFORM_POSIX -O2 -DNDEBUG
       -c db/version_set.cc -o db/version_set.o
g++ -I. -I./include -fno-builtin-memcmp -pthread -DOS_LINUX -DLEVELDB_PLATFORM_POSIX -O2 -DNDEBUG
       -c db/write_batch.cc -o db/write_batch.o
g++ -I. -I./include -fno-builtin-memcmp -pthread -DOS_LINUX -DLEVELDB_PLATFORM_POSIX -O2 -DNDEBUG
       -c table/block.cc -o table/block.o
g++ -I. -I./include -fno-builtin-memcmp -pthread -DOS_LINUX -DLEVELDB_PLATFORM_POSIX -O2 -DNDEBUG
       -c table/block_builder.cc -o table/block_builder.o
g++ -I. -I./include -fno-builtin-memcmp -pthread -DOS_LINUX -DLEVELDB_PLATFORM_POSIX -O2 -DNDEBUG
       -c table/filter_block.cc -o table/filter_block.o
g++ -I. -I./include -fno-builtin-memcmp -pthread -DOS_LINUX -DLEVELDB_PLATFORM_POSIX -O2 -DNDEBUG
       -c table/format.cc -o table/format.o
g++ -I. -I./include -fno-builtin-memcmp -pthread -DOS_LINUX -DLEVELDB_PLATFORM_POSIX -O2 -DNDEBUG
       -c table/iterator.cc -o table/iterator.o
g++ -I. -I./include -fno-builtin-memcmp -pthread -DOS_LINUX -DLEVELDB_PLATFORM_POSIX -O2 -DNDEBUG
       -c table/merger.cc -o table/merger.o
g++ -I. -I./include -fno-builtin-memcmp -pthread -DOS_LINUX -DLEVELDB_PLATFORM_POSIX -O2 -DNDEBUG
       -c table/table.cc -o table/table.o
g++ -I. -I./include -fno-builtin-memcmp -pthread -DOS_LINUX -DLEVELDB_PLATFORM_POSIX -O2 -DNDEBUG
       -c table/table_builder.cc -o table/table_builder.o
g++ -I. -I./include -fno-builtin-memcmp -pthread -DOS_LINUX -DLEVELDB_PLATFORM_POSIX -O2 -DNDEBUG
       -c table/two_level_iterator.cc -o table/two_level_iterator.o
g++ -I. -I./include -fno-builtin-memcmp -pthread -DOS_LINUX -DLEVELDB_PLATFORM_POSIX -O2 -DNDEBUG
       -c util/arena.cc -o util/arena.o
g++ -I. -I./include -fno-builtin-memcmp -pthread -DOS_LINUX -DLEVELDB_PLATFORM_POSIX -O2 -DNDEBUG
       -c util/bloom.cc -o util/bloom.o
g++ -I. -I./include -fno-builtin-memcmp -pthread -DOS_LINUX -DLEVELDB_PLATFORM_POSIX -O2 -DNDEBUG
       -c util/cache.cc -o util/cache.o
g++ -I. -I./include -fno-builtin-memcmp -pthread -DOS_LINUX -DLEVELDB_PLATFORM_POSIX -O2 -DNDEBUG
       -c util/coding.cc -o util/coding.o
g++ -I. -I./include -fno-builtin-memcmp -pthread -DOS_LINUX -DLEVELDB_PLATFORM_POSIX -O2 -DNDEBUG
       -c util/comparator.cc -o util/comparator.o
g++ -I. -I./include -fno-builtin-memcmp -pthread -DOS_LINUX -DLEVELDB_PLATFORM_POSIX -O2 -DNDEBUG
       -c util/crc32c.cc -o util/crc32c.o
g++ -I. -I./include -fno-builtin-memcmp -pthread -DOS_LINUX -DLEVELDB_PLATFORM_POSIX -O2 -DNDEBUG
       -c util/env.cc -o util/env.o
g++ -I. -I./include -fno-builtin-memcmp -pthread -DOS_LINUX -DLEVELDB_PLATFORM_POSIX -O2 -DNDEBUG
       -c util/env_posix.cc -o util/env_posix.o
g++ -I. -I./include -fno-builtin-memcmp -pthread -DOS_LINUX -DLEVELDB_PLATFORM_POSIX -O2 -DNDEBUG
       -c util/filter_policy.cc -o util/filter_policy.o
g++ -I. -I./include -fno-builtin-memcmp -pthread -DOS_LINUX -DLEVELDB_PLATFORM_POSIX -O2 -DNDEBUG
       -c util/hash.cc -o util/hash.o
g++ -I. -I./include -fno-builtin-memcmp -pthread -DOS_LINUX -DLEVELDB_PLATFORM_POSIX -O2 -DNDEBUG
       -c util/histogram.cc -o util/histogram.o
g++ -I. -I./include -fno-builtin-memcmp -pthread -DOS_LINUX -DLEVELDB_PLATFORM_POSIX -O2 -DNDEBUG
       -c util/logging.cc -o util/logging.o
g++ -I. -I./include -fno-builtin-memcmp -pthread -DOS_LINUX -DLEVELDB_PLATFORM_POSIX -O2 -DNDEBUG
       -c util/options.cc -o util/options.o
g++ -I. -I./include -fno-builtin-memcmp -pthread -DOS_LINUX -DLEVELDB_PLATFORM_POSIX -O2 -DNDEBUG
       -c util/status.cc -o util/status.o
g++ -I. -I./include -fno-builtin-memcmp -pthread -DOS_LINUX -DLEVELDB_PLATFORM_POSIX -O2 -DNDEBUG
       -c port/port_posix.cc -o port/port_posix.o
rm -f libleveldb.a
ar -rs libleveldb.a db/builder.o db/c.o db/db_impl.o db/db_iter.o db/dbformat.o db/filename.o
db/log_reader.o db/log_writer.o db/memtable.o db/repair.o db/table_cache.o db/version_edit.o
db/version_set.o db/write_batch.o table/block.o table/block_builder.o table/filter_block.o
table/format.o table/iterator.o table/merger.o table/table.o table/table_builder.o table/two_level_iterator.o
util/arena.o util/bloom.o util/cache.o util/coding.o util/comparator.o util/crc32c.o util/env.o
util/env_posix.o util/filter_policy.o util/hash.o util/histogram.o util/logging.o util/options.o
util/status.o port/port_posix.o
ar: creating libleveldb.a
make[3]: Leaving directory `/mesos/build/3rdparty/leveldb-1.4/src/leveldb-1.4'
cd /mesos/build/3rdparty/leveldb-1.4/src/leveldb-1.4-build && /usr/bin/cmake -E touch
/mesos/build/3rdparty/leveldb-1.4/src/leveldb-1.4-stamp/leveldb-1.4-build
/usr/bin/cmake -E cmake_progress_report /mesos/build/CMakeFiles 
[ 40%] Performing install step for 'leveldb-1.4'
cd /mesos/build/3rdparty/leveldb-1.4/src/leveldb-1.4-build && /usr/bin/cmake -E echo

cd /mesos/build/3rdparty/leveldb-1.4/src/leveldb-1.4-build && /usr/bin/cmake -E touch
/mesos/build/3rdparty/leveldb-1.4/src/leveldb-1.4-stamp/leveldb-1.4-install
/usr/bin/cmake -E cmake_progress_report /mesos/build/CMakeFiles 10
[ 41%] Completed 'leveldb-1.4'
cd /mesos/build/3rdparty && /usr/bin/cmake -E make_directory /mesos/build/3rdparty/CMakeFiles
cd /mesos/build/3rdparty && /usr/bin/cmake -E touch /mesos/build/3rdparty/CMakeFiles/leveldb-1.4-complete
cd /mesos/build/3rdparty && /usr/bin/cmake -E touch /mesos/build/3rdparty/leveldb-1.4/src/leveldb-1.4-stamp/leveldb-1.4-done
make[2]: Leaving directory `/mesos/build'
/usr/bin/cmake -E cmake_progress_report /mesos/build/CMakeFiles  10 11
[ 41%] Built target leveldb-1.4
make -f src/CMakeFiles/mesos-1.0.0.dir/build.make src/CMakeFiles/mesos-1.0.0.dir/depend
make[2]: Entering directory `/mesos/build'
/usr/bin/cmake -E cmake_progress_report /mesos/build/CMakeFiles 
/usr/bin/cmake -E cmake_progress_report /mesos/build/CMakeFiles 14
/usr/bin/cmake -E cmake_progress_report /mesos/build/CMakeFiles 
/usr/bin/cmake -E cmake_progress_report /mesos/build/CMakeFiles 
/usr/bin/cmake -E cmake_progress_report /mesos/build/CMakeFiles 
/usr/bin/cmake -E cmake_progress_report /mesos/build/CMakeFiles 15
/usr/bin/cmake -E cmake_progress_report /mesos/build/CMakeFiles 
/usr/bin/cmake -E cmake_progress_report /mesos/build/CMakeFiles 
[ 42%] [ 42%] [ 42%] [ 42%] [ 43%] [ 43%] [ 43%] [ 43%] Generating ../include/mesos/master/allocator.pb.cc,
../include/mesos/master/allocator.pb.h
Generating ../include/mesos/authorizer/acls.pb.cc, ../include/mesos/authorizer/acls.pb.h
Generating ../include/mesos/v1/scheduler/scheduler.pb.cc, ../include/mesos/v1/scheduler/scheduler.pb.h
/mesos/build/3rdparty/protobuf-2.6.1/src/protobuf-2.6.1-lib/lib/bin/protoc -I/mesos/include
-I/mesos/src --cpp_out=/mesos/build/include /mesos/include/mesos/authorizer/acls.proto
/mesos/build/3rdparty/protobuf-2.6.1/src/protobuf-2.6.1-lib/lib/bin/protoc -I/mesos/include
-I/mesos/src --cpp_out=/mesos/build/include /mesos/include/mesos/master/allocator.proto
Generating ../include/mesos/appc/spec.pb.cc, ../include/mesos/appc/spec.pb.h
/mesos/build/3rdparty/protobuf-2.6.1/src/protobuf-2.6.1-lib/lib/bin/protoc -I/mesos/include
-I/mesos/src --cpp_out=/mesos/build/include /mesos/include/mesos/v1/scheduler/scheduler.proto
/mesos/build/3rdparty/protobuf-2.6.1/src/protobuf-2.6.1-lib/lib/bin/protoc -I/mesos/include
-I/mesos/src --cpp_out=/mesos/build/include /mesos/include/mesos/appc/spec.proto
Generating ../include/mesos/authorizer/authorizer.pb.cc, ../include/mesos/authorizer/authorizer.pb.h
Generating ../include/mesos/docker/spec.pb.cc, ../include/mesos/docker/spec.pb.h
Generating ../include/mesos/containerizer/containerizer.pb.cc, ../include/mesos/containerizer/containerizer.pb.h
/mesos/build/3rdparty/protobuf-2.6.1/src/protobuf-2.6.1-lib/lib/bin/protoc -I/mesos/include
-I/mesos/src --cpp_out=/mesos/build/include /mesos/include/mesos/authorizer/authorizer.proto
/mesos/build/3rdparty/protobuf-2.6.1/src/protobuf-2.6.1-lib/lib/bin/protoc -I/mesos/include
-I/mesos/src --cpp_out=/mesos/build/include /mesos/include/mesos/docker/spec.proto
Generating ../include/mesos/authentication/authentication.pb.cc, ../include/mesos/authentication/authentication.pb.h
/mesos/build/3rdparty/protobuf-2.6.1/src/protobuf-2.6.1-lib/lib/bin/protoc -I/mesos/include
-I/mesos/src --cpp_out=/mesos/build/include /mesos/include/mesos/containerizer/containerizer.proto
/mesos/build/3rdparty/protobuf-2.6.1/src/protobuf-2.6.1-lib/lib/bin/protoc -I/mesos/include
-I/mesos/src --cpp_out=/mesos/build/include /mesos/include/mesos/authentication/authentication.proto
/usr/bin/cmake -E cmake_progress_report /mesos/build/CMakeFiles 
/usr/bin/cmake -E cmake_progress_report /mesos/build/CMakeFiles 16
/usr/bin/cmake -E cmake_progress_report /mesos/build/CMakeFiles 
/usr/bin/cmake -E cmake_progress_report /mesos/build/CMakeFiles 
[ 44%] [ 44%] [ 44%] /usr/bin/cmake -E cmake_progress_report /mesos/build/CMakeFiles 
[ 44%] /usr/bin/cmake -E cmake_progress_report /mesos/build/CMakeFiles 17
Generating ../include/mesos/docker/v1.pb.cc, ../include/mesos/docker/v1.pb.h
/mesos/build/3rdparty/protobuf-2.6.1/src/protobuf-2.6.1-lib/lib/bin/protoc -I/mesos/include
-I/mesos/src --cpp_out=/mesos/build/include /mesos/include/mesos/docker/v1.proto
Generating ../include/mesos/docker/v2.pb.cc, ../include/mesos/docker/v2.pb.h
/usr/bin/cmake -E cmake_progress_report /mesos/build/CMakeFiles 
Generating ../include/mesos/executor/executor.pb.cc, ../include/mesos/executor/executor.pb.h
/mesos/build/3rdparty/protobuf-2.6.1/src/protobuf-2.6.1-lib/lib/bin/protoc -I/mesos/include
-I/mesos/src --cpp_out=/mesos/build/include /mesos/include/mesos/docker/v2.proto
[ 44%] /mesos/build/3rdparty/protobuf-2.6.1/src/protobuf-2.6.1-lib/lib/bin/protoc -I/mesos/include
-I/mesos/src --cpp_out=/mesos/build/include /mesos/include/mesos/executor/executor.proto
Generating ../include/mesos/fetcher/fetcher.pb.cc, ../include/mesos/fetcher/fetcher.pb.h
[ 45%] /usr/bin/cmake -E cmake_progress_report /mesos/build/CMakeFiles 
/mesos/build/3rdparty/protobuf-2.6.1/src/protobuf-2.6.1-lib/lib/bin/protoc -I/mesos/include
-I/mesos/src --cpp_out=/mesos/build/include /mesos/include/mesos/fetcher/fetcher.proto
[ 45%] /usr/bin/cmake -E cmake_progress_report /mesos/build/CMakeFiles 
Generating messages/flags.pb.cc, messages/flags.pb.h
/mesos/build/3rdparty/protobuf-2.6.1/src/protobuf-2.6.1-lib/lib/bin/protoc -I/mesos/include
-I/mesos/src --cpp_out=/mesos/build/src /mesos/src/messages/flags.proto
/usr/bin/cmake -E cmake_progress_report /mesos/build/CMakeFiles 18
/usr/bin/cmake -E cmake_progress_report /mesos/build/CMakeFiles 
[ 45%] Generating messages/log.pb.cc, messages/log.pb.h
[ 45%] Generating messages/messages.pb.cc, messages/messages.pb.h
/mesos/build/3rdparty/protobuf-2.6.1/src/protobuf-2.6.1-lib/lib/bin/protoc -I/mesos/include
-I/mesos/src --cpp_out=/mesos/build/src /mesos/src/messages/log.proto
/mesos/build/3rdparty/protobuf-2.6.1/src/protobuf-2.6.1-lib/lib/bin/protoc -I/mesos/include
-I/mesos/src --cpp_out=/mesos/build/src /mesos/src/messages/messages.proto
[ 46%] [ 46%] Generating messages/state.pb.cc, messages/state.pb.h
/mesos/build/3rdparty/protobuf-2.6.1/src/protobuf-2.6.1-lib/lib/bin/protoc -I/mesos/include
-I/mesos/src --cpp_out=/mesos/build/src /mesos/src/messages/state.proto
Generating ../include/mesos/slave/isolator.pb.cc, ../include/mesos/slave/isolator.pb.h
/usr/bin/cmake -E cmake_progress_report /mesos/build/CMakeFiles 
/mesos/build/3rdparty/protobuf-2.6.1/src/protobuf-2.6.1-lib/lib/bin/protoc -I/mesos/include
-I/mesos/src --cpp_out=/mesos/build/include /mesos/include/mesos/slave/isolator.proto
Generating slave/containerizer/mesos/isolators/network/cni/spec.pb.cc, slave/containerizer/mesos/isolators/network/cni/spec.pb.h
/mesos/build/3rdparty/protobuf-2.6.1/src/protobuf-2.6.1-lib/lib/bin/protoc -I/mesos/include
-I/mesos/src --cpp_out=/mesos/build/src /mesos/src/slave/containerizer/mesos/isolators/network/cni/spec.proto
/usr/bin/cmake -E cmake_progress_report /mesos/build/CMakeFiles 
Generating slave/containerizer/mesos/isolators/docker/volume/state.pb.cc, slave/containerizer/mesos/isolators/docker/volume/state.pb.h
/mesos/build/3rdparty/protobuf-2.6.1/src/protobuf-2.6.1-lib/lib/bin/protoc -I/mesos/include
-I/mesos/src --cpp_out=/mesos/build/src /mesos/src/slave/containerizer/mesos/isolators/docker/volume/state.proto
/usr/bin/cmake -E cmake_progress_report /mesos/build/CMakeFiles 19
/usr/bin/cmake -E cmake_progress_report /mesos/build/CMakeFiles 
[ 46%] [ 46%] /usr/bin/cmake -E cmake_progress_report /mesos/build/CMakeFiles 
/usr/bin/cmake -E cmake_progress_report /mesos/build/CMakeFiles 
[ 46%] [ 47%] /usr/bin/cmake -E cmake_progress_report /mesos/build/CMakeFiles 20
Generating ../include/mesos/mesos.pb.cc, ../include/mesos/mesos.pb.h
[ 47%] [ 47%] Generating ../include/mesos/maintenance/maintenance.pb.cc, ../include/mesos/maintenance/maintenance.pb.h
/mesos/build/3rdparty/protobuf-2.6.1/src/protobuf-2.6.1-lib/lib/bin/protoc -I/mesos/include
-I/mesos/src --cpp_out=/mesos/build/include /mesos/include/mesos/mesos.proto
/mesos/build/3rdparty/protobuf-2.6.1/src/protobuf-2.6.1-lib/lib/bin/protoc -I/mesos/include
-I/mesos/src --cpp_out=/mesos/build/include /mesos/include/mesos/maintenance/maintenance.proto
Generating ../include/mesos/quota/quota.pb.cc, ../include/mesos/quota/quota.pb.h
/mesos/build/3rdparty/protobuf-2.6.1/src/protobuf-2.6.1-lib/lib/bin/protoc -I/mesos/include
-I/mesos/src --cpp_out=/mesos/build/include /mesos/include/mesos/quota/quota.proto
Generating ../include/mesos/module/module.pb.cc, ../include/mesos/module/module.pb.h
[ 48%] /mesos/build/3rdparty/protobuf-2.6.1/src/protobuf-2.6.1-lib/lib/bin/protoc -I/mesos/include
-I/mesos/src --cpp_out=/mesos/build/include /mesos/include/mesos/module/module.proto
Generating ../include/mesos/slave/oversubscription.pb.cc, ../include/mesos/slave/oversubscription.pb.h
/mesos/build/3rdparty/protobuf-2.6.1/src/protobuf-2.6.1-lib/lib/bin/protoc -I/mesos/include
-I/mesos/src --cpp_out=/mesos/build/include /mesos/include/mesos/slave/oversubscription.proto
Generating slave/containerizer/mesos/provisioner/docker/message.pb.cc, slave/containerizer/mesos/provisioner/docker/message.pb.h
/mesos/build/3rdparty/protobuf-2.6.1/src/protobuf-2.6.1-lib/lib/bin/protoc -I/mesos/include
-I/mesos/src --cpp_out=/mesos/build/src /mesos/src/slave/containerizer/mesos/provisioner/docker/message.proto
/usr/bin/cmake -E cmake_progress_report /mesos/build/CMakeFiles 
Generating master/registry.pb.cc, master/registry.pb.h
/mesos/build/3rdparty/protobuf-2.6.1/src/protobuf-2.6.1-lib/lib/bin/protoc -I/mesos/include
-I/mesos/src --cpp_out=/mesos/build/src /mesos/src/master/registry.proto
/usr/bin/cmake -E cmake_progress_report /mesos/build/CMakeFiles 
/usr/bin/cmake -E cmake_progress_report /mesos/build/CMakeFiles 
/usr/bin/cmake -E cmake_progress_report /mesos/build/CMakeFiles 
[ 48%] /usr/bin/cmake -E cmake_progress_report /mesos/build/CMakeFiles 21
[ 48%] /usr/bin/cmake -E cmake_progress_report /mesos/build/CMakeFiles 
[ 48%] [ 49%] [ 49%] Generating ../include/mesos/scheduler/scheduler.pb.cc, ../include/mesos/scheduler/scheduler.pb.h
/mesos/build/3rdparty/protobuf-2.6.1/src/protobuf-2.6.1-lib/lib/bin/protoc -I/mesos/include
-I/mesos/src --cpp_out=/mesos/build/include /mesos/include/mesos/scheduler/scheduler.proto
Generating ../include/mesos/state/state.pb.cc, ../include/mesos/state/state.pb.h
[ 49%] /mesos/build/3rdparty/protobuf-2.6.1/src/protobuf-2.6.1-lib/lib/bin/protoc -I/mesos/include
-I/mesos/src --cpp_out=/mesos/build/include /mesos/include/mesos/state/state.proto
Generating ../include/mesos/uri/uri.pb.cc, ../include/mesos/uri/uri.pb.h
/mesos/build/3rdparty/protobuf-2.6.1/src/protobuf-2.6.1-lib/lib/bin/protoc -I/mesos/include
-I/mesos/src --cpp_out=/mesos/build/include /mesos/include/mesos/uri/uri.proto
Generating ../include/mesos/v1/master/allocator.pb.cc, ../include/mesos/v1/master/allocator.pb.h
/usr/bin/cmake -E cmake_progress_report /mesos/build/CMakeFiles 
Generating ../include/mesos/v1/agent.pb.cc, ../include/mesos/v1/agent.pb.h
/mesos/build/3rdparty/protobuf-2.6.1/src/protobuf-2.6.1-lib/lib/bin/protoc -I/mesos/include
-I/mesos/src --cpp_out=/mesos/build/include /mesos/include/mesos/v1/master/allocator.proto
/mesos/build/3rdparty/protobuf-2.6.1/src/protobuf-2.6.1-lib/lib/bin/protoc -I/mesos/include
-I/mesos/src --cpp_out=/mesos/build/include /mesos/include/mesos/v1/agent.proto
/usr/bin/cmake -E cmake_progress_report /mesos/build/CMakeFiles 
Generating ../include/mesos/v1/executor/executor.pb.cc, ../include/mesos/v1/executor/executor.pb.h
/mesos/include/mesos/v1/agent.proto: No such file or directory
make[2]: *** [include/mesos/v1/agent.pb.cc] Error 1
make[2]: *** Waiting for unfinished jobs....
/mesos/build/3rdparty/protobuf-2.6.1/src/protobuf-2.6.1-lib/lib/bin/protoc -I/mesos/include
-I/mesos/src --cpp_out=/mesos/build/include /mesos/include/mesos/v1/executor/executor.proto
[ 49%] [ 49%] Generating ../include/mesos/v1/maintenance/maintenance.pb.cc, ../include/mesos/v1/maintenance/maintenance.pb.h
/mesos/build/3rdparty/protobuf-2.6.1/src/protobuf-2.6.1-lib/lib/bin/protoc -I/mesos/include
-I/mesos/src --cpp_out=/mesos/build/include /mesos/include/mesos/v1/maintenance/maintenance.proto
Generating ../include/mesos/v1/master.pb.cc, ../include/mesos/v1/master.pb.h
/mesos/build/3rdparty/protobuf-2.6.1/src/protobuf-2.6.1-lib/lib/bin/protoc -I/mesos/include
-I/mesos/src --cpp_out=/mesos/build/include /mesos/include/mesos/v1/master.proto
/mesos/include/mesos/v1/master.proto: No such file or directory
make[2]: *** [include/mesos/v1/master.pb.cc] Error 1
make[2]: Leaving directory `/mesos/build'
make[1]: *** [src/CMakeFiles/mesos-1.0.0.dir/all] Error 2
make[1]: Leaving directory `/mesos/build'
make: *** [all] Error 2
+ docker rmi mesos-1466117204-19310
Untagged: mesos-1466117204-19310:latest
Deleted: dcdf115bb4aaed5e594ef99266cd8f918c1f43b49968ce8285a9cd123d069ac8
Deleted: 81d2df7755bb0f934ff9a4c7cd7d7a6aeae9ba8ce64e85fff5ccbd11e2c6d563
Deleted: 03900dadb4861268c326bcf738b1e0e35ed31b166d0798049bc7643c3e09dc3b
Deleted: a60c984591e74f2ebda34072c6b575c72434beceea7db823c5c98d70f358979b
Deleted: bebfb1fe245856473e4b98338926c9dc50a708567eb1ecfe4deca13eaeff3ca9
Deleted: 7f11ecb0b0960410e2b5bc9d67ea8a8ccf979675d6d0707485cd172d64bcfc3b
Deleted: b85fe1fd4b2e22bf0d77b48ed1f71d27155b12d0ef650a83befb8c2a649386c8
Deleted: 1a6e160cbc715168599c603284ef07709536a0d108ed5446d4e4dcb1d057493b
Deleted: 097ffd8757d773c00308356a4629a9e6d46bb1b195d911f372ecd4b320ded4a2
Deleted: 4f1e54acc6e48242afbc2c418e7050e1453dfd83bf5fac2f5f02b0cf8dfb08fc
Deleted: 42c38377bc34365f0b34037be4ddbea313ffb4727bbdaebee76c82839ea38825
Deleted: 72d0e8f949084cddf8210c7b91f713032e5ddf38aad81a5311a39565c1283a00
Deleted: 9e6dd0a6bd020ddb635151b2e44ca9d0f0b212f210d2de8de846eca0b048e786
Deleted: bd48ee672eb64c6d89ce1fbaf96cbe7d8aac97353dea7e3f7079f277f5ec68ba
Deleted: fe2756677087ce6b19980cc1a0cf93c30350e125e52a02578fd436fa1e7725b7
Build step 'Execute shell' marked build as failure

Mime
View raw message