mesos-builds mailing list archives

Site index · List index
Message view « Date » · « Thread »
Top « Date » · « Thread »
From Apache Jenkins Server <jenk...@builds.apache.org>
Subject Build failed in Jenkins: Mesos » clang,--verbose,GLOG_v=1 MESOS_VERBOSE=1,ubuntu:14.04,(docker||Hadoop)&&(!ubuntu-us1) #2116
Date Mon, 16 May 2016 02:36:39 GMT
See <https://builds.apache.org/job/Mesos/COMPILER=clang,CONFIGURATION=--verbose,ENVIRONMENT=GLOG_v=1%20MESOS_VERBOSE=1,OS=ubuntu%3A14.04,label_exp=(docker%7C%7CHadoop)&&(!ubuntu-us1)/2116/changes>

Changes:

[tnachen] Fixed FTS handle leak issue in xfs isolator.

------------------------------------------
[...truncated 186365 lines...]
I0516 02:36:29.931152 25272 slave.cpp:4990] Querying resource estimator for oversubscribable
resources
I0516 02:36:29.931783 25272 slave.cpp:5004] Received oversubscribable resources  from the
resource estimator
I0516 02:36:29.935518 25243 slave.cpp:818] Agent terminating
[       OK ] Endpoint/SlaveEndpointTest.AuthorizedRequest/0 (28 ms)
[ RUN      ] Endpoint/SlaveEndpointTest.AuthorizedRequest/1
I0516 02:36:29.947827 25243 containerizer.cpp:178] Using isolation: posix/cpu,posix/mem,filesystem/posix,network/cni
W0516 02:36:29.948853 25243 backend.cpp:66] Failed to create 'bind' backend: BindBackend requires
root privileges
I0516 02:36:29.952390 25274 slave.cpp:203] Agent started on 493)@172.17.0.3:59343
I0516 02:36:29.952448 25274 slave.cpp:204] Flags at startup: --acls="" --appc_simple_discovery_uri_prefix="http://"
--appc_store_dir="/tmp/mesos/store/appc" --authenticate_http="true" --authenticatee="crammd5"
--authorizer="local" --cgroups_cpu_enable_pids_and_tids_count="false" --cgroups_enable_cfs="false"
--cgroups_hierarchy="/sys/fs/cgroup" --cgroups_limit_swap="false" --cgroups_root="mesos" --container_disk_watch_interval="15secs"
--containerizers="mesos" --credential="/tmp/Endpoint_SlaveEndpointTest_AuthorizedRequest_1_gSJaLJ/credential"
--default_role="*" --disk_watch_interval="1mins" --docker="docker" --docker_kill_orphans="true"
--docker_registry="https://registry-1.docker.io" --docker_remove_delay="6hrs" --docker_socket="/var/run/docker.sock"
--docker_stop_timeout="0ns" --docker_store_dir="/tmp/mesos/store/docker" --docker_volume_checkpoint_dir="/var/run/mesos/isolators/docker/volume"
--enforce_container_disk_quota="false" --executor_registration_timeout="1mins" --executor_shutdown_grace_period="5secs"
--fetcher_cache_dir="/tmp/Endpoint_SlaveEndpointTest_AuthorizedRequest_1_gSJaLJ/fetch" --fetcher_cache_size="2GB"
--frameworks_home="" --gc_delay="1weeks" --gc_disk_headroom="0.1" --hadoop_home="" --help="false"
--hostname_lookup="true" --http_authenticators="basic" --http_command_executor="false" --http_credentials="/tmp/Endpoint_SlaveEndpointTest_AuthorizedRequest_1_gSJaLJ/http_credentials"
--image_provisioner_backend="copy" --initialize_driver_logging="true" --isolation="posix/cpu,posix/mem"
--launcher_dir="/mesos/mesos-0.29.0/_build/src" --logbufsecs="0" --logging_level="INFO" --oversubscribed_resources_interval="15secs"
--perf_duration="10secs" --perf_interval="1mins" --qos_correction_interval_min="0ns" --quiet="false"
--recover="reconnect" --recovery_timeout="15mins" --registration_backoff_factor="10ms" --resources="cpus:2;mem:1024;disk:1024;ports:[31000-32000]"
--revocable_cpu_low_priority="true" --sandbox_directory="/mnt/mesos/sandbox" --strict="true"
--switch_user="true" --systemd_enable_support="true" --systemd_runtime_directory="/run/systemd/system"
--version="false" --work_dir="/tmp/Endpoint_SlaveEndpointTest_AuthorizedRequest_1_gSJaLJ"
I0516 02:36:29.953030 25274 credentials.hpp:86] Loading credential for authentication from
'/tmp/Endpoint_SlaveEndpointTest_AuthorizedRequest_1_gSJaLJ/credential'
I0516 02:36:29.953299 25274 slave.cpp:341] Agent using credential for: test-principal
I0516 02:36:29.953332 25274 credentials.hpp:37] Loading credentials for authentication from
'/tmp/Endpoint_SlaveEndpointTest_AuthorizedRequest_1_gSJaLJ/http_credentials'
I0516 02:36:29.953599 25274 slave.cpp:393] Using default 'basic' HTTP authenticator
I0516 02:36:29.954156 25274 resources.cpp:572] Parsing resources as JSON failed: cpus:2;mem:1024;disk:1024;ports:[31000-32000]
Trying semicolon-delimited string format instead
I0516 02:36:29.954607 25274 slave.cpp:592] Agent resources: cpus(*):2; mem(*):1024; disk(*):1024;
ports(*):[31000-32000]
I0516 02:36:29.954679 25274 slave.cpp:600] Agent attributes: [  ]
I0516 02:36:29.954691 25274 slave.cpp:605] Agent hostname: 0d02e1a33a2d
I0516 02:36:29.956275 25273 state.cpp:57] Recovering state from '/tmp/Endpoint_SlaveEndpointTest_AuthorizedRequest_1_gSJaLJ/meta'
I0516 02:36:29.956650 25273 status_update_manager.cpp:200] Recovering status update manager
I0516 02:36:29.956939 25273 containerizer.cpp:444] Recovering containerizer
I0516 02:36:29.958101 25262 provisioner.cpp:245] Provisioner recovery complete
I0516 02:36:29.958338 25265 slave.cpp:4818] Finished recovery
I0516 02:36:29.958935 25265 slave.cpp:4990] Querying resource estimator for oversubscribable
resources
I0516 02:36:29.959153 25265 slave.cpp:5004] Received oversubscribable resources  from the
resource estimator
I0516 02:36:29.959497 25265 process.cpp:3247] Handling HTTP event for process 'slave(493)'
with path: '/slave(493)/monitor/statistics.json'
I0516 02:36:29.960408 25266 http.cpp:880] Authorizing principal 'test-principal' to GET the
'/monitor/statistics.json' endpoint
I0516 02:36:29.966689 25243 slave.cpp:818] Agent terminating
[       OK ] Endpoint/SlaveEndpointTest.AuthorizedRequest/1 (36 ms)
[ RUN      ] Endpoint/SlaveEndpointTest.AuthorizedRequest/2
I0516 02:36:29.983783 25243 containerizer.cpp:178] Using isolation: posix/cpu,posix/mem,filesystem/posix,network/cni
W0516 02:36:29.984771 25243 backend.cpp:66] Failed to create 'bind' backend: BindBackend requires
root privileges
I0516 02:36:29.988765 25276 slave.cpp:203] Agent started on 494)@172.17.0.3:59343
I0516 02:36:29.988888 25276 slave.cpp:204] Flags at startup: --acls="" --appc_simple_discovery_uri_prefix="http://"
--appc_store_dir="/tmp/mesos/store/appc" --authenticate_http="true" --authenticatee="crammd5"
--authorizer="local" --cgroups_cpu_enable_pids_and_tids_count="false" --cgroups_enable_cfs="false"
--cgroups_hierarchy="/sys/fs/cgroup" --cgroups_limit_swap="false" --cgroups_root="mesos" --container_disk_watch_interval="15secs"
--containerizers="mesos" --credential="/tmp/Endpoint_SlaveEndpointTest_AuthorizedRequest_2_YOUUxq/credential"
--default_role="*" --disk_watch_interval="1mins" --docker="docker" --docker_kill_orphans="true"
--docker_registry="https://registry-1.docker.io" --docker_remove_delay="6hrs" --docker_socket="/var/run/docker.sock"
--docker_stop_timeout="0ns" --docker_store_dir="/tmp/mesos/store/docker" --docker_volume_checkpoint_dir="/var/run/mesos/isolators/docker/volume"
--enforce_container_disk_quota="false" --executor_registration_timeout="1mins" --executor_shutdown_grace_period="5secs"
--fetcher_cache_dir="/tmp/Endpoint_SlaveEndpointTest_AuthorizedRequest_2_YOUUxq/fetch" --fetcher_cache_size="2GB"
--frameworks_home="" --gc_delay="1weeks" --gc_disk_headroom="0.1" --hadoop_home="" --help="false"
--hostname_lookup="true" --http_authenticators="basic" --http_command_executor="false" --http_credentials="/tmp/Endpoint_SlaveEndpointTest_AuthorizedRequest_2_YOUUxq/http_credentials"
--image_provisioner_backend="copy" --initialize_driver_logging="true" --isolation="posix/cpu,posix/mem"
--launcher_dir="/mesos/mesos-0.29.0/_build/src" --logbufsecs="0" --logging_level="INFO" --oversubscribed_resources_interval="15secs"
--perf_duration="10secs" --perf_interval="1mins" --qos_correction_interval_min="0ns" --quiet="false"
--recover="reconnect" --recovery_timeout="15mins" --registration_backoff_factor="10ms" --resources="cpus:2;mem:1024;disk:1024;ports:[31000-32000]"
--revocable_cpu_low_priority="true" --sandbox_directory="/mnt/mesos/sandbox" --strict="true"
--switch_user="true" --systemd_enable_support="true" --systemd_runtime_directory="/run/systemd/system"
--version="false" --work_dir="/tmp/Endpoint_SlaveEndpointTest_AuthorizedRequest_2_YOUUxq"
I0516 02:36:29.989444 25276 credentials.hpp:86] Loading credential for authentication from
'/tmp/Endpoint_SlaveEndpointTest_AuthorizedRequest_2_YOUUxq/credential'
I0516 02:36:29.989751 25276 slave.cpp:341] Agent using credential for: test-principal
I0516 02:36:29.989784 25276 credentials.hpp:37] Loading credentials for authentication from
'/tmp/Endpoint_SlaveEndpointTest_AuthorizedRequest_2_YOUUxq/http_credentials'
I0516 02:36:29.990095 25276 slave.cpp:393] Using default 'basic' HTTP authenticator
I0516 02:36:29.990439 25276 resources.cpp:572] Parsing resources as JSON failed: cpus:2;mem:1024;disk:1024;ports:[31000-32000]
Trying semicolon-delimited string format instead
I0516 02:36:29.990936 25276 slave.cpp:592] Agent resources: cpus(*):2; mem(*):1024; disk(*):1024;
ports(*):[31000-32000]
I0516 02:36:29.991142 25276 slave.cpp:600] Agent attributes: [  ]
I0516 02:36:29.991281 25276 slave.cpp:605] Agent hostname: 0d02e1a33a2d
I0516 02:36:29.993091 25273 state.cpp:57] Recovering state from '/tmp/Endpoint_SlaveEndpointTest_AuthorizedRequest_2_YOUUxq/meta'
I0516 02:36:29.993258 25276 process.cpp:3247] Handling HTTP event for process 'slave(494)'
with path: '/slave(494)/flags'
I0516 02:36:29.993866 25272 status_update_manager.cpp:200] Recovering status update manager
I0516 02:36:29.994062 25270 containerizer.cpp:444] Recovering containerizer
I0516 02:36:29.995177 25272 http.cpp:188] HTTP GET for /slave(494)/flags from 172.17.0.3:59283
I0516 02:36:29.995580 25270 provisioner.cpp:245] Provisioner recovery complete
I0516 02:36:29.995676 25272 http.cpp:880] Authorizing principal 'test-principal' to GET the
'/flags' endpoint
I0516 02:36:29.999621 25272 slave.cpp:4818] Finished recovery
I0516 02:36:30.003367 25272 slave.cpp:4990] Querying resource estimator for oversubscribable
resources
I0516 02:36:30.003638 25272 slave.cpp:5004] Received oversubscribable resources  from the
resource estimator
I0516 02:36:30.003912 25268 slave.cpp:818] Agent terminating
[       OK ] Endpoint/SlaveEndpointTest.AuthorizedRequest/2 (30 ms)
[ RUN      ] Endpoint/SlaveEndpointTest.UnauthorizedRequest/0
I0516 02:36:30.013406 25243 containerizer.cpp:178] Using isolation: posix/cpu,posix/mem,filesystem/posix,network/cni
W0516 02:36:30.014168 25243 backend.cpp:66] Failed to create 'bind' backend: BindBackend requires
root privileges
I0516 02:36:30.017298 25266 slave.cpp:203] Agent started on 495)@172.17.0.3:59343
I0516 02:36:30.017352 25266 slave.cpp:204] Flags at startup: --acls="" --appc_simple_discovery_uri_prefix="http://"
--appc_store_dir="/tmp/mesos/store/appc" --authenticate_http="true" --authenticatee="crammd5"
--authorizer="local" --cgroups_cpu_enable_pids_and_tids_count="false" --cgroups_enable_cfs="false"
--cgroups_hierarchy="/sys/fs/cgroup" --cgroups_limit_swap="false" --cgroups_root="mesos" --container_disk_watch_interval="15secs"
--containerizers="mesos" --credential="/tmp/Endpoint_SlaveEndpointTest_UnauthorizedRequest_0_2yY6A7/credential"
--default_role="*" --disk_watch_interval="1mins" --docker="docker" --docker_kill_orphans="true"
--docker_registry="https://registry-1.docker.io" --docker_remove_delay="6hrs" --docker_socket="/var/run/docker.sock"
--docker_stop_timeout="0ns" --docker_store_dir="/tmp/mesos/store/docker" --docker_volume_checkpoint_dir="/var/run/mesos/isolators/docker/volume"
--enforce_container_disk_quota="false" --executor_registration_timeout="1mins" --executor_shutdown_grace_period="5secs"
--fetcher_cache_dir="/tmp/Endpoint_SlaveEndpointTest_UnauthorizedRequest_0_2yY6A7/fetch" --fetcher_cache_size="2GB"
--frameworks_home="" --gc_delay="1weeks" --gc_disk_headroom="0.1" --hadoop_home="" --help="false"
--hostname_lookup="true" --http_authenticators="basic" --http_command_executor="false" --http_credentials="/tmp/Endpoint_SlaveEndpointTest_UnauthorizedRequest_0_2yY6A7/http_credentials"
--image_provisioner_backend="copy" --initialize_driver_logging="true" --isolation="posix/cpu,posix/mem"
--launcher_dir="/mesos/mesos-0.29.0/_build/src" --logbufsecs="0" --logging_level="INFO" --oversubscribed_resources_interval="15secs"
--perf_duration="10secs" --perf_interval="1mins" --qos_correction_interval_min="0ns" --quiet="false"
--recover="reconnect" --recovery_timeout="15mins" --registration_backoff_factor="10ms" --resources="cpus:2;mem:1024;disk:1024;ports:[31000-32000]"
--revocable_cpu_low_priority="true" --sandbox_directory="/mnt/mesos/sandbox" --strict="true"
--switch_user="true" --systemd_enable_support="true" --systemd_runtime_directory="/run/systemd/system"
--version="false" --work_dir="/tmp/Endpoint_SlaveEndpointTest_UnauthorizedRequest_0_2yY6A7"
I0516 02:36:30.018043 25266 credentials.hpp:86] Loading credential for authentication from
'/tmp/Endpoint_SlaveEndpointTest_UnauthorizedRequest_0_2yY6A7/credential'
I0516 02:36:30.018345 25266 slave.cpp:341] Agent using credential for: test-principal
I0516 02:36:30.018400 25266 credentials.hpp:37] Loading credentials for authentication from
'/tmp/Endpoint_SlaveEndpointTest_UnauthorizedRequest_0_2yY6A7/http_credentials'
I0516 02:36:30.018851 25266 slave.cpp:393] Using default 'basic' HTTP authenticator
I0516 02:36:30.019258 25266 resources.cpp:572] Parsing resources as JSON failed: cpus:2;mem:1024;disk:1024;ports:[31000-32000]
Trying semicolon-delimited string format instead
I0516 02:36:30.019907 25266 slave.cpp:592] Agent resources: cpus(*):2; mem(*):1024; disk(*):1024;
ports(*):[31000-32000]
I0516 02:36:30.019985 25266 slave.cpp:600] Agent attributes: [  ]
I0516 02:36:30.019999 25266 slave.cpp:605] Agent hostname: 0d02e1a33a2d
I0516 02:36:30.021646 25275 state.cpp:57] Recovering state from '/tmp/Endpoint_SlaveEndpointTest_UnauthorizedRequest_0_2yY6A7/meta'
I0516 02:36:30.023134 25266 process.cpp:3247] Handling HTTP event for process 'slave(495)'
with path: '/slave(495)/monitor/statistics'
I0516 02:36:30.023623 25272 status_update_manager.cpp:200] Recovering status update manager
I0516 02:36:30.023756 25272 containerizer.cpp:444] Recovering containerizer
I0516 02:36:30.024202 25276 http.cpp:880] Authorizing principal 'test-principal' to GET the
'/monitor/statistics' endpoint
I0516 02:36:30.025444 25266 provisioner.cpp:245] Provisioner recovery complete
I0516 02:36:30.025859 25263 slave.cpp:4818] Finished recovery
I0516 02:36:30.026530 25263 slave.cpp:4990] Querying resource estimator for oversubscribable
resources
I0516 02:36:30.026759 25275 slave.cpp:5004] Received oversubscribable resources  from the
resource estimator
I0516 02:36:30.027046 25272 slave.cpp:818] Agent terminating
[       OK ] Endpoint/SlaveEndpointTest.UnauthorizedRequest/0 (21 ms)
[ RUN      ] Endpoint/SlaveEndpointTest.UnauthorizedRequest/1
I0516 02:36:30.035379 25243 containerizer.cpp:178] Using isolation: posix/cpu,posix/mem,filesystem/posix,network/cni
W0516 02:36:30.036221 25243 backend.cpp:66] Failed to create 'bind' backend: BindBackend requires
root privileges
I0516 02:36:30.038924 25269 slave.cpp:203] Agent started on 496)@172.17.0.3:59343
I0516 02:36:30.039089 25269 slave.cpp:204] Flags at startup: --acls="" --appc_simple_discovery_uri_prefix="http://"
--appc_store_dir="/tmp/mesos/store/appc" --authenticate_http="true" --authenticatee="crammd5"
--authorizer="local" --cgroups_cpu_enable_pids_and_tids_count="false" --cgroups_enable_cfs="false"
--cgroups_hierarchy="/sys/fs/cgroup" --cgroups_limit_swap="false" --cgroups_root="mesos" --container_disk_watch_interval="15secs"
--containerizers="mesos" --credential="/tmp/Endpoint_SlaveEndpointTest_UnauthorizedRequest_1_wFSDPO/credential"
--default_role="*" --disk_watch_interval="1mins" --docker="docker" --docker_kill_orphans="true"
--docker_registry="https://registry-1.docker.io" --docker_remove_delay="6hrs" --docker_socket="/var/run/docker.sock"
--docker_stop_timeout="0ns" --docker_store_dir="/tmp/mesos/store/docker" --docker_volume_checkpoint_dir="/var/run/mesos/isolators/docker/volume"
--enforce_container_disk_quota="false" --executor_registration_timeout="1mins" --executor_shutdown_grace_period="5secs"
--fetcher_cache_dir="/tmp/Endpoint_SlaveEndpointTest_UnauthorizedRequest_1_wFSDPO/fetch" --fetcher_cache_size="2GB"
--frameworks_home="" --gc_delay="1weeks" --gc_disk_headroom="0.1" --hadoop_home="" --help="false"
--hostname_lookup="true" --http_authenticators="basic" --http_command_executor="false" --http_credentials="/tmp/Endpoint_SlaveEndpointTest_UnauthorizedRequest_1_wFSDPO/http_credentials"
--image_provisioner_backend="copy" --initialize_driver_logging="true" --isolation="posix/cpu,posix/mem"
--launcher_dir="/mesos/mesos-0.29.0/_build/src" --logbufsecs="0" --logging_level="INFO" --oversubscribed_resources_interval="15secs"
--perf_duration="10secs" --perf_interval="1mins" --qos_correction_interval_min="0ns" --quiet="false"
--recover="reconnect" --recovery_timeout="15mins" --registration_backoff_factor="10ms" --resources="cpus:2;mem:1024;disk:1024;ports:[31000-32000]"
--revocable_cpu_low_priority="true" --sandbox_directory="/mnt/mesos/sandbox" --strict="true"
--switch_user="true" --systemd_enable_support="true" --systemd_runtime_directory="/run/systemd/system"
--version="false" --work_dir="/tmp/Endpoint_SlaveEndpointTest_UnauthorizedRequest_1_wFSDPO"
I0516 02:36:30.040009 25269 credentials.hpp:86] Loading credential for authentication from
'/tmp/Endpoint_SlaveEndpointTest_UnauthorizedRequest_1_wFSDPO/credential'
I0516 02:36:30.040313 25269 slave.cpp:341] Agent using credential for: test-principal
I0516 02:36:30.040345 25269 credentials.hpp:37] Loading credentials for authentication from
'/tmp/Endpoint_SlaveEndpointTest_UnauthorizedRequest_1_wFSDPO/http_credentials'
I0516 02:36:30.040660 25269 slave.cpp:393] Using default 'basic' HTTP authenticator
I0516 02:36:30.041810 25269 resources.cpp:572] Parsing resources as JSON failed: cpus:2;mem:1024;disk:1024;ports:[31000-32000]
Trying semicolon-delimited string format instead
I0516 02:36:30.042403 25269 slave.cpp:592] Agent resources: cpus(*):2; mem(*):1024; disk(*):1024;
ports(*):[31000-32000]
I0516 02:36:30.042486 25269 slave.cpp:600] Agent attributes: [  ]
I0516 02:36:30.042505 25269 slave.cpp:605] Agent hostname: 0d02e1a33a2d
I0516 02:36:30.043922 25267 state.cpp:57] Recovering state from '/tmp/Endpoint_SlaveEndpointTest_UnauthorizedRequest_1_wFSDPO/meta'
I0516 02:36:30.043987 25269 process.cpp:3247] Handling HTTP event for process 'slave(496)'
with path: '/slave(496)/monitor/statistics.json'
I0516 02:36:30.044701 25263 status_update_manager.cpp:200] Recovering status update manager
I0516 02:36:30.044898 25272 containerizer.cpp:444] Recovering containerizer
I0516 02:36:30.045310 25261 http.cpp:880] Authorizing principal 'test-principal' to GET the
'/monitor/statistics.json' endpoint
I0516 02:36:30.046604 25272 provisioner.cpp:245] Provisioner recovery complete
I0516 02:36:30.047128 25267 slave.cpp:4818] Finished recovery
I0516 02:36:30.047996 25267 slave.cpp:4990] Querying resource estimator for oversubscribable
resources
I0516 02:36:30.048352 25261 slave.cpp:5004] Received oversubscribable resources  from the
resource estimator
I0516 02:36:30.048431 25261 slave.cpp:818] Agent terminating
[       OK ] Endpoint/SlaveEndpointTest.UnauthorizedRequest/1 (21 ms)
[ RUN      ] Endpoint/SlaveEndpointTest.UnauthorizedRequest/2
I0516 02:36:30.058302 25243 containerizer.cpp:178] Using isolation: posix/cpu,posix/mem,filesystem/posix,network/cni
W0516 02:36:30.059262 25243 backend.cpp:66] Failed to create 'bind' backend: BindBackend requires
root privileges
I0516 02:36:30.062516 25273 slave.cpp:203] Agent started on 497)@172.17.0.3:59343
I0516 02:36:30.062564 25273 slave.cpp:204] Flags at startup: --acls="" --appc_simple_discovery_uri_prefix="http://"
--appc_store_dir="/tmp/mesos/store/appc" --authenticate_http="true" --authenticatee="crammd5"
--authorizer="local" --cgroups_cpu_enable_pids_and_tids_count="false" --cgroups_enable_cfs="false"
--cgroups_hierarchy="/sys/fs/cgroup" --cgroups_limit_swap="false" --cgroups_root="mesos" --container_disk_watch_interval="15secs"
--containerizers="mesos" --credential="/tmp/Endpoint_SlaveEndpointTest_UnauthorizedRequest_2_wBQRew/credential"
--default_role="*" --disk_watch_interval="1mins" --docker="docker" --docker_kill_orphans="true"
--docker_registry="https://registry-1.docker.io" --docker_remove_delay="6hrs" --docker_socket="/var/run/docker.sock"
--docker_stop_timeout="0ns" --docker_store_dir="/tmp/mesos/store/docker" --docker_volume_checkpoint_dir="/var/run/mesos/isolators/docker/volume"
--enforce_container_disk_quota="false" --executor_registration_timeout="1mins" --executor_shutdown_grace_period="5secs"
--fetcher_cache_dir="/tmp/Endpoint_SlaveEndpointTest_UnauthorizedRequest_2_wBQRew/fetch" --fetcher_cache_size="2GB"
--frameworks_home="" --gc_delay="1weeks" --gc_disk_headroom="0.1" --hadoop_home="" --help="false"
--hostname_lookup="true" --http_authenticators="basic" --http_command_executor="false" --http_credentials="/tmp/Endpoint_SlaveEndpointTest_UnauthorizedRequest_2_wBQRew/http_credentials"
--image_provisioner_backend="copy" --initialize_driver_logging="true" --isolation="posix/cpu,posix/mem"
--launcher_dir="/mesos/mesos-0.29.0/_build/src" --logbufsecs="0" --logging_level="INFO" --oversubscribed_resources_interval="15secs"
--perf_duration="10secs" --perf_interval="1mins" --qos_correction_interval_min="0ns" --quiet="false"
--recover="reconnect" --recovery_timeout="15mins" --registration_backoff_factor="10ms" --resources="cpus:2;mem:1024;disk:1024;ports:[31000-32000]"
--revocable_cpu_low_priority="true" --sandbox_directory="/mnt/mesos/sandbox" --strict="true"
--switch_user="true" --systemd_enable_support="true" --systemd_runtime_directory="/run/systemd/system"
--version="false" --work_dir="/tmp/Endpoint_SlaveEndpointTest_UnauthorizedRequest_2_wBQRew"
I0516 02:36:30.063141 25273 credentials.hpp:86] Loading credential for authentication from
'/tmp/Endpoint_SlaveEndpointTest_UnauthorizedRequest_2_wBQRew/credential'
I0516 02:36:30.063380 25273 slave.cpp:341] Agent using credential for: test-principal
I0516 02:36:30.063472 25273 credentials.hpp:37] Loading credentials for authentication from
'/tmp/Endpoint_SlaveEndpointTest_UnauthorizedRequest_2_wBQRew/http_credentials'
I0516 02:36:30.063936 25273 slave.cpp:393] Using default 'basic' HTTP authenticator
I0516 02:36:30.064244 25273 resources.cpp:572] Parsing resources as JSON failed: cpus:2;mem:1024;disk:1024;ports:[31000-32000]
Trying semicolon-delimited string format instead
I0516 02:36:30.064693 25273 slave.cpp:592] Agent resources: cpus(*):2; mem(*):1024; disk(*):1024;
ports(*):[31000-32000]
I0516 02:36:30.064750 25273 slave.cpp:600] Agent attributes: [  ]
I0516 02:36:30.064761 25273 slave.cpp:605] Agent hostname: 0d02e1a33a2d
I0516 02:36:30.066126 25269 state.cpp:57] Recovering state from '/tmp/Endpoint_SlaveEndpointTest_UnauthorizedRequest_2_wBQRew/meta'
I0516 02:36:30.066200 25273 process.cpp:3247] Handling HTTP event for process 'slave(497)'
with path: '/slave(497)/flags'
I0516 02:36:30.066603 25272 status_update_manager.cpp:200] Recovering status update manager
I0516 02:36:30.066840 25275 containerizer.cpp:444] Recovering containerizer
I0516 02:36:30.067266 25264 http.cpp:188] HTTP GET for /slave(497)/flags from 172.17.0.3:59286
I0516 02:36:30.067541 25264 http.cpp:880] Authorizing principal 'test-principal' to GET the
'/flags' endpoint
I0516 02:36:30.068938 25275 provisioner.cpp:245] Provisioner recovery complete
I0516 02:36:30.070899 25264 slave.cpp:4818] Finished recovery
I0516 02:36:30.072609 25264 slave.cpp:4990] Querying resource estimator for oversubscribable
resources
I0516 02:36:30.072850 25261 slave.cpp:5004] Received oversubscribable resources  from the
resource estimator
I0516 02:36:30.075983 25272 slave.cpp:818] Agent terminating
[       OK ] Endpoint/SlaveEndpointTest.UnauthorizedRequest/2 (78 ms)
[ RUN      ] Endpoint/SlaveEndpointTest.NoAuthorizer/0
I0516 02:36:30.138375 25243 containerizer.cpp:178] Using isolation: posix/cpu,posix/mem,filesystem/posix,network/cni
W0516 02:36:30.139370 25243 backend.cpp:66] Failed to create 'bind' backend: BindBackend requires
root privileges
I0516 02:36:30.142365 25243 cluster.cpp:435] Creating default 'local' authorizer
I0516 02:36:30.145867 25268 slave.cpp:203] Agent started on 498)@172.17.0.3:59343
I0516 02:36:30.146034 25268 slave.cpp:204] Flags at startup: --acls="" --appc_simple_discovery_uri_prefix="http://"
--appc_store_dir="/tmp/mesos/store/appc" --authenticate_http="true" --authenticatee="crammd5"
--authorizer="local" --cgroups_cpu_enable_pids_and_tids_count="false" --cgroups_enable_cfs="false"
--cgroups_hierarchy="/sys/fs/cgroup" --cgroups_limit_swap="false" --cgroups_root="mesos" --container_disk_watch_interval="15secs"
--containerizers="mesos" --credential="/tmp/Endpoint_SlaveEndpointTest_NoAuthorizer_0_4iFQ7d/credential"
--default_role="*" --disk_watch_interval="1mins" --docker="docker" --docker_kill_orphans="true"
--docker_registry="https://registry-1.docker.io" --docker_remove_delay="6hrs" --docker_socket="/var/run/docker.sock"
--docker_stop_timeout="0ns" --docker_store_dir="/tmp/mesos/store/docker" --docker_volume_checkpoint_dir="/var/run/mesos/isolators/docker/volume"
--enforce_container_disk_quota="false" --executor_registration_timeout="1mins" --executor_shutdown_grace_period="5secs"
--fetcher_cache_dir="/tmp/Endpoint_SlaveEndpointTest_NoAuthorizer_0_4iFQ7d/fetch" --fetcher_cache_size="2GB"
--frameworks_home="" --gc_delay="1weeks" --gc_disk_headroom="0.1" --hadoop_home="" --help="false"
--hostname_lookup="true" --http_authenticators="basic" --http_command_executor="false" --http_credentials="/tmp/Endpoint_SlaveEndpointTest_NoAuthorizer_0_4iFQ7d/http_credentials"
--image_provisioner_backend="copy" --initialize_driver_logging="true" --isolation="posix/cpu,posix/mem"
--launcher_dir="/mesos/mesos-0.29.0/_build/src" --logbufsecs="0" --logging_level="INFO" --oversubscribed_resources_interval="15secs"
--perf_duration="10secs" --perf_interval="1mins" --qos_correction_interval_min="0ns" --quiet="false"
--recover="reconnect" --recovery_timeout="15mins" --registration_backoff_factor="10ms" --resources="cpus:2;mem:1024;disk:1024;ports:[31000-32000]"
--revocable_cpu_low_priority="true" --sandbox_directory="/mnt/mesos/sandbox" --strict="true"
--switch_user="true" --systemd_enable_support="true" --systemd_runtime_directory="/run/systemd/system"
--version="false" --work_dir="/tmp/Endpoint_SlaveEndpointTest_NoAuthorizer_0_4iFQ7d"
I0516 02:36:30.146831 25268 credentials.hpp:86] Loading credential for authentication from
'/tmp/Endpoint_SlaveEndpointTest_NoAuthorizer_0_4iFQ7d/credential'
I0516 02:36:30.147151 25268 slave.cpp:341] Agent using credential for: test-principal
I0516 02:36:30.147267 25268 credentials.hpp:37] Loading credentials for authentication from
'/tmp/Endpoint_SlaveEndpointTest_NoAuthorizer_0_4iFQ7d/http_credentials'
I0516 02:36:30.147639 25268 slave.cpp:393] Using default 'basic' HTTP authenticator
I0516 02:36:30.148102 25268 resources.cpp:572] Parsing resources as JSON failed: cpus:2;mem:1024;disk:1024;ports:[31000-32000]
Trying semicolon-delimited string format instead
I0516 02:36:30.148969 25268 slave.cpp:592] Agent resources: cpus(*):2; mem(*):1024; disk(*):1024;
ports(*):[31000-32000]
I0516 02:36:30.149235 25268 slave.cpp:600] Agent attributes: [  ]
I0516 02:36:30.149358 25268 slave.cpp:605] Agent hostname: 0d02e1a33a2d
I0516 02:36:30.154079 25269 state.cpp:57] Recovering state from '/tmp/Endpoint_SlaveEndpointTest_NoAuthorizer_0_4iFQ7d/meta'
I0516 02:36:30.154433 25268 status_update_manager.cpp:200] Recovering status update manager
I0516 02:36:30.154693 25270 containerizer.cpp:444] Recovering containerizer
I0516 02:36:30.156982 25271 process.cpp:3247] Handling HTTP event for process 'slave(498)'
with path: '/slave(498)/monitor/statistics'
I0516 02:36:30.157810 25266 provisioner.cpp:245] Provisioner recovery complete
I0516 02:36:30.157956 25269 http.cpp:880] Authorizing principal 'test-principal' to GET the
'/monitor/statistics' endpoint
I0516 02:36:30.158696 25269 slave.cpp:4818] Finished recovery
I0516 02:36:30.159324 25269 slave.cpp:4990] Querying resource estimator for oversubscribable
resources
I0516 02:36:30.160280 25269 slave.cpp:5004] Received oversubscribable resources  from the
resource estimator
I0516 02:36:30.162979 25269 slave.cpp:818] Agent terminating
[       OK ] Endpoint/SlaveEndpointTest.NoAuthorizer/0 (37 ms)
[ RUN      ] Endpoint/SlaveEndpointTest.NoAuthorizer/1
I0516 02:36:30.175531 25243 containerizer.cpp:178] Using isolation: posix/cpu,posix/mem,filesystem/posix,network/cni
W0516 02:36:30.176784 25243 backend.cpp:66] Failed to create 'bind' backend: BindBackend requires
root privileges
I0516 02:36:30.178645 25243 cluster.cpp:435] Creating default 'local' authorizer
I0516 02:36:30.180873 25271 slave.cpp:203] Agent started on 499)@172.17.0.3:59343
I0516 02:36:30.180925 25271 slave.cpp:204] Flags at startup: --acls="" --appc_simple_discovery_uri_prefix="http://"
--appc_store_dir="/tmp/mesos/store/appc" --authenticate_http="true" --authenticatee="crammd5"
--authorizer="local" --cgroups_cpu_enable_pids_and_tids_count="false" --cgroups_enable_cfs="false"
--cgroups_hierarchy="/sys/fs/cgroup" --cgroups_limit_swap="false" --cgroups_root="mesos" --container_disk_watch_interval="15secs"
--containerizers="mesos" --credential="/tmp/Endpoint_SlaveEndpointTest_NoAuthorizer_1_sDm3qW/credential"
--default_role="*" --disk_watch_interval="1mins" --docker="docker" --docker_kill_orphans="true"
--docker_registry="https://registry-1.docker.io" --docker_remove_delay="6hrs" --docker_socket="/var/run/docker.sock"
--docker_stop_timeout="0ns" --docker_store_dir="/tmp/mesos/store/docker" --docker_volume_checkpoint_dir="/var/run/mesos/isolators/docker/volume"
--enforce_container_disk_quota="false" --executor_registration_timeout="1mins" --executor_shutdown_grace_period="5secs"
--fetcher_cache_dir="/tmp/Endpoint_SlaveEndpointTest_NoAuthorizer_1_sDm3qW/fetch" --fetcher_cache_size="2GB"
--frameworks_home="" --gc_delay="1weeks" --gc_disk_headroom="0.1" --hadoop_home="" --help="false"
--hostname_lookup="true" --http_authenticators="basic" --http_command_executor="false" --http_credentials="/tmp/Endpoint_SlaveEndpointTest_NoAuthorizer_1_sDm3qW/http_credentials"
--image_provisioner_backend="copy" --initialize_driver_logging="true" --isolation="posix/cpu,posix/mem"
--launcher_dir="/mesos/mesos-0.29.0/_build/src" --logbufsecs="0" --logging_level="INFO" --oversubscribed_resources_interval="15secs"
--perf_duration="10secs" --perf_interval="1mins" --qos_correction_interval_min="0ns" --quiet="false"
--recover="reconnect" --recovery_timeout="15mins" --registration_backoff_factor="10ms" --resources="cpus:2;mem:1024;disk:1024;ports:[31000-32000]"
--revocable_cpu_low_priority="true" --sandbox_directory="/mnt/mesos/sandbox" --strict="true"
--switch_user="true" --systemd_enable_support="true" --systemd_runtime_directory="/run/systemd/system"
--version="false" --work_dir="/tmp/Endpoint_SlaveEndpointTest_NoAuthorizer_1_sDm3qW"
I0516 02:36:30.181673 25271 credentials.hpp:86] Loading credential for authentication from
'/tmp/Endpoint_SlaveEndpointTest_NoAuthorizer_1_sDm3qW/credential'
I0516 02:36:30.181982 25271 slave.cpp:341] Agent using credential for: test-principal
I0516 02:36:30.182078 25271 credentials.hpp:37] Loading credentials for authentication from
'/tmp/Endpoint_SlaveEndpointTest_NoAuthorizer_1_sDm3qW/http_credentials'
I0516 02:36:30.182431 25271 slave.cpp:393] Using default 'basic' HTTP authenticator
I0516 02:36:30.182765 25271 resources.cpp:572] Parsing resources as JSON failed: cpus:2;mem:1024;disk:1024;ports:[31000-32000]
Trying semicolon-delimited string format instead
I0516 02:36:30.183735 25271 slave.cpp:592] Agent resources: cpus(*):2; mem(*):1024; disk(*):1024;
ports(*):[31000-32000]
I0516 02:36:30.183895 25271 slave.cpp:600] Agent attributes: [  ]
I0516 02:36:30.183995 25271 slave.cpp:605] Agent hostname: 0d02e1a33a2d
I0516 02:36:30.186316 25266 state.cpp:57] Recovering state from '/tmp/Endpoint_SlaveEndpointTest_NoAuthorizer_1_sDm3qW/meta'
I0516 02:36:30.186607 25271 process.cpp:3247] Handling HTTP event for process 'slave(499)'
with path: '/slave(499)/monitor/statistics.json'
I0516 02:36:30.187362 25265 status_update_manager.cpp:200] Recovering status update manager
I0516 02:36:30.187522 25265 containerizer.cpp:444] Recovering containerizer
I0516 02:36:30.188329 25275 http.cpp:880] Authorizing principal 'test-principal' to GET the
'/monitor/statistics.json' endpoint
I0516 02:36:30.189052 25271 provisioner.cpp:245] Provisioner recovery complete
I0516 02:36:30.190680 25275 slave.cpp:4818] Finished recovery
I0516 02:36:30.191660 25275 slave.cpp:4990] Querying resource estimator for oversubscribable
resources
I0516 02:36:30.192174 25275 slave.cpp:5004] Received oversubscribable resources  from the
resource estimator
I0516 02:36:30.200036 25243 slave.cpp:818] Agent terminating
[       OK ] Endpoint/SlaveEndpointTest.NoAuthorizer/1 (53 ms)
[ RUN      ] Endpoint/SlaveEndpointTest.NoAuthorizer/2
I0516 02:36:30.236325 25243 containerizer.cpp:178] Using isolation: posix/cpu,posix/mem,filesystem/posix,network/cni
W0516 02:36:30.238426 25243 backend.cpp:66] Failed to create 'bind' backend: BindBackend requires
root privileges
I0516 02:36:30.241478 25243 cluster.cpp:435] Creating default 'local' authorizer
I0516 02:36:30.244235 25269 slave.cpp:203] Agent started on 500)@172.17.0.3:59343
I0516 02:36:30.244768 25269 slave.cpp:204] Flags at startup: --acls="" --appc_simple_discovery_uri_prefix="http://"
--appc_store_dir="/tmp/mesos/store/appc" --authenticate_http="true" --authenticatee="crammd5"
--authorizer="local" --cgroups_cpu_enable_pids_and_tids_count="false" --cgroups_enable_cfs="false"
--cgroups_hierarchy="/sys/fs/cgroup" --cgroups_limit_swap="false" --cgroups_root="mesos" --container_disk_watch_interval="15secs"
--containerizers="mesos" --credential="/tmp/Endpoint_SlaveEndpointTest_NoAuthorizer_2_M1x06E/credential"
--default_role="*" --disk_watch_interval="1mins" --docker="docker" --docker_kill_orphans="true"
--docker_registry="https://registry-1.docker.io" --docker_remove_delay="6hrs" --docker_socket="/var/run/docker.sock"
--docker_stop_timeout="0ns" --docker_store_dir="/tmp/mesos/store/docker" --docker_volume_checkpoint_dir="/var/run/mesos/isolators/docker/volume"
--enforce_container_disk_quota="false" --executor_registration_timeout="1mins" --executor_shutdown_grace_period="5secs"
--fetcher_cache_dir="/tmp/Endpoint_SlaveEndpointTest_NoAuthorizer_2_M1x06E/fetch" --fetcher_cache_size="2GB"
--frameworks_home="" --gc_delay="1weeks" --gc_disk_headroom="0.1" --hadoop_home="" --help="false"
--hostname_lookup="true" --http_authenticators="basic" --http_command_executor="false" --http_credentials="/tmp/Endpoint_SlaveEndpointTest_NoAuthorizer_2_M1x06E/http_credentials"
--image_provisioner_backend="copy" --initialize_driver_logging="true" --isolation="posix/cpu,posix/mem"
--launcher_dir="/mesos/mesos-0.29.0/_build/src" --logbufsecs="0" --logging_level="INFO" --oversubscribed_resources_interval="15secs"
--perf_duration="10secs" --perf_interval="1mins" --qos_correction_interval_min="0ns" --quiet="false"
--recover="reconnect" --recovery_timeout="15mins" --registration_backoff_factor="10ms" --resources="cpus:2;mem:1024;disk:1024;ports:[31000-32000]"
--revocable_cpu_low_priority="true" --sandbox_directory="/mnt/mesos/sandbox" --strict="true"
--switch_user="true" --systemd_enable_support="true" --systemd_runtime_directory="/run/systemd/system"
--version="false" --work_dir="/tmp/Endpoint_SlaveEndpointTest_NoAuthorizer_2_M1x06E"
I0516 02:36:30.245860 25269 credentials.hpp:86] Loading credential for authentication from
'/tmp/Endpoint_SlaveEndpointTest_NoAuthorizer_2_M1x06E/credential'
I0516 02:36:30.246366 25269 slave.cpp:341] Agent using credential for: test-principal
I0516 02:36:30.246721 25269 credentials.hpp:37] Loading credentials for authentication from
'/tmp/Endpoint_SlaveEndpointTest_NoAuthorizer_2_M1x06E/http_credentials'
I0516 02:36:30.247275 25269 slave.cpp:393] Using default 'basic' HTTP authenticator
I0516 02:36:30.248044 25269 resources.cpp:572] Parsing resources as JSON failed: cpus:2;mem:1024;disk:1024;ports:[31000-32000]
Trying semicolon-delimited string format instead
I0516 02:36:30.248803 25269 slave.cpp:592] Agent resources: cpus(*):2; mem(*):1024; disk(*):1024;
ports(*):[31000-32000]
I0516 02:36:30.249164 25269 slave.cpp:600] Agent attributes: [  ]
I0516 02:36:30.249325 25269 slave.cpp:605] Agent hostname: 0d02e1a33a2d
I0516 02:36:30.251268 25273 state.cpp:57] Recovering state from '/tmp/Endpoint_SlaveEndpointTest_NoAuthorizer_2_M1x06E/meta'
I0516 02:36:30.251391 25269 process.cpp:3247] Handling HTTP event for process 'slave(500)'
with path: '/slave(500)/flags'
I0516 02:36:30.252380 25262 status_update_manager.cpp:200] Recovering status update manager
I0516 02:36:30.252522 25262 containerizer.cpp:444] Recovering containerizer
I0516 02:36:30.253432 25269 http.cpp:188] HTTP GET for /slave(500)/flags from 172.17.0.3:59289
I0516 02:36:30.254047 25261 provisioner.cpp:245] Provisioner recovery complete
I0516 02:36:30.254293 25269 http.cpp:880] Authorizing principal 'test-principal' to GET the
'/flags' endpoint
I0516 02:36:30.258744 25269 slave.cpp:4818] Finished recovery
I0516 02:36:30.260901 25269 slave.cpp:4990] Querying resource estimator for oversubscribable
resources
I0516 02:36:30.261488 25269 slave.cpp:5004] Received oversubscribable resources  from the
resource estimator
I0516 02:36:30.263358 25275 slave.cpp:818] Agent terminating
[       OK ] Endpoint/SlaveEndpointTest.NoAuthorizer/2 (60 ms)
[----------] 9 tests from Endpoint/SlaveEndpointTest (369 ms total)

[----------] Global test environment tear-down
[==========] 1107 tests from 136 test cases ran. (429669 ms total)
[  PASSED  ] 1106 tests.
[  FAILED  ] 1 test, listed below:
[  FAILED  ] HealthCheckTest.HealthStatusChange

 1 FAILED TEST
  YOU HAVE 6 DISABLED TESTS

make[4]: *** [check-local] Error 1
make[4]: Leaving directory `/mesos/mesos-0.29.0/_build/src'
make[3]: *** [check-am] Error 2
make[3]: Leaving directory `/mesos/mesos-0.29.0/_build/src'
make[2]: *** [check] Error 2
make[2]: Leaving directory `/mesos/mesos-0.29.0/_build/src'
make[1]: *** [check-recursive] Error 1
make[1]: Leaving directory `/mesos/mesos-0.29.0/_build'
make: *** [distcheck] Error 1
+ docker rmi mesos-1463363495-17109
Untagged: mesos-1463363495-17109:latest
Deleted: b782393a2581ca7fb19708416dd7c8c812760800410d8ee624d7e3d6c0ebba55
Deleted: a0baacdeb52eea497c4dfdea2ba77fb6d4aee8c45575a1041bde7cfa589c347a
Deleted: ff14f4c67083d069919181229def53a006ee88901d7948b78f91f4be06e46932
Deleted: f520f855164f4b4863dcaebf5c801fdff12d0ba1c4ad60c79715ceed9f7aeca1
Deleted: 75bad2e71fea9346e5c58e05b73284620021721bf8f9963e1139e57c74407a64
Deleted: add99153ff9c40bbc38e65c9fff7dda4ab32c3e5cc3444ca9470643ba3201deb
Deleted: c9ad2bbd508e391901ba5095916cefa46bf53342fc0ed7773554af355fa33381
Deleted: 5360bbccedb71e2f01762e49221e9ebd4e7fd6e8831962873d414ae5da5551a6
Deleted: 857fdb92da5ef6869860810b88ecadbbd659258525a5348e861187fc67118360
Deleted: 3b4d8a88ef8609b4c7c83a68e5dffb40e8cb8b12452955ea6c6e4da82ca59be3
Deleted: 2ac19267c598f679a16d07f914434b9688a5d4197a9d996ce4d44683f400bb90
Deleted: 2831eb0d295319598714160066359a79bb6f8c1c31d61f289075cb921eb5a10c
Deleted: eb2f9cda4e7a04089bda3da8d0b867e3ac983e8856641a15a6cd193c0fb5e972
Deleted: 19e5409946ac01de1355567bac083e437ae42497c1f16e087d62675ed66ffe49
Deleted: 7f08e783cf6cb713fafa9f67f99f74f80a23e20c528f773412105506e60ee6ba
Deleted: c4a7cc499c7eb3370a970b4d0af05ced3432a58f033b6c37ee280142cb08f02c
Build step 'Execute shell' marked build as failure

Mime
View raw message