mesos-builds mailing list archives

Site index · List index
Message view « Date » · « Thread »
Top « Date » · « Thread »
From Apache Jenkins Server <jenk...@builds.apache.org>
Subject Build failed in Jenkins: mesos-reviewbot #12903
Date Fri, 06 May 2016 00:37:14 GMT
See <https://builds.apache.org/job/mesos-reviewbot/12903/>

------------------------------------------
[...truncated 1103 lines...]
config.status: creating src/python/native/setup.py
config.status: creating src/python/scheduler/setup.py
config.status: linking src/python/native_common/ext_modules.py to src/python/executor/ext_modules.py
config.status: linking src/python/native_common/ext_modules.py to src/python/scheduler/ext_modules.py
config.status: executing depfiles commands
config.status: executing libtool commands
=== configuring in 3rdparty/libprocess (<https://builds.apache.org/job/mesos-reviewbot/ws/mesos-0.29.0/_build/3rdparty/libprocess)>
configure: running /bin/bash ../../../3rdparty/libprocess/configure --disable-option-checking
'--prefix=<https://builds.apache.org/job/mesos-reviewbot/ws/mesos-0.29.0/_inst'>  '--disable-python-dependency-install'
'JAVA_HOME=/home/jenkins/tools/java/jdk1.6.0_20-64' '--enable-shared=no' '--with-pic' --cache-file=/dev/null
--srcdir=../../../3rdparty/libprocess
checking build system type... x86_64-unknown-linux-gnu
checking host system type... x86_64-unknown-linux-gnu
checking target system type... x86_64-unknown-linux-gnu
checking for a BSD-compatible install... /usr/bin/install -c
checking whether build environment is sane... yes
checking for a thread-safe mkdir -p... /bin/mkdir -p
checking for gawk... no
checking for mawk... mawk
checking whether make sets $(MAKE)... yes
checking whether make supports nested variables... yes
checking whether to enable maintainer-specific portions of Makefiles... yes
checking for style of include used by make... GNU
checking for gcc... gcc
checking whether the C compiler works... yes
checking for C compiler default output file name... a.out
checking for suffix of executables... 
checking whether we are cross compiling... no
checking for suffix of object files... o
checking whether we are using the GNU C compiler... yes
checking whether gcc accepts -g... yes
checking for gcc option to accept ISO C89... none needed
checking whether gcc understands -c and -o together... yes
checking dependency style of gcc... gcc3
checking for ar... ar
checking the archiver (ar) interface... ar
checking how to print strings... printf
checking for a sed that does not truncate output... /bin/sed
checking for grep that handles long lines and -e... /bin/grep
checking for egrep... /bin/grep -E
checking for fgrep... /bin/grep -F
checking for ld used by gcc... /usr/bin/ld
checking if the linker (/usr/bin/ld) is GNU ld... yes
checking for BSD- or MS-compatible name lister (nm)... /usr/bin/nm -B
checking the name lister (/usr/bin/nm -B) interface... BSD nm
checking whether ln -s works... yes
checking the maximum length of command line arguments... 3458764513820540925
checking whether the shell understands some XSI constructs... yes
checking whether the shell understands "+="... yes
checking how to convert x86_64-unknown-linux-gnu file names to x86_64-unknown-linux-gnu format...
func_convert_file_noop
checking how to convert x86_64-unknown-linux-gnu file names to toolchain format... func_convert_file_noop
checking for /usr/bin/ld option to reload object files... -r
checking for objdump... objdump
checking how to recognize dependent libraries... pass_all
checking for dlltool... no
checking how to associate runtime and link libraries... printf %s\n
checking for g++... g++
checking whether we are using the GNU C++ compiler... yes
checking whether g++ accepts -g... yes
checking dependency style of g++... gcc3
checking for archiver @FILE support... @
checking for strip... strip
checking for ranlib... ranlib
checking command to parse /usr/bin/nm -B output from gcc object... ok
checking for sysroot... no
checking for mt... mt
checking if mt is a manifest tool... no
checking how to run the C preprocessor... gcc -E
checking for ANSI C header files... yes
checking for sys/types.h... yes
checking for sys/stat.h... yes
checking for stdlib.h... yes
checking for string.h... yes
checking for memory.h... yes
checking for strings.h... yes
checking for inttypes.h... yes
checking for stdint.h... yes
checking for unistd.h... yes
checking for dlfcn.h... yes
checking for objdir... .libs
checking if gcc supports -fno-rtti -fno-exceptions... no
checking for gcc option to produce PIC... -fPIC -DPIC
checking if gcc PIC flag -fPIC -DPIC works... yes
checking if gcc static flag -static works... yes
checking if gcc supports -c -o file.o... yes
checking if gcc supports -c -o file.o... (cached) yes
checking whether the gcc linker (/usr/bin/ld -m elf_x86_64) supports shared libraries... yes
checking dynamic linker characteristics... GNU/Linux ld.so
checking how to hardcode library paths into programs... immediate
checking whether stripping libraries is possible... yes
checking if libtool supports shared libraries... yes
checking whether to build shared libraries... no
checking whether to build static libraries... yes
checking how to run the C++ preprocessor... g++ -E
checking for ld used by g++... /usr/bin/ld -m elf_x86_64
checking if the linker (/usr/bin/ld -m elf_x86_64) is GNU ld... yes
checking whether the g++ linker (/usr/bin/ld -m elf_x86_64) supports shared libraries... yes
checking for g++ option to produce PIC... -fPIC -DPIC
checking if g++ PIC flag -fPIC -DPIC works... yes
checking if g++ static flag -static works... yes
checking if g++ supports -c -o file.o... yes
checking if g++ supports -c -o file.o... (cached) yes
checking whether the g++ linker (/usr/bin/ld -m elf_x86_64) supports shared libraries... yes
checking dynamic linker characteristics... (cached) GNU/Linux ld.so
checking how to hardcode library paths into programs... immediate
configure: creating ./config.lt
config.lt: creating libtool
checking apr_pools.h usability... yes
checking apr_pools.h presence... yes
checking for apr_pools.h... yes
checking for apr_initialize in -lapr-1... yes
checking svn_version.h usability... yes
checking svn_version.h presence... yes
checking for svn_version.h... yes
checking for svn_stringbuf_create_ensure in -lsvn_subr-1... yes
checking svn_delta.h usability... yes
checking svn_delta.h presence... yes
checking for svn_delta.h... yes
checking for svn_txdelta in -lsvn_delta-1... yes
checking for curl_global_init in -lcurl... yes
checking whether we are using the GNU C++ compiler... (cached) yes
checking whether g++ accepts -g... (cached) yes
checking dependency style of g++... (cached) gcc3
checking whether we are using the GNU C compiler... (cached) yes
checking whether gcc accepts -g... (cached) yes
checking for gcc option to accept ISO C89... (cached) none needed
checking whether gcc understands -c and -o together... (cached) yes
checking dependency style of gcc... (cached) gcc3
checking for C++ compiler vendor... gnu
checking for C++ compiler version... 4.8.4
checking for C++ compiler vendor... (cached) gnu
configure: Setting up CXXFLAGS for g++ version >= 4.8
checking whether g++ supports C++11 features by default... no
checking whether g++ supports C++11 features with -std=c++11... yes
checking if compiler needs -Werror to reject unknown flags... no
checking for the pthreads library -lpthreads... no
checking whether pthreads work without any flags... no
checking whether pthreads work with -Kthread... no
checking whether pthreads work with -kthread... no
checking for the pthreads library -llthread... no
checking whether pthreads work with -pthread... yes
checking for joinable pthread attribute... PTHREAD_CREATE_JOINABLE
checking if more special flags are required for pthreads... no
checking for PTHREAD_PRIO_INHERIT... yes
checking for deflate, gzread, gzwrite, inflate in -lz... yes
checking for dlopen in -ldl... yes
checking that generated files are newer than configure... done
configure: creating ./config.status
config.status: creating Makefile
config.status: creating include/Makefile
config.status: creating 3rdparty/Makefile
config.status: creating 3rdparty/gmock_sources.cc
config.status: executing depfiles commands
config.status: executing libtool commands
=== configuring in 3rdparty/stout (<https://builds.apache.org/job/mesos-reviewbot/ws/mesos-0.29.0/_build/3rdparty/libprocess/3rdparty/stout)>
configure: running /bin/bash ../../../../../3rdparty/libprocess/3rdparty/stout/configure --disable-option-checking
'--prefix=<https://builds.apache.org/job/mesos-reviewbot/ws/mesos-0.29.0/_inst'>  '--disable-python-dependency-install'
'JAVA_HOME=/home/jenkins/tools/java/jdk1.6.0_20-64' '--enable-shared=no' '--with-pic' --cache-file=/dev/null
--srcdir=../../../../../3rdparty/libprocess/3rdparty/stout
checking for a BSD-compatible install... /usr/bin/install -c
checking whether build environment is sane... yes
checking for a thread-safe mkdir -p... /bin/mkdir -p
checking for gawk... no
checking for mawk... mawk
checking whether make sets $(MAKE)... yes
checking whether make supports nested variables... yes
checking that generated files are newer than configure... done
configure: creating ./config.status
config.status: creating Makefile
config.status: creating include/Makefile
make[1]: Entering directory `<https://builds.apache.org/job/mesos-reviewbot/ws/mesos-0.29.0/_build'>
Making all in .
make[2]: Entering directory `<https://builds.apache.org/job/mesos-reviewbot/ws/mesos-0.29.0/_build'>
make[2]: Nothing to be done for `all-am'.
make[2]: Leaving directory `<https://builds.apache.org/job/mesos-reviewbot/ws/mesos-0.29.0/_build'>
Making all in 3rdparty
make[2]: Entering directory `<https://builds.apache.org/job/mesos-reviewbot/ws/mesos-0.29.0/_build/3rdparty'>
make  all-recursive
make[3]: Entering directory `<https://builds.apache.org/job/mesos-reviewbot/ws/mesos-0.29.0/_build/3rdparty'>
Making all in libprocess
make[4]: Entering directory `<https://builds.apache.org/job/mesos-reviewbot/ws/mesos-0.29.0/_build/3rdparty/libprocess'>
Making all in 3rdparty
make[5]: Entering directory `<https://builds.apache.org/job/mesos-reviewbot/ws/mesos-0.29.0/_build/3rdparty/libprocess/3rdparty'>
gzip -d -c ../../../../3rdparty/libprocess/3rdparty/http-parser-2.6.2.tar.gz | tar xf -
gzip -d -c ../../../../3rdparty/libprocess/3rdparty/gmock-1.7.0.tar.gz | tar xf -
test ! -e ../../../../3rdparty/libprocess/3rdparty/http-parser-2.6.2.patch || patch -d http-parser-2.6.2
-p1 <../../../../3rdparty/libprocess/3rdparty/http-parser-2.6.2.patch
patching file http_parser.h
touch http-parser-2.6.2-stamp
test ! -e ../../../../3rdparty/libprocess/3rdparty/gmock-1.7.0.patch || patch -d gmock-1.7.0
-p1 <../../../../3rdparty/libprocess/3rdparty/gmock-1.7.0.patch
touch gmock-1.7.0-stamp
cd .. && /bin/bash ./config.status 3rdparty/gmock_sources.cc
config.status: creating 3rdparty/gmock_sources.cc
make  all-recursive
make[6]: Entering directory `<https://builds.apache.org/job/mesos-reviewbot/ws/mesos-0.29.0/_build/3rdparty/libprocess/3rdparty'>
Making all in stout
make[7]: Entering directory `<https://builds.apache.org/job/mesos-reviewbot/ws/mesos-0.29.0/_build/3rdparty/libprocess/3rdparty/stout'>
Making all in .
make[8]: Entering directory `<https://builds.apache.org/job/mesos-reviewbot/ws/mesos-0.29.0/_build/3rdparty/libprocess/3rdparty/stout'>
make[8]: Nothing to be done for `all-am'.
make[8]: Leaving directory `<https://builds.apache.org/job/mesos-reviewbot/ws/mesos-0.29.0/_build/3rdparty/libprocess/3rdparty/stout'>
Making all in include
make[8]: Entering directory `<https://builds.apache.org/job/mesos-reviewbot/ws/mesos-0.29.0/_build/3rdparty/libprocess/3rdparty/stout/include'>
make[8]: Nothing to be done for `all'.
make[8]: Leaving directory `<https://builds.apache.org/job/mesos-reviewbot/ws/mesos-0.29.0/_build/3rdparty/libprocess/3rdparty/stout/include'>
make[7]: Leaving directory `<https://builds.apache.org/job/mesos-reviewbot/ws/mesos-0.29.0/_build/3rdparty/libprocess/3rdparty/stout'>
make[7]: Entering directory `<https://builds.apache.org/job/mesos-reviewbot/ws/mesos-0.29.0/_build/3rdparty/libprocess/3rdparty'>
/bin/bash ../libtool  --tag=CC   --mode=compile gcc -DPACKAGE_NAME=\"libprocess\" -DPACKAGE_TARNAME=\"libprocess\"
-DPACKAGE_VERSION=\"0.0.1\" -DPACKAGE_STRING=\"libprocess\ 0.0.1\" -DPACKAGE_BUGREPORT=\"\"
-DPACKAGE_URL=\"\" -DPACKAGE=\"libprocess\" -DVERSION=\"0.0.1\" -DSTDC_HEADERS=1 -DHAVE_SYS_TYPES_H=1
-DHAVE_SYS_STAT_H=1 -DHAVE_STDLIB_H=1 -DHAVE_STRING_H=1 -DHAVE_MEMORY_H=1 -DHAVE_STRINGS_H=1
-DHAVE_INTTYPES_H=1 -DHAVE_STDINT_H=1 -DHAVE_UNISTD_H=1 -DHAVE_DLFCN_H=1 -DLT_OBJDIR=\".libs/\"
-DHAVE_APR_POOLS_H=1 -DHAVE_LIBAPR_1=1 -DHAVE_SVN_VERSION_H=1 -DHAVE_LIBSVN_SUBR_1=1 -DHAVE_SVN_DELTA_H=1
-DHAVE_LIBSVN_DELTA_1=1 -DHAVE_LIBCURL=1 -DHAVE_CXX11=1 -DHAVE_PTHREAD_PRIO_INHERIT=1 -DHAVE_PTHREAD=1
-DHAVE_LIBZ=1 -DHAVE_LIBDL=1 -I. -I../../../../3rdparty/libprocess/3rdparty  -Ihttp-parser-2.6.2
-DHTTP_PARSER_STRICT=0 -I/usr/include/subversion-1 -I/usr/include/apr-1 -I/usr/include/apr-1.0
  -g1 -O0 -Wno-unused-local-typedefs -MT libry_http_parser_la-http_parser.lo -MD -MP -MF .deps/libry_http_parser_la-http_parser.Tpo
-c -o libry_http_parser_la-http_parser.lo `test -f 'http-parser-2.6.2/http_parser.c' || echo
'../../../../3rdparty/libprocess/3rdparty/'`http-parser-2.6.2/http_parser.c
gzip -d -c ../../../../3rdparty/libprocess/3rdparty/picojson-1.3.0.tar.gz | tar xf -
gzip -d -c ../../../../3rdparty/libprocess/3rdparty/protobuf-2.6.1.tar.gz | tar xf -
gzip -d -c ../../../../3rdparty/libprocess/3rdparty/libev-4.22.tar.gz | tar xf -
gzip -d -c ../../../../3rdparty/libprocess/3rdparty/boost-1.53.0.tar.gz | tar xf -
test ! -e ../../../../3rdparty/libprocess/3rdparty/picojson-1.3.0.patch || patch -d picojson-1.3.0
-p1 <../../../../3rdparty/libprocess/3rdparty/picojson-1.3.0.patch
gzip -d -c ../../../../3rdparty/libprocess/3rdparty/glog-0.3.3.tar.gz | tar xf -
touch picojson-1.3.0-stamp
/bin/bash: fork: retry: Resource temporarily unavailable
../libtool: fork: retry: No child processes
test ! -e ../../../../3rdparty/libprocess/3rdparty/libev-4.22.patch || patch -d libev-4.22
-p1 <../../../../3rdparty/libprocess/3rdparty/libev-4.22.patch
patching file ev.h
touch libev-4.22-stamp
cd libev-4.22 && ./configure '--disable-option-checking' '--prefix=<https://builds.apache.org/job/mesos-reviewbot/ws/mesos-0.29.0/_inst'>
'--disable-python-dependency-install' 'JAVA_HOME=/home/jenkins/tools/java/jdk1.6.0_20-64'
'--enable-shared=no' '--with-pic' '--cache-file=/dev/null' '--srcdir=../../../3rdparty/libprocess'
CXXFLAGS='-g1 -O0 -Wno-unused-local-typedefs -std=c++11' --enable-shared=no --with-pic --srcdir=.
&& \
          make 
make[7]: *** [libev-4.22/libev.la] Error 2
make[7]: *** Waiting for unfinished jobs....
test ! -e ../../../../3rdparty/libprocess/3rdparty/boost-1.53.0.patch || patch -d boost-1.53.0
-p1 <../../../../3rdparty/libprocess/3rdparty/boost-1.53.0.patch
touch boost-1.53.0-stamp
test ! -e ../../../../3rdparty/libprocess/3rdparty/protobuf-2.6.1.patch || patch -d protobuf-2.6.1
-p1 <../../../../3rdparty/libprocess/3rdparty/protobuf-2.6.1.patch
patching file src/google/protobuf/wire_format_lite_inl.h
touch protobuf-2.6.1-stamp
test ! -e ../../../../3rdparty/libprocess/3rdparty/glog-0.3.3.patch || patch -d glog-0.3.3
-p1 <../../../../3rdparty/libprocess/3rdparty/glog-0.3.3.patch
patching file src/symbolize.cc
patching file src/glog/stl_logging.h.in
patching file src/stl_logging_unittest.cc
patching file src/demangle.cc
patching file src/stacktrace_powerpc-inl.h
patching file config.guess
patching file configure.ac
Hunk #1 succeeded at 113 (offset -14 lines).
touch glog-0.3.3-stamp
libtool: compile:  gcc -DPACKAGE_NAME=\"libprocess\" -DPACKAGE_TARNAME=\"libprocess\" -DPACKAGE_VERSION=\"0.0.1\"
"-DPACKAGE_STRING=\"libprocess 0.0.1\"" -DPACKAGE_BUGREPORT=\"\" -DPACKAGE_URL=\"\" -DPACKAGE=\"libprocess\"
-DVERSION=\"0.0.1\" -DSTDC_HEADERS=1 -DHAVE_SYS_TYPES_H=1 -DHAVE_SYS_STAT_H=1 -DHAVE_STDLIB_H=1
-DHAVE_STRING_H=1 -DHAVE_MEMORY_H=1 -DHAVE_STRINGS_H=1 -DHAVE_INTTYPES_H=1 -DHAVE_STDINT_H=1
-DHAVE_UNISTD_H=1 -DHAVE_DLFCN_H=1 -DLT_OBJDIR=\".libs/\" -DHAVE_APR_POOLS_H=1 -DHAVE_LIBAPR_1=1
-DHAVE_SVN_VERSION_H=1 -DHAVE_LIBSVN_SUBR_1=1 -DHAVE_SVN_DELTA_H=1 -DHAVE_LIBSVN_DELTA_1=1
-DHAVE_LIBCURL=1 -DHAVE_CXX11=1 -DHAVE_PTHREAD_PRIO_INHERIT=1 -DHAVE_PTHREAD=1 -DHAVE_LIBZ=1
-DHAVE_LIBDL=1 -I. -I../../../../3rdparty/libprocess/3rdparty -Ihttp-parser-2.6.2 -DHTTP_PARSER_STRICT=0
-I/usr/include/subversion-1 -I/usr/include/apr-1 -I/usr/include/apr-1.0 -g1 -O0 -Wno-unused-local-typedefs
-MT libry_http_parser_la-http_parser.lo -MD -MP -MF .deps/libry_http_parser_la-http_parser.Tpo
-c http-parser-2.6.2/http_parser.c  -fPIC -DPIC -o libry_http_parser_la-http_parser.o
mv -f .deps/libry_http_parser_la-http_parser.Tpo .deps/libry_http_parser_la-http_parser.Plo
make[7]: Leaving directory `<https://builds.apache.org/job/mesos-reviewbot/ws/mesos-0.29.0/_build/3rdparty/libprocess/3rdparty'>
make[6]: *** [all-recursive] Error 1
make[6]: Leaving directory `<https://builds.apache.org/job/mesos-reviewbot/ws/mesos-0.29.0/_build/3rdparty/libprocess/3rdparty'>
make[5]: *** [all] Error 2
make[5]: Leaving directory `<https://builds.apache.org/job/mesos-reviewbot/ws/mesos-0.29.0/_build/3rdparty/libprocess/3rdparty'>
make[4]: *** [all-recursive] Error 1
make[4]: Leaving directory `<https://builds.apache.org/job/mesos-reviewbot/ws/mesos-0.29.0/_build/3rdparty/libprocess'>
make[3]: *** [all-recursive] Error 1
make[3]: Leaving directory `<https://builds.apache.org/job/mesos-reviewbot/ws/mesos-0.29.0/_build/3rdparty'>
make[2]: *** [all] Error 2
make[2]: Leaving directory `<https://builds.apache.org/job/mesos-reviewbot/ws/mesos-0.29.0/_build/3rdparty'>
make[1]: *** [all-recursive] Error 1
make[1]: Leaving directory `<https://builds.apache.org/job/mesos-reviewbot/ws/mesos-0.29.0/_build'>
make: *** [distcheck] Error 1
Build step 'Execute shell' marked build as failure

Mime
View raw message