mesos-builds mailing list archives

Site index · List index
Message view « Date » · « Thread »
Top « Date » · « Thread »
From Apache Jenkins Server <jenk...@builds.apache.org>
Subject Build failed in Jenkins: mesos-reviewbot #12436
Date Sun, 10 Apr 2016 04:44:28 GMT
See <https://builds.apache.org/job/mesos-reviewbot/12436/>

------------------------------------------
[...truncated 2431 lines...]
libtool: compile:  g++ -DHAVE_CONFIG_H -I. -I.. -pthread -Wall -Wwrite-strings -Woverloaded-virtual -Wno-sign-compare -g1 -O0 -Wno-unused-local-typedefs -std=c++11 -MT google/protobuf/compiler/java/java_context.lo -MD -MP -MF google/protobuf/compiler/java/.deps/java_context.Tpo -c google/protobuf/compiler/java/java_context.cc  -fPIC -DPIC -o google/protobuf/compiler/java/java_context.o
libtool: compile:  g++ -DHAVE_CONFIG_H -I. -I.. -pthread -Wall -Wwrite-strings -Woverloaded-virtual -Wno-sign-compare -g1 -O0 -Wno-unused-local-typedefs -std=c++11 -MT google/protobuf/compiler/java/java_enum.lo -MD -MP -MF google/protobuf/compiler/java/.deps/java_enum.Tpo -c google/protobuf/compiler/java/java_enum.cc  -fPIC -DPIC -o google/protobuf/compiler/java/java_enum.o
libtool: compile:  g++ -DHAVE_CONFIG_H -I. -I.. -pthread -Wall -Wwrite-strings -Woverloaded-virtual -Wno-sign-compare -g1 -O0 -Wno-unused-local-typedefs -std=c++11 -MT google/protobuf/compiler/java/java_enum_field.lo -MD -MP -MF google/protobuf/compiler/java/.deps/java_enum_field.Tpo -c google/protobuf/compiler/java/java_enum_field.cc  -fPIC -DPIC -o google/protobuf/compiler/java/java_enum_field.o
depbase=`echo google/protobuf/compiler/java/java_extension.lo | sed 's|[^/]*$|.deps/&|;s|\.lo$||'`;\
	/bin/bash ../libtool  --tag=CXX   --mode=compile g++ -DHAVE_CONFIG_H -I. -I..    -pthread -Wall -Wwrite-strings -Woverloaded-virtual -Wno-sign-compare  -g1 -O0 -Wno-unused-local-typedefs -std=c++11 -MT google/protobuf/compiler/java/java_extension.lo -MD -MP -MF $depbase.Tpo -c -o google/protobuf/compiler/java/java_extension.lo google/protobuf/compiler/java/java_extension.cc &&\
	mv -f $depbase.Tpo $depbase.Plo
depbase=`echo google/protobuf/compiler/java/java_field.lo | sed 's|[^/]*$|.deps/&|;s|\.lo$||'`;\
	/bin/bash ../libtool  --tag=CXX   --mode=compile g++ -DHAVE_CONFIG_H -I. -I..    -pthread -Wall -Wwrite-strings -Woverloaded-virtual -Wno-sign-compare  -g1 -O0 -Wno-unused-local-typedefs -std=c++11 -MT google/protobuf/compiler/java/java_field.lo -MD -MP -MF $depbase.Tpo -c -o google/protobuf/compiler/java/java_field.lo google/protobuf/compiler/java/java_field.cc &&\
	mv -f $depbase.Tpo $depbase.Plo
libtool: compile:  g++ -DHAVE_CONFIG_H -I. -I.. -pthread -Wall -Wwrite-strings -Woverloaded-virtual -Wno-sign-compare -g1 -O0 -Wno-unused-local-typedefs -std=c++11 -MT google/protobuf/compiler/java/java_extension.lo -MD -MP -MF google/protobuf/compiler/java/.deps/java_extension.Tpo -c google/protobuf/compiler/java/java_extension.cc  -fPIC -DPIC -o google/protobuf/compiler/java/java_extension.o
libtool: compile:  g++ -DHAVE_CONFIG_H -I. -I.. -pthread -Wall -Wwrite-strings -Woverloaded-virtual -Wno-sign-compare -g1 -O0 -Wno-unused-local-typedefs -std=c++11 -MT google/protobuf/compiler/java/java_field.lo -MD -MP -MF google/protobuf/compiler/java/.deps/java_field.Tpo -c google/protobuf/compiler/java/java_field.cc  -fPIC -DPIC -o google/protobuf/compiler/java/java_field.o
depbase=`echo google/protobuf/compiler/java/java_file.lo | sed 's|[^/]*$|.deps/&|;s|\.lo$||'`;\
	/bin/bash ../libtool  --tag=CXX   --mode=compile g++ -DHAVE_CONFIG_H -I. -I..    -pthread -Wall -Wwrite-strings -Woverloaded-virtual -Wno-sign-compare  -g1 -O0 -Wno-unused-local-typedefs -std=c++11 -MT google/protobuf/compiler/java/java_file.lo -MD -MP -MF $depbase.Tpo -c -o google/protobuf/compiler/java/java_file.lo google/protobuf/compiler/java/java_file.cc &&\
	mv -f $depbase.Tpo $depbase.Plo
depbase=`echo google/protobuf/compiler/java/java_generator.lo | sed 's|[^/]*$|.deps/&|;s|\.lo$||'`;\
	/bin/bash ../libtool  --tag=CXX   --mode=compile g++ -DHAVE_CONFIG_H -I. -I..    -pthread -Wall -Wwrite-strings -Woverloaded-virtual -Wno-sign-compare  -g1 -O0 -Wno-unused-local-typedefs -std=c++11 -MT google/protobuf/compiler/java/java_generator.lo -MD -MP -MF $depbase.Tpo -c -o google/protobuf/compiler/java/java_generator.lo google/protobuf/compiler/java/java_generator.cc &&\
	mv -f $depbase.Tpo $depbase.Plo
libtool: compile:  g++ -DHAVE_CONFIG_H -I. -I.. -pthread -Wall -Wwrite-strings -Woverloaded-virtual -Wno-sign-compare -g1 -O0 -Wno-unused-local-typedefs -std=c++11 -MT google/protobuf/compiler/java/java_generator.lo -MD -MP -MF google/protobuf/compiler/java/.deps/java_generator.Tpo -c google/protobuf/compiler/java/java_generator.cc  -fPIC -DPIC -o google/protobuf/compiler/java/java_generator.o
libtool: compile:  g++ -DHAVE_CONFIG_H -I. -I.. -pthread -Wall -Wwrite-strings -Woverloaded-virtual -Wno-sign-compare -g1 -O0 -Wno-unused-local-typedefs -std=c++11 -MT google/protobuf/compiler/java/java_file.lo -MD -MP -MF google/protobuf/compiler/java/.deps/java_file.Tpo -c google/protobuf/compiler/java/java_file.cc  -fPIC -DPIC -o google/protobuf/compiler/java/java_file.o
depbase=`echo google/protobuf/compiler/java/java_generator_factory.lo | sed 's|[^/]*$|.deps/&|;s|\.lo$||'`;\
	/bin/bash ../libtool  --tag=CXX   --mode=compile g++ -DHAVE_CONFIG_H -I. -I..    -pthread -Wall -Wwrite-strings -Woverloaded-virtual -Wno-sign-compare  -g1 -O0 -Wno-unused-local-typedefs -std=c++11 -MT google/protobuf/compiler/java/java_generator_factory.lo -MD -MP -MF $depbase.Tpo -c -o google/protobuf/compiler/java/java_generator_factory.lo google/protobuf/compiler/java/java_generator_factory.cc &&\
	mv -f $depbase.Tpo $depbase.Plo
libtool: compile:  g++ -DHAVE_CONFIG_H -I. -I.. -pthread -Wall -Wwrite-strings -Woverloaded-virtual -Wno-sign-compare -g1 -O0 -Wno-unused-local-typedefs -std=c++11 -MT google/protobuf/compiler/java/java_generator_factory.lo -MD -MP -MF google/protobuf/compiler/java/.deps/java_generator_factory.Tpo -c google/protobuf/compiler/java/java_generator_factory.cc  -fPIC -DPIC -o google/protobuf/compiler/java/java_generator_factory.o
depbase=`echo google/protobuf/compiler/java/java_helpers.lo | sed 's|[^/]*$|.deps/&|;s|\.lo$||'`;\
	/bin/bash ../libtool  --tag=CXX   --mode=compile g++ -DHAVE_CONFIG_H -I. -I..    -pthread -Wall -Wwrite-strings -Woverloaded-virtual -Wno-sign-compare  -g1 -O0 -Wno-unused-local-typedefs -std=c++11 -MT google/protobuf/compiler/java/java_helpers.lo -MD -MP -MF $depbase.Tpo -c -o google/protobuf/compiler/java/java_helpers.lo google/protobuf/compiler/java/java_helpers.cc &&\
	mv -f $depbase.Tpo $depbase.Plo
libtool: compile:  g++ -DHAVE_CONFIG_H -I. -I.. -pthread -Wall -Wwrite-strings -Woverloaded-virtual -Wno-sign-compare -g1 -O0 -Wno-unused-local-typedefs -std=c++11 -MT google/protobuf/compiler/java/java_helpers.lo -MD -MP -MF google/protobuf/compiler/java/.deps/java_helpers.Tpo -c google/protobuf/compiler/java/java_helpers.cc  -fPIC -DPIC -o google/protobuf/compiler/java/java_helpers.o
depbase=`echo google/protobuf/compiler/java/java_lazy_message_field.lo | sed 's|[^/]*$|.deps/&|;s|\.lo$||'`;\
	/bin/bash ../libtool  --tag=CXX   --mode=compile g++ -DHAVE_CONFIG_H -I. -I..    -pthread -Wall -Wwrite-strings -Woverloaded-virtual -Wno-sign-compare  -g1 -O0 -Wno-unused-local-typedefs -std=c++11 -MT google/protobuf/compiler/java/java_lazy_message_field.lo -MD -MP -MF $depbase.Tpo -c -o google/protobuf/compiler/java/java_lazy_message_field.lo google/protobuf/compiler/java/java_lazy_message_field.cc &&\
	mv -f $depbase.Tpo $depbase.Plo
libtool: compile:  g++ -DHAVE_CONFIG_H -I. -I.. -pthread -Wall -Wwrite-strings -Woverloaded-virtual -Wno-sign-compare -g1 -O0 -Wno-unused-local-typedefs -std=c++11 -MT google/protobuf/compiler/java/java_lazy_message_field.lo -MD -MP -MF google/protobuf/compiler/java/.deps/java_lazy_message_field.Tpo -c google/protobuf/compiler/java/java_lazy_message_field.cc  -fPIC -DPIC -o google/protobuf/compiler/java/java_lazy_message_field.o
depbase=`echo google/protobuf/compiler/java/java_message.lo | sed 's|[^/]*$|.deps/&|;s|\.lo$||'`;\
	/bin/bash ../libtool  --tag=CXX   --mode=compile g++ -DHAVE_CONFIG_H -I. -I..    -pthread -Wall -Wwrite-strings -Woverloaded-virtual -Wno-sign-compare  -g1 -O0 -Wno-unused-local-typedefs -std=c++11 -MT google/protobuf/compiler/java/java_message.lo -MD -MP -MF $depbase.Tpo -c -o google/protobuf/compiler/java/java_message.lo google/protobuf/compiler/java/java_message.cc &&\
	mv -f $depbase.Tpo $depbase.Plo
depbase=`echo google/protobuf/compiler/java/java_message_field.lo | sed 's|[^/]*$|.deps/&|;s|\.lo$||'`;\
	/bin/bash ../libtool  --tag=CXX   --mode=compile g++ -DHAVE_CONFIG_H -I. -I..    -pthread -Wall -Wwrite-strings -Woverloaded-virtual -Wno-sign-compare  -g1 -O0 -Wno-unused-local-typedefs -std=c++11 -MT google/protobuf/compiler/java/java_message_field.lo -MD -MP -MF $depbase.Tpo -c -o google/protobuf/compiler/java/java_message_field.lo google/protobuf/compiler/java/java_message_field.cc &&\
	mv -f $depbase.Tpo $depbase.Plo
libtool: compile:  g++ -DHAVE_CONFIG_H -I. -I.. -pthread -Wall -Wwrite-strings -Woverloaded-virtual -Wno-sign-compare -g1 -O0 -Wno-unused-local-typedefs -std=c++11 -MT google/protobuf/compiler/java/java_message.lo -MD -MP -MF google/protobuf/compiler/java/.deps/java_message.Tpo -c google/protobuf/compiler/java/java_message.cc  -fPIC -DPIC -o google/protobuf/compiler/java/java_message.o
libtool: compile:  g++ -DHAVE_CONFIG_H -I. -I.. -pthread -Wall -Wwrite-strings -Woverloaded-virtual -Wno-sign-compare -g1 -O0 -Wno-unused-local-typedefs -std=c++11 -MT google/protobuf/compiler/java/java_message_field.lo -MD -MP -MF google/protobuf/compiler/java/.deps/java_message_field.Tpo -c google/protobuf/compiler/java/java_message_field.cc  -fPIC -DPIC -o google/protobuf/compiler/java/java_message_field.o
depbase=`echo google/protobuf/compiler/java/java_name_resolver.lo | sed 's|[^/]*$|.deps/&|;s|\.lo$||'`;\
	/bin/bash ../libtool  --tag=CXX   --mode=compile g++ -DHAVE_CONFIG_H -I. -I..    -pthread -Wall -Wwrite-strings -Woverloaded-virtual -Wno-sign-compare  -g1 -O0 -Wno-unused-local-typedefs -std=c++11 -MT google/protobuf/compiler/java/java_name_resolver.lo -MD -MP -MF $depbase.Tpo -c -o google/protobuf/compiler/java/java_name_resolver.lo google/protobuf/compiler/java/java_name_resolver.cc &&\
	mv -f $depbase.Tpo $depbase.Plo
libtool: compile:  g++ -DHAVE_CONFIG_H -I. -I.. -pthread -Wall -Wwrite-strings -Woverloaded-virtual -Wno-sign-compare -g1 -O0 -Wno-unused-local-typedefs -std=c++11 -MT google/protobuf/compiler/java/java_name_resolver.lo -MD -MP -MF google/protobuf/compiler/java/.deps/java_name_resolver.Tpo -c google/protobuf/compiler/java/java_name_resolver.cc  -fPIC -DPIC -o google/protobuf/compiler/java/java_name_resolver.o
depbase=`echo google/protobuf/compiler/java/java_primitive_field.lo | sed 's|[^/]*$|.deps/&|;s|\.lo$||'`;\
	/bin/bash ../libtool  --tag=CXX   --mode=compile g++ -DHAVE_CONFIG_H -I. -I..    -pthread -Wall -Wwrite-strings -Woverloaded-virtual -Wno-sign-compare  -g1 -O0 -Wno-unused-local-typedefs -std=c++11 -MT google/protobuf/compiler/java/java_primitive_field.lo -MD -MP -MF $depbase.Tpo -c -o google/protobuf/compiler/java/java_primitive_field.lo google/protobuf/compiler/java/java_primitive_field.cc &&\
	mv -f $depbase.Tpo $depbase.Plo
depbase=`echo google/protobuf/compiler/java/java_shared_code_generator.lo | sed 's|[^/]*$|.deps/&|;s|\.lo$||'`;\
	/bin/bash ../libtool  --tag=CXX   --mode=compile g++ -DHAVE_CONFIG_H -I. -I..    -pthread -Wall -Wwrite-strings -Woverloaded-virtual -Wno-sign-compare  -g1 -O0 -Wno-unused-local-typedefs -std=c++11 -MT google/protobuf/compiler/java/java_shared_code_generator.lo -MD -MP -MF $depbase.Tpo -c -o google/protobuf/compiler/java/java_shared_code_generator.lo google/protobuf/compiler/java/java_shared_code_generator.cc &&\
	mv -f $depbase.Tpo $depbase.Plo
libtool: compile:  g++ -DHAVE_CONFIG_H -I. -I.. -pthread -Wall -Wwrite-strings -Woverloaded-virtual -Wno-sign-compare -g1 -O0 -Wno-unused-local-typedefs -std=c++11 -MT google/protobuf/compiler/java/java_primitive_field.lo -MD -MP -MF google/protobuf/compiler/java/.deps/java_primitive_field.Tpo -c google/protobuf/compiler/java/java_primitive_field.cc  -fPIC -DPIC -o google/protobuf/compiler/java/java_primitive_field.o
depbase=`echo google/protobuf/compiler/java/java_service.lo | sed 's|[^/]*$|.deps/&|;s|\.lo$||'`;\
	/bin/bash ../libtool  --tag=CXX   --mode=compile g++ -DHAVE_CONFIG_H -I. -I..    -pthread -Wall -Wwrite-strings -Woverloaded-virtual -Wno-sign-compare  -g1 -O0 -Wno-unused-local-typedefs -std=c++11 -MT google/protobuf/compiler/java/java_service.lo -MD -MP -MF $depbase.Tpo -c -o google/protobuf/compiler/java/java_service.lo google/protobuf/compiler/java/java_service.cc &&\
	mv -f $depbase.Tpo $depbase.Plo
depbase=`echo google/protobuf/compiler/java/java_string_field.lo | sed 's|[^/]*$|.deps/&|;s|\.lo$||'`;\
	/bin/bash ../libtool  --tag=CXX   --mode=compile g++ -DHAVE_CONFIG_H -I. -I..    -pthread -Wall -Wwrite-strings -Woverloaded-virtual -Wno-sign-compare  -g1 -O0 -Wno-unused-local-typedefs -std=c++11 -MT google/protobuf/compiler/java/java_string_field.lo -MD -MP -MF $depbase.Tpo -c -o google/protobuf/compiler/java/java_string_field.lo google/protobuf/compiler/java/java_string_field.cc &&\
	mv -f $depbase.Tpo $depbase.Plo
libtool: compile:  g++ -DHAVE_CONFIG_H -I. -I.. -pthread -Wall -Wwrite-strings -Woverloaded-virtual -Wno-sign-compare -g1 -O0 -Wno-unused-local-typedefs -std=c++11 -MT google/protobuf/compiler/java/java_shared_code_generator.lo -MD -MP -MF google/protobuf/compiler/java/.deps/java_shared_code_generator.Tpo -c google/protobuf/compiler/java/java_shared_code_generator.cc  -fPIC -DPIC -o google/protobuf/compiler/java/java_shared_code_generator.o
libtool: compile:  g++ -DHAVE_CONFIG_H -I. -I.. -pthread -Wall -Wwrite-strings -Woverloaded-virtual -Wno-sign-compare -g1 -O0 -Wno-unused-local-typedefs -std=c++11 -MT google/protobuf/compiler/java/java_service.lo -MD -MP -MF google/protobuf/compiler/java/.deps/java_service.Tpo -c google/protobuf/compiler/java/java_service.cc  -fPIC -DPIC -o google/protobuf/compiler/java/java_service.o
libtool: compile:  g++ -DHAVE_CONFIG_H -I. -I.. -pthread -Wall -Wwrite-strings -Woverloaded-virtual -Wno-sign-compare -g1 -O0 -Wno-unused-local-typedefs -std=c++11 -MT google/protobuf/compiler/java/java_string_field.lo -MD -MP -MF google/protobuf/compiler/java/.deps/java_string_field.Tpo -c google/protobuf/compiler/java/java_string_field.cc  -fPIC -DPIC -o google/protobuf/compiler/java/java_string_field.o
depbase=`echo google/protobuf/compiler/java/java_doc_comment.lo | sed 's|[^/]*$|.deps/&|;s|\.lo$||'`;\
	/bin/bash ../libtool  --tag=CXX   --mode=compile g++ -DHAVE_CONFIG_H -I. -I..    -pthread -Wall -Wwrite-strings -Woverloaded-virtual -Wno-sign-compare  -g1 -O0 -Wno-unused-local-typedefs -std=c++11 -MT google/protobuf/compiler/java/java_doc_comment.lo -MD -MP -MF $depbase.Tpo -c -o google/protobuf/compiler/java/java_doc_comment.lo google/protobuf/compiler/java/java_doc_comment.cc &&\
	mv -f $depbase.Tpo $depbase.Plo
libtool: compile:  g++ -DHAVE_CONFIG_H -I. -I.. -pthread -Wall -Wwrite-strings -Woverloaded-virtual -Wno-sign-compare -g1 -O0 -Wno-unused-local-typedefs -std=c++11 -MT google/protobuf/compiler/java/java_doc_comment.lo -MD -MP -MF google/protobuf/compiler/java/.deps/java_doc_comment.Tpo -c google/protobuf/compiler/java/java_doc_comment.cc  -fPIC -DPIC -o google/protobuf/compiler/java/java_doc_comment.o
depbase=`echo google/protobuf/compiler/python/python_generator.lo | sed 's|[^/]*$|.deps/&|;s|\.lo$||'`;\
	/bin/bash ../libtool  --tag=CXX   --mode=compile g++ -DHAVE_CONFIG_H -I. -I..    -pthread -Wall -Wwrite-strings -Woverloaded-virtual -Wno-sign-compare  -g1 -O0 -Wno-unused-local-typedefs -std=c++11 -MT google/protobuf/compiler/python/python_generator.lo -MD -MP -MF $depbase.Tpo -c -o google/protobuf/compiler/python/python_generator.lo google/protobuf/compiler/python/python_generator.cc &&\
	mv -f $depbase.Tpo $depbase.Plo
/bin/bash ../libtool  --tag=CXX   --mode=link g++ -pthread -Wall -Wwrite-strings -Woverloaded-virtual -Wno-sign-compare  -g1 -O0 -Wno-unused-local-typedefs -std=c++11 -version-info 9:1:0 -export-dynamic -no-undefined  -o libprotobuf.la -rpath <https://builds.apache.org/job/mesos-reviewbot/ws/mesos-0.29.0/_inst/lib> google/protobuf/stubs/atomicops_internals_x86_gcc.lo google/protobuf/stubs/atomicops_internals_x86_msvc.lo google/protobuf/stubs/common.lo google/protobuf/stubs/once.lo google/protobuf/stubs/stringprintf.lo google/protobuf/extension_set.lo google/protobuf/generated_message_util.lo google/protobuf/message_lite.lo google/protobuf/repeated_field.lo google/protobuf/wire_format_lite.lo google/protobuf/io/coded_stream.lo google/protobuf/io/zero_copy_stream.lo google/protobuf/io/zero_copy_stream_impl_lite.lo google/protobuf/stubs/strutil.lo google/protobuf/stubs/substitute.lo google/protobuf/stubs/structurally_valid.lo google/protobuf/descriptor.lo google/protobuf/descriptor.pb.lo google/protobuf/descriptor_database.lo google/protobuf/dynamic_message.lo google/protobuf/extension_set_heavy.lo google/protobuf/generated_message_reflection.lo google/protobuf/message.lo google/protobuf/reflection_ops.lo google/protobuf/service.lo google/protobuf/text_format.lo google/protobuf/unknown_field_set.lo google/protobuf/wire_format.lo google/protobuf/io/gzip_stream.lo google/protobuf/io/printer.lo google/protobuf/io/strtod.lo google/protobuf/io/tokenizer.lo google/protobuf/io/zero_copy_stream_impl.lo google/protobuf/compiler/importer.lo google/protobuf/compiler/parser.lo -lpthread -lz 
libtool: compile:  g++ -DHAVE_CONFIG_H -I. -I.. -pthread -Wall -Wwrite-strings -Woverloaded-virtual -Wno-sign-compare -g1 -O0 -Wno-unused-local-typedefs -std=c++11 -MT google/protobuf/compiler/python/python_generator.lo -MD -MP -MF google/protobuf/compiler/python/.deps/python_generator.Tpo -c google/protobuf/compiler/python/python_generator.cc  -fPIC -DPIC -o google/protobuf/compiler/python/python_generator.o
libtool: link: ar cru .libs/libprotobuf.a  google/protobuf/stubs/atomicops_internals_x86_gcc.o google/protobuf/stubs/atomicops_internals_x86_msvc.o google/protobuf/stubs/common.o google/protobuf/stubs/once.o google/protobuf/stubs/stringprintf.o google/protobuf/extension_set.o google/protobuf/generated_message_util.o google/protobuf/message_lite.o google/protobuf/repeated_field.o google/protobuf/wire_format_lite.o google/protobuf/io/coded_stream.o google/protobuf/io/zero_copy_stream.o google/protobuf/io/zero_copy_stream_impl_lite.o google/protobuf/stubs/strutil.o google/protobuf/stubs/substitute.o google/protobuf/stubs/structurally_valid.o google/protobuf/descriptor.o google/protobuf/descriptor.pb.o google/protobuf/descriptor_database.o google/protobuf/dynamic_message.o google/protobuf/extension_set_heavy.o google/protobuf/generated_message_reflection.o google/protobuf/message.o google/protobuf/reflection_ops.o google/protobuf/service.o google/protobuf/text_format.o google/protobuf/unknown_field_set.o google/protobuf/wire_format.o google/protobuf/io/gzip_stream.o google/protobuf/io/printer.o google/protobuf/io/strtod.o google/protobuf/io/tokenizer.o google/protobuf/io/zero_copy_stream_impl.o google/protobuf/compiler/importer.o google/protobuf/compiler/parser.o
libtool: link: ranlib .libs/libprotobuf.a
libtool: link: ( cd ".libs" && rm -f "libprotobuf.la" && ln -s "../libprotobuf.la" "libprotobuf.la" )
/bin/bash ../libtool  --tag=CXX   --mode=link g++ -pthread -Wall -Wwrite-strings -Woverloaded-virtual -Wno-sign-compare  -g1 -O0 -Wno-unused-local-typedefs -std=c++11 -version-info 9:1:0 -export-dynamic -no-undefined  -o libprotoc.la -rpath <https://builds.apache.org/job/mesos-reviewbot/ws/mesos-0.29.0/_inst/lib> google/protobuf/compiler/code_generator.lo google/protobuf/compiler/command_line_interface.lo google/protobuf/compiler/plugin.lo google/protobuf/compiler/plugin.pb.lo google/protobuf/compiler/subprocess.lo google/protobuf/compiler/zip_writer.lo google/protobuf/compiler/cpp/cpp_enum.lo google/protobuf/compiler/cpp/cpp_enum_field.lo google/protobuf/compiler/cpp/cpp_extension.lo google/protobuf/compiler/cpp/cpp_field.lo google/protobuf/compiler/cpp/cpp_file.lo google/protobuf/compiler/cpp/cpp_generator.lo google/protobuf/compiler/cpp/cpp_helpers.lo google/protobuf/compiler/cpp/cpp_message.lo google/protobuf/compiler/cpp/cpp_message_field.lo google/protobuf/compiler/cpp/cpp_primitive_field.lo google/protobuf/compiler/cpp/cpp_service.lo google/protobuf/compiler/cpp/cpp_string_field.lo google/protobuf/compiler/java/java_context.lo google/protobuf/compiler/java/java_enum.lo google/protobuf/compiler/java/java_enum_field.lo google/protobuf/compiler/java/java_extension.lo google/protobuf/compiler/java/java_field.lo google/protobuf/compiler/java/java_file.lo google/protobuf/compiler/java/java_generator.lo google/protobuf/compiler/java/java_generator_factory.lo google/protobuf/compiler/java/java_helpers.lo google/protobuf/compiler/java/java_lazy_message_field.lo google/protobuf/compiler/java/java_message.lo google/protobuf/compiler/java/java_message_field.lo google/protobuf/compiler/java/java_name_resolver.lo google/protobuf/compiler/java/java_primitive_field.lo google/protobuf/compiler/java/java_shared_code_generator.lo google/protobuf/compiler/java/java_service.lo google/protobuf/compiler/java/java_string_field.lo google/protobuf/compiler/java/java_doc_comment.lo google/protobuf/compiler/python/python_generator.lo -lpthread libprotobuf.la -lz 
libtool: link: ar cru .libs/libprotoc.a  google/protobuf/compiler/code_generator.o google/protobuf/compiler/command_line_interface.o google/protobuf/compiler/plugin.o google/protobuf/compiler/plugin.pb.o google/protobuf/compiler/subprocess.o google/protobuf/compiler/zip_writer.o google/protobuf/compiler/cpp/cpp_enum.o google/protobuf/compiler/cpp/cpp_enum_field.o google/protobuf/compiler/cpp/cpp_extension.o google/protobuf/compiler/cpp/cpp_field.o google/protobuf/compiler/cpp/cpp_file.o google/protobuf/compiler/cpp/cpp_generator.o google/protobuf/compiler/cpp/cpp_helpers.o google/protobuf/compiler/cpp/cpp_message.o google/protobuf/compiler/cpp/cpp_message_field.o google/protobuf/compiler/cpp/cpp_primitive_field.o google/protobuf/compiler/cpp/cpp_service.o google/protobuf/compiler/cpp/cpp_string_field.o google/protobuf/compiler/java/java_context.o google/protobuf/compiler/java/java_enum.o google/protobuf/compiler/java/java_enum_field.o google/protobuf/compiler/java/java_extension.o google/protobuf/compiler/java/java_field.o google/protobuf/compiler/java/java_file.o google/protobuf/compiler/java/java_generator.o google/protobuf/compiler/java/java_generator_factory.o google/protobuf/compiler/java/java_helpers.o google/protobuf/compiler/java/java_lazy_message_field.o google/protobuf/compiler/java/java_message.o google/protobuf/compiler/java/java_message_field.o google/protobuf/compiler/java/java_name_resolver.o google/protobuf/compiler/java/java_primitive_field.o google/protobuf/compiler/java/java_shared_code_generator.o google/protobuf/compiler/java/java_service.o google/protobuf/compiler/java/java_string_field.o google/protobuf/compiler/java/java_doc_comment.o google/protobuf/compiler/python/python_generator.o
libtool: link: ranlib .libs/libprotoc.a
libtool: link: ( cd ".libs" && rm -f "libprotoc.la" && ln -s "../libprotoc.la" "libprotoc.la" )
/bin/bash ../libtool  --tag=CXX   --mode=link g++ -pthread -Wall -Wwrite-strings -Woverloaded-virtual -Wno-sign-compare  -g1 -O0 -Wno-unused-local-typedefs -std=c++11 -pthread  -o protoc google/protobuf/compiler/main.o -lpthread libprotobuf.la libprotoc.la -lz 
libtool: link: g++ -pthread -Wall -Wwrite-strings -Woverloaded-virtual -Wno-sign-compare -g1 -O0 -Wno-unused-local-typedefs -std=c++11 -pthread -o protoc google/protobuf/compiler/main.o  ./.libs/libprotobuf.a ./.libs/libprotoc.a <https://builds.apache.org/job/mesos-reviewbot/ws/mesos-0.29.0/_build/3rdparty/libprocess/3rdparty/protobuf-2.6.1/src/.libs/libprotobuf.a> -lpthread -lz -pthread
oldpwd=`pwd` && ( cd . && $oldpwd/protoc -I. --cpp_out=$oldpwd google/protobuf/unittest.proto google/protobuf/unittest_empty.proto google/protobuf/unittest_import.proto google/protobuf/unittest_import_public.proto google/protobuf/unittest_mset.proto google/protobuf/unittest_optimize_for.proto google/protobuf/unittest_embed_optimize_for.proto google/protobuf/unittest_custom_options.proto google/protobuf/unittest_lite.proto google/protobuf/unittest_import_lite.proto google/protobuf/unittest_import_public_lite.proto google/protobuf/unittest_lite_imports_nonlite.proto google/protobuf/unittest_no_generic_services.proto google/protobuf/compiler/cpp/cpp_test_bad_identifiers.proto )
touch unittest_proto_middleman
make  all-am
make[11]: Entering directory `<https://builds.apache.org/job/mesos-reviewbot/ws/mesos-0.29.0/_build/3rdparty/libprocess/3rdparty/protobuf-2.6.1/src'>
/bin/bash ../libtool  --tag=CXX   --mode=link g++ -pthread -Wall -Wwrite-strings -Woverloaded-virtual -Wno-sign-compare  -g1 -O0 -Wno-unused-local-typedefs -std=c++11 -version-info 9:1:0 -export-dynamic -no-undefined  -o libprotobuf-lite.la -rpath <https://builds.apache.org/job/mesos-reviewbot/ws/mesos-0.29.0/_inst/lib> google/protobuf/stubs/atomicops_internals_x86_gcc.lo google/protobuf/stubs/atomicops_internals_x86_msvc.lo google/protobuf/stubs/common.lo google/protobuf/stubs/once.lo google/protobuf/stubs/stringprintf.lo google/protobuf/extension_set.lo google/protobuf/generated_message_util.lo google/protobuf/message_lite.lo google/protobuf/repeated_field.lo google/protobuf/wire_format_lite.lo google/protobuf/io/coded_stream.lo google/protobuf/io/zero_copy_stream.lo google/protobuf/io/zero_copy_stream_impl_lite.lo -lpthread -lz 
libtool: link: ar cru .libs/libprotobuf-lite.a  google/protobuf/stubs/atomicops_internals_x86_gcc.o google/protobuf/stubs/atomicops_internals_x86_msvc.o google/protobuf/stubs/common.o google/protobuf/stubs/once.o google/protobuf/stubs/stringprintf.o google/protobuf/extension_set.o google/protobuf/generated_message_util.o google/protobuf/message_lite.o google/protobuf/repeated_field.o google/protobuf/wire_format_lite.o google/protobuf/io/coded_stream.o google/protobuf/io/zero_copy_stream.o google/protobuf/io/zero_copy_stream_impl_lite.o
libtool: link: ranlib .libs/libprotobuf-lite.a
libtool: link: ( cd ".libs" && rm -f "libprotobuf-lite.la" && ln -s "../libprotobuf-lite.la" "libprotobuf-lite.la" )
make[11]: Leaving directory `<https://builds.apache.org/job/mesos-reviewbot/ws/mesos-0.29.0/_build/3rdparty/libprocess/3rdparty/protobuf-2.6.1/src'>
make[10]: Leaving directory `<https://builds.apache.org/job/mesos-reviewbot/ws/mesos-0.29.0/_build/3rdparty/libprocess/3rdparty/protobuf-2.6.1/src'>
make[9]: Leaving directory `<https://builds.apache.org/job/mesos-reviewbot/ws/mesos-0.29.0/_build/3rdparty/libprocess/3rdparty/protobuf-2.6.1'>
make[8]: Leaving directory `<https://builds.apache.org/job/mesos-reviewbot/ws/mesos-0.29.0/_build/3rdparty/libprocess/3rdparty/protobuf-2.6.1'>
touch protobuf-2.6.1-build-stamp
make[7]: Leaving directory `<https://builds.apache.org/job/mesos-reviewbot/ws/mesos-0.29.0/_build/3rdparty/libprocess/3rdparty'>
make[6]: Leaving directory `<https://builds.apache.org/job/mesos-reviewbot/ws/mesos-0.29.0/_build/3rdparty/libprocess/3rdparty'>
make[5]: Leaving directory `<https://builds.apache.org/job/mesos-reviewbot/ws/mesos-0.29.0/_build/3rdparty/libprocess/3rdparty'>
Making all in .
make[5]: Entering directory `<https://builds.apache.org/job/mesos-reviewbot/ws/mesos-0.29.0/_build/3rdparty/libprocess'>
/bin/bash ./libtool  --tag=CXX   --mode=compile g++ -DPACKAGE_NAME=\"libprocess\" -DPACKAGE_TARNAME=\"libprocess\" -DPACKAGE_VERSION=\"0.0.1\" -DPACKAGE_STRING=\"libprocess\ 0.0.1\" -DPACKAGE_BUGREPORT=\"\" -DPACKAGE_URL=\"\" -DPACKAGE=\"libprocess\" -DVERSION=\"0.0.1\" -DSTDC_HEADERS=1 -DHAVE_SYS_TYPES_H=1 -DHAVE_SYS_STAT_H=1 -DHAVE_STDLIB_H=1 -DHAVE_STRING_H=1 -DHAVE_MEMORY_H=1 -DHAVE_STRINGS_H=1 -DHAVE_INTTYPES_H=1 -DHAVE_STDINT_H=1 -DHAVE_UNISTD_H=1 -DHAVE_DLFCN_H=1 -DLT_OBJDIR=\".libs/\" -DHAVE_APR_POOLS_H=1 -DHAVE_LIBAPR_1=1 -DHAVE_SVN_VERSION_H=1 -DHAVE_LIBSVN_SUBR_1=1 -DHAVE_SVN_DELTA_H=1 -DHAVE_LIBSVN_DELTA_1=1 -DHAVE_LIBCURL=1 -DHAVE_CXX11=1 -DHAVE_PTHREAD_PRIO_INHERIT=1 -DHAVE_PTHREAD=1 -DHAVE_LIBZ=1 -DHAVE_LIBDL=1 -I. -I../../../3rdparty/libprocess  -DBUILD_DIR=\"<https://builds.apache.org/job/mesos-reviewbot/ws/mesos-0.29.0/_build/3rdparty/libprocess\"> -I../../../3rdparty/libprocess/include -I../../../3rdparty/libprocess/3rdparty/stout/include -isystem 3rdparty/boost-1.53.0 -I3rdparty/libev-4.22 -I3rdparty/picojson-1.3.0 -DPICOJSON_USE_INT64 -D__STDC_FORMAT_MACROS  -I3rdparty/glog-0.3.3/src -I3rdparty/http-parser-2.6.2  -I/usr/include/subversion-1 -I/usr/include/apr-1 -I/usr/include/apr-1.0   -g1 -O0 -Wno-unused-local-typedefs -std=c++11 -MT libprocess_la-authenticator_manager.lo -MD -MP -MF .deps/libprocess_la-authenticator_manager.Tpo -c -o libprocess_la-authenticator_manager.lo `test -f 'src/authenticator_manager.cpp' || echo '../../../3rdparty/libprocess/'`src/authenticator_manager.cpp
/bin/bash ./libtool  --tag=CXX   --mode=compile g++ -DPACKAGE_NAME=\"libprocess\" -DPACKAGE_TARNAME=\"libprocess\" -DPACKAGE_VERSION=\"0.0.1\" -DPACKAGE_STRING=\"libprocess\ 0.0.1\" -DPACKAGE_BUGREPORT=\"\" -DPACKAGE_URL=\"\" -DPACKAGE=\"libprocess\" -DVERSION=\"0.0.1\" -DSTDC_HEADERS=1 -DHAVE_SYS_TYPES_H=1 -DHAVE_SYS_STAT_H=1 -DHAVE_STDLIB_H=1 -DHAVE_STRING_H=1 -DHAVE_MEMORY_H=1 -DHAVE_STRINGS_H=1 -DHAVE_INTTYPES_H=1 -DHAVE_STDINT_H=1 -DHAVE_UNISTD_H=1 -DHAVE_DLFCN_H=1 -DLT_OBJDIR=\".libs/\" -DHAVE_APR_POOLS_H=1 -DHAVE_LIBAPR_1=1 -DHAVE_SVN_VERSION_H=1 -DHAVE_LIBSVN_SUBR_1=1 -DHAVE_SVN_DELTA_H=1 -DHAVE_LIBSVN_DELTA_1=1 -DHAVE_LIBCURL=1 -DHAVE_CXX11=1 -DHAVE_PTHREAD_PRIO_INHERIT=1 -DHAVE_PTHREAD=1 -DHAVE_LIBZ=1 -DHAVE_LIBDL=1 -I. -I../../../3rdparty/libprocess  -DBUILD_DIR=\"<https://builds.apache.org/job/mesos-reviewbot/ws/mesos-0.29.0/_build/3rdparty/libprocess\"> -I../../../3rdparty/libprocess/include -I../../../3rdparty/libprocess/3rdparty/stout/include -isystem 3rdparty/boost-1.53.0 -I3rdparty/libev-4.22 -I3rdparty/picojson-1.3.0 -DPICOJSON_USE_INT64 -D__STDC_FORMAT_MACROS  -I3rdparty/glog-0.3.3/src -I3rdparty/http-parser-2.6.2  -I/usr/include/subversion-1 -I/usr/include/apr-1 -I/usr/include/apr-1.0   -g1 -O0 -Wno-unused-local-typedefs -std=c++11 -MT libprocess_la-authenticator.lo -MD -MP -MF .deps/libprocess_la-authenticator.Tpo -c -o libprocess_la-authenticator.lo `test -f 'src/authenticator.cpp' || echo '../../../3rdparty/libprocess/'`src/authenticator.cpp
/bin/bash ./libtool  --tag=CXX   --mode=compile g++ -DPACKAGE_NAME=\"libprocess\" -DPACKAGE_TARNAME=\"libprocess\" -DPACKAGE_VERSION=\"0.0.1\" -DPACKAGE_STRING=\"libprocess\ 0.0.1\" -DPACKAGE_BUGREPORT=\"\" -DPACKAGE_URL=\"\" -DPACKAGE=\"libprocess\" -DVERSION=\"0.0.1\" -DSTDC_HEADERS=1 -DHAVE_SYS_TYPES_H=1 -DHAVE_SYS_STAT_H=1 -DHAVE_STDLIB_H=1 -DHAVE_STRING_H=1 -DHAVE_MEMORY_H=1 -DHAVE_STRINGS_H=1 -DHAVE_INTTYPES_H=1 -DHAVE_STDINT_H=1 -DHAVE_UNISTD_H=1 -DHAVE_DLFCN_H=1 -DLT_OBJDIR=\".libs/\" -DHAVE_APR_POOLS_H=1 -DHAVE_LIBAPR_1=1 -DHAVE_SVN_VERSION_H=1 -DHAVE_LIBSVN_SUBR_1=1 -DHAVE_SVN_DELTA_H=1 -DHAVE_LIBSVN_DELTA_1=1 -DHAVE_LIBCURL=1 -DHAVE_CXX11=1 -DHAVE_PTHREAD_PRIO_INHERIT=1 -DHAVE_PTHREAD=1 -DHAVE_LIBZ=1 -DHAVE_LIBDL=1 -I. -I../../../3rdparty/libprocess  -DBUILD_DIR=\"<https://builds.apache.org/job/mesos-reviewbot/ws/mesos-0.29.0/_build/3rdparty/libprocess\"> -I../../../3rdparty/libprocess/include -I../../../3rdparty/libprocess/3rdparty/stout/include -isystem 3rdparty/boost-1.53.0 -I3rdparty/libev-4.22 -I3rdparty/picojson-1.3.0 -DPICOJSON_USE_INT64 -D__STDC_FORMAT_MACROS  -I3rdparty/glog-0.3.3/src -I3rdparty/http-parser-2.6.2  -I/usr/include/subversion-1 -I/usr/include/apr-1 -I/usr/include/apr-1.0   -g1 -O0 -Wno-unused-local-typedefs -std=c++11 -MT libprocess_la-clock.lo -MD -MP -MF .deps/libprocess_la-clock.Tpo -c -o libprocess_la-clock.lo `test -f 'src/clock.cpp' || echo '../../../3rdparty/libprocess/'`src/clock.cpp
/bin/bash ./libtool  --tag=CXX   --mode=compile g++ -DPACKAGE_NAME=\"libprocess\" -DPACKAGE_TARNAME=\"libprocess\" -DPACKAGE_VERSION=\"0.0.1\" -DPACKAGE_STRING=\"libprocess\ 0.0.1\" -DPACKAGE_BUGREPORT=\"\" -DPACKAGE_URL=\"\" -DPACKAGE=\"libprocess\" -DVERSION=\"0.0.1\" -DSTDC_HEADERS=1 -DHAVE_SYS_TYPES_H=1 -DHAVE_SYS_STAT_H=1 -DHAVE_STDLIB_H=1 -DHAVE_STRING_H=1 -DHAVE_MEMORY_H=1 -DHAVE_STRINGS_H=1 -DHAVE_INTTYPES_H=1 -DHAVE_STDINT_H=1 -DHAVE_UNISTD_H=1 -DHAVE_DLFCN_H=1 -DLT_OBJDIR=\".libs/\" -DHAVE_APR_POOLS_H=1 -DHAVE_LIBAPR_1=1 -DHAVE_SVN_VERSION_H=1 -DHAVE_LIBSVN_SUBR_1=1 -DHAVE_SVN_DELTA_H=1 -DHAVE_LIBSVN_DELTA_1=1 -DHAVE_LIBCURL=1 -DHAVE_CXX11=1 -DHAVE_PTHREAD_PRIO_INHERIT=1 -DHAVE_PTHREAD=1 -DHAVE_LIBZ=1 -DHAVE_LIBDL=1 -I. -I../../../3rdparty/libprocess  -DBUILD_DIR=\"<https://builds.apache.org/job/mesos-reviewbot/ws/mesos-0.29.0/_build/3rdparty/libprocess\"> -I../../../3rdparty/libprocess/include -I../../../3rdparty/libprocess/3rdparty/stout/include -isystem 3rdparty/boost-1.53.0 -I3rdparty/libev-4.22 -I3rdparty/picojson-1.3.0 -DPICOJSON_USE_INT64 -D__STDC_FORMAT_MACROS  -I3rdparty/glog-0.3.3/src -I3rdparty/http-parser-2.6.2  -I/usr/include/subversion-1 -I/usr/include/apr-1 -I/usr/include/apr-1.0   -g1 -O0 -Wno-unused-local-typedefs -std=c++11 -MT libprocess_la-firewall.lo -MD -MP -MF .deps/libprocess_la-firewall.Tpo -c -o libprocess_la-firewall.lo `test -f 'src/firewall.cpp' || echo '../../../3rdparty/libprocess/'`src/firewall.cpp
/bin/bash ./libtool  --tag=CXX   --mode=compile g++ -DPACKAGE_NAME=\"libprocess\" -DPACKAGE_TARNAME=\"libprocess\" -DPACKAGE_VERSION=\"0.0.1\" -DPACKAGE_STRING=\"libprocess\ 0.0.1\" -DPACKAGE_BUGREPORT=\"\" -DPACKAGE_URL=\"\" -DPACKAGE=\"libprocess\" -DVERSION=\"0.0.1\" -DSTDC_HEADERS=1 -DHAVE_SYS_TYPES_H=1 -DHAVE_SYS_STAT_H=1 -DHAVE_STDLIB_H=1 -DHAVE_STRING_H=1 -DHAVE_MEMORY_H=1 -DHAVE_STRINGS_H=1 -DHAVE_INTTYPES_H=1 -DHAVE_STDINT_H=1 -DHAVE_UNISTD_H=1 -DHAVE_DLFCN_H=1 -DLT_OBJDIR=\".libs/\" -DHAVE_APR_POOLS_H=1 -DHAVE_LIBAPR_1=1 -DHAVE_SVN_VERSION_H=1 -DHAVE_LIBSVN_SUBR_1=1 -DHAVE_SVN_DELTA_H=1 -DHAVE_LIBSVN_DELTA_1=1 -DHAVE_LIBCURL=1 -DHAVE_CXX11=1 -DHAVE_PTHREAD_PRIO_INHERIT=1 -DHAVE_PTHREAD=1 -DHAVE_LIBZ=1 -DHAVE_LIBDL=1 -I. -I../../../3rdparty/libprocess  -DBUILD_DIR=\"<https://builds.apache.org/job/mesos-reviewbot/ws/mesos-0.29.0/_build/3rdparty/libprocess\"> -I../../../3rdparty/libprocess/include -I../../../3rdparty/libprocess/3rdparty/stout/include -isystem 3rdparty/boost-1.53.0 -I3rdparty/libev-4.22 -I3rdparty/picojson-1.3.0 -DPICOJSON_USE_INT64 -D__STDC_FORMAT_MACROS  -I3rdparty/glog-0.3.3/src -I3rdparty/http-parser-2.6.2  -I/usr/include/subversion-1 -I/usr/include/apr-1 -I/usr/include/apr-1.0   -g1 -O0 -Wno-unused-local-typedefs -std=c++11 -MT libprocess_la-help.lo -MD -MP -MF .deps/libprocess_la-help.Tpo -c -o libprocess_la-help.lo `test -f 'src/help.cpp' || echo '../../../3rdparty/libprocess/'`src/help.cpp
/bin/bash ./libtool  --tag=CXX   --mode=compile g++ -DPACKAGE_NAME=\"libprocess\" -DPACKAGE_TARNAME=\"libprocess\" -DPACKAGE_VERSION=\"0.0.1\" -DPACKAGE_STRING=\"libprocess\ 0.0.1\" -DPACKAGE_BUGREPORT=\"\" -DPACKAGE_URL=\"\" -DPACKAGE=\"libprocess\" -DVERSION=\"0.0.1\" -DSTDC_HEADERS=1 -DHAVE_SYS_TYPES_H=1 -DHAVE_SYS_STAT_H=1 -DHAVE_STDLIB_H=1 -DHAVE_STRING_H=1 -DHAVE_MEMORY_H=1 -DHAVE_STRINGS_H=1 -DHAVE_INTTYPES_H=1 -DHAVE_STDINT_H=1 -DHAVE_UNISTD_H=1 -DHAVE_DLFCN_H=1 -DLT_OBJDIR=\".libs/\" -DHAVE_APR_POOLS_H=1 -DHAVE_LIBAPR_1=1 -DHAVE_SVN_VERSION_H=1 -DHAVE_LIBSVN_SUBR_1=1 -DHAVE_SVN_DELTA_H=1 -DHAVE_LIBSVN_DELTA_1=1 -DHAVE_LIBCURL=1 -DHAVE_CXX11=1 -DHAVE_PTHREAD_PRIO_INHERIT=1 -DHAVE_PTHREAD=1 -DHAVE_LIBZ=1 -DHAVE_LIBDL=1 -I. -I../../../3rdparty/libprocess  -DBUILD_DIR=\"<https://builds.apache.org/job/mesos-reviewbot/ws/mesos-0.29.0/_build/3rdparty/libprocess\"> -I../../../3rdparty/libprocess/include -I../../../3rdparty/libprocess/3rdparty/stout/include -isystem 3rdparty/boost-1.53.0 -I3rdparty/libev-4.22 -I3rdparty/picojson-1.3.0 -DPICOJSON_USE_INT64 -D__STDC_FORMAT_MACROS  -I3rdparty/glog-0.3.3/src -I3rdparty/http-parser-2.6.2  -I/usr/include/subversion-1 -I/usr/include/apr-1 -I/usr/include/apr-1.0   -g1 -O0 -Wno-unused-local-typedefs -std=c++11 -MT libprocess_la-http.lo -MD -MP -MF .deps/libprocess_la-http.Tpo -c -o libprocess_la-http.lo `test -f 'src/http.cpp' || echo '../../../3rdparty/libprocess/'`src/http.cpp
/bin/bash ./libtool  --tag=CXX   --mode=compile g++ -DPACKAGE_NAME=\"libprocess\" -DPACKAGE_TARNAME=\"libprocess\" -DPACKAGE_VERSION=\"0.0.1\" -DPACKAGE_STRING=\"libprocess\ 0.0.1\" -DPACKAGE_BUGREPORT=\"\" -DPACKAGE_URL=\"\" -DPACKAGE=\"libprocess\" -DVERSION=\"0.0.1\" -DSTDC_HEADERS=1 -DHAVE_SYS_TYPES_H=1 -DHAVE_SYS_STAT_H=1 -DHAVE_STDLIB_H=1 -DHAVE_STRING_H=1 -DHAVE_MEMORY_H=1 -DHAVE_STRINGS_H=1 -DHAVE_INTTYPES_H=1 -DHAVE_STDINT_H=1 -DHAVE_UNISTD_H=1 -DHAVE_DLFCN_H=1 -DLT_OBJDIR=\".libs/\" -DHAVE_APR_POOLS_H=1 -DHAVE_LIBAPR_1=1 -DHAVE_SVN_VERSION_H=1 -DHAVE_LIBSVN_SUBR_1=1 -DHAVE_SVN_DELTA_H=1 -DHAVE_LIBSVN_DELTA_1=1 -DHAVE_LIBCURL=1 -DHAVE_CXX11=1 -DHAVE_PTHREAD_PRIO_INHERIT=1 -DHAVE_PTHREAD=1 -DHAVE_LIBZ=1 -DHAVE_LIBDL=1 -I. -I../../../3rdparty/libprocess  -DBUILD_DIR=\"<https://builds.apache.org/job/mesos-reviewbot/ws/mesos-0.29.0/_build/3rdparty/libprocess\"> -I../../../3rdparty/libprocess/include -I../../../3rdparty/libprocess/3rdparty/stout/include -isystem 3rdparty/boost-1.53.0 -I3rdparty/libev-4.22 -I3rdparty/picojson-1.3.0 -DPICOJSON_USE_INT64 -D__STDC_FORMAT_MACROS  -I3rdparty/glog-0.3.3/src -I3rdparty/http-parser-2.6.2  -I/usr/include/subversion-1 -I/usr/include/apr-1 -I/usr/include/apr-1.0   -g1 -O0 -Wno-unused-local-typedefs -std=c++11 -MT libprocess_la-io.lo -MD -MP -MF .deps/libprocess_la-io.Tpo -c -o libprocess_la-io.lo `test -f 'src/io.cpp' || echo '../../../3rdparty/libprocess/'`src/io.cpp
/bin/bash ./libtool  --tag=CXX   --mode=compile g++ -DPACKAGE_NAME=\"libprocess\" -DPACKAGE_TARNAME=\"libprocess\" -DPACKAGE_VERSION=\"0.0.1\" -DPACKAGE_STRING=\"libprocess\ 0.0.1\" -DPACKAGE_BUGREPORT=\"\" -DPACKAGE_URL=\"\" -DPACKAGE=\"libprocess\" -DVERSION=\"0.0.1\" -DSTDC_HEADERS=1 -DHAVE_SYS_TYPES_H=1 -DHAVE_SYS_STAT_H=1 -DHAVE_STDLIB_H=1 -DHAVE_STRING_H=1 -DHAVE_MEMORY_H=1 -DHAVE_STRINGS_H=1 -DHAVE_INTTYPES_H=1 -DHAVE_STDINT_H=1 -DHAVE_UNISTD_H=1 -DHAVE_DLFCN_H=1 -DLT_OBJDIR=\".libs/\" -DHAVE_APR_POOLS_H=1 -DHAVE_LIBAPR_1=1 -DHAVE_SVN_VERSION_H=1 -DHAVE_LIBSVN_SUBR_1=1 -DHAVE_SVN_DELTA_H=1 -DHAVE_LIBSVN_DELTA_1=1 -DHAVE_LIBCURL=1 -DHAVE_CXX11=1 -DHAVE_PTHREAD_PRIO_INHERIT=1 -DHAVE_PTHREAD=1 -DHAVE_LIBZ=1 -DHAVE_LIBDL=1 -I. -I../../../3rdparty/libprocess  -DBUILD_DIR=\"<https://builds.apache.org/job/mesos-reviewbot/ws/mesos-0.29.0/_build/3rdparty/libprocess\"> -I../../../3rdparty/libprocess/include -I../../../3rdparty/libprocess/3rdparty/stout/include -isystem 3rdparty/boost-1.53.0 -I3rdparty/libev-4.22 -I3rdparty/picojson-1.3.0 -DPICOJSON_USE_INT64 -D__STDC_FORMAT_MACROS  -I3rdparty/glog-0.3.3/src -I3rdparty/http-parser-2.6.2  -I/usr/include/subversion-1 -I/usr/include/apr-1 -I/usr/include/apr-1.0   -g1 -O0 -Wno-unused-local-typedefs -std=c++11 -MT libprocess_la-latch.lo -MD -MP -MF .deps/libprocess_la-latch.Tpo -c -o libprocess_la-latch.lo `test -f 'src/latch.cpp' || echo '../../../3rdparty/libprocess/'`src/latch.cpp
/bin/bash ./libtool  --tag=CXX   --mode=compile g++ -DPACKAGE_NAME=\"libprocess\" -DPACKAGE_TARNAME=\"libprocess\" -DPACKAGE_VERSION=\"0.0.1\" -DPACKAGE_STRING=\"libprocess\ 0.0.1\" -DPACKAGE_BUGREPORT=\"\" -DPACKAGE_URL=\"\" -DPACKAGE=\"libprocess\" -DVERSION=\"0.0.1\" -DSTDC_HEADERS=1 -DHAVE_SYS_TYPES_H=1 -DHAVE_SYS_STAT_H=1 -DHAVE_STDLIB_H=1 -DHAVE_STRING_H=1 -DHAVE_MEMORY_H=1 -DHAVE_STRINGS_H=1 -DHAVE_INTTYPES_H=1 -DHAVE_STDINT_H=1 -DHAVE_UNISTD_H=1 -DHAVE_DLFCN_H=1 -DLT_OBJDIR=\".libs/\" -DHAVE_APR_POOLS_H=1 -DHAVE_LIBAPR_1=1 -DHAVE_SVN_VERSION_H=1 -DHAVE_LIBSVN_SUBR_1=1 -DHAVE_SVN_DELTA_H=1 -DHAVE_LIBSVN_DELTA_1=1 -DHAVE_LIBCURL=1 -DHAVE_CXX11=1 -DHAVE_PTHREAD_PRIO_INHERIT=1 -DHAVE_PTHREAD=1 -DHAVE_LIBZ=1 -DHAVE_LIBDL=1 -I. -I../../../3rdparty/libprocess  -DBUILD_DIR=\"<https://builds.apache.org/job/mesos-reviewbot/ws/mesos-0.29.0/_build/3rdparty/libprocess\"> -I../../../3rdparty/libprocess/include -I../../../3rdparty/libprocess/3rdparty/stout/include -isystem 3rdparty/boost-1.53.0 -I3rdparty/libev-4.22 -I3rdparty/picojson-1.3.0 -DPICOJSON_USE_INT64 -D__STDC_FORMAT_MACROS  -I3rdparty/glog-0.3.3/src -I3rdparty/http-parser-2.6.2  -I/usr/include/subversion-1 -I/usr/include/apr-1 -I/usr/include/apr-1.0   -g1 -O0 -Wno-unused-local-typedefs -std=c++11 -MT libprocess_la-logging.lo -MD -MP -MF .deps/libprocess_la-logging.Tpo -c -o libprocess_la-logging.lo `test -f 'src/logging.cpp' || echo '../../../3rdparty/libprocess/'`src/logging.cpp
/bin/bash ./libtool  --tag=CXX   --mode=compile g++ -DPACKAGE_NAME=\"libprocess\" -DPACKAGE_TARNAME=\"libprocess\" -DPACKAGE_VERSION=\"0.0.1\" -DPACKAGE_STRING=\"libprocess\ 0.0.1\" -DPACKAGE_BUGREPORT=\"\" -DPACKAGE_URL=\"\" -DPACKAGE=\"libprocess\" -DVERSION=\"0.0.1\" -DSTDC_HEADERS=1 -DHAVE_SYS_TYPES_H=1 -DHAVE_SYS_STAT_H=1 -DHAVE_STDLIB_H=1 -DHAVE_STRING_H=1 -DHAVE_MEMORY_H=1 -DHAVE_STRINGS_H=1 -DHAVE_INTTYPES_H=1 -DHAVE_STDINT_H=1 -DHAVE_UNISTD_H=1 -DHAVE_DLFCN_H=1 -DLT_OBJDIR=\".libs/\" -DHAVE_APR_POOLS_H=1 -DHAVE_LIBAPR_1=1 -DHAVE_SVN_VERSION_H=1 -DHAVE_LIBSVN_SUBR_1=1 -DHAVE_SVN_DELTA_H=1 -DHAVE_LIBSVN_DELTA_1=1 -DHAVE_LIBCURL=1 -DHAVE_CXX11=1 -DHAVE_PTHREAD_PRIO_INHERIT=1 -DHAVE_PTHREAD=1 -DHAVE_LIBZ=1 -DHAVE_LIBDL=1 -I. -I../../../3rdparty/libprocess  -DBUILD_DIR=\"<https://builds.apache.org/job/mesos-reviewbot/ws/mesos-0.29.0/_build/3rdparty/libprocess\"> -I../../../3rdparty/libprocess/include -I../../../3rdparty/libprocess/3rdparty/stout/include -isystem 3rdparty/boost-1.53.0 -I3rdparty/libev-4.22 -I3rdparty/picojson-1.3.0 -DPICOJSON_USE_INT64 -D__STDC_FORMAT_MACROS  -I3rdparty/glog-0.3.3/src -I3rdparty/http-parser-2.6.2  -I/usr/include/subversion-1 -I/usr/include/apr-1 -I/usr/include/apr-1.0   -g1 -O0 -Wno-unused-local-typedefs -std=c++11 -MT libprocess_la-metrics.lo -MD -MP -MF .deps/libprocess_la-metrics.Tpo -c -o libprocess_la-metrics.lo `test -f 'src/metrics/metrics.cpp' || echo '../../../3rdparty/libprocess/'`src/metrics/metrics.cpp
libtool: compile:  g++ -DPACKAGE_NAME=\"libprocess\" -DPACKAGE_TARNAME=\"libprocess\" -DPACKAGE_VERSION=\"0.0.1\" "-DPACKAGE_STRING=\"libprocess 0.0.1\"" -DPACKAGE_BUGREPORT=\"\" -DPACKAGE_URL=\"\" -DPACKAGE=\"libprocess\" -DVERSION=\"0.0.1\" -DSTDC_HEADERS=1 -DHAVE_SYS_TYPES_H=1 -DHAVE_SYS_STAT_H=1 -DHAVE_STDLIB_H=1 -DHAVE_STRING_H=1 -DHAVE_MEMORY_H=1 -DHAVE_STRINGS_H=1 -DHAVE_INTTYPES_H=1 -DHAVE_STDINT_H=1 -DHAVE_UNISTD_H=1 -DHAVE_DLFCN_H=1 -DLT_OBJDIR=\".libs/\" -DHAVE_APR_POOLS_H=1 -DHAVE_LIBAPR_1=1 -DHAVE_SVN_VERSION_H=1 -DHAVE_LIBSVN_SUBR_1=1 -DHAVE_SVN_DELTA_H=1 -DHAVE_LIBSVN_DELTA_1=1 -DHAVE_LIBCURL=1 -DHAVE_CXX11=1 -DHAVE_PTHREAD_PRIO_INHERIT=1 -DHAVE_PTHREAD=1 -DHAVE_LIBZ=1 -DHAVE_LIBDL=1 -I. -I../../../3rdparty/libprocess -DBUILD_DIR=\"<https://builds.apache.org/job/mesos-reviewbot/ws/mesos-0.29.0/_build/3rdparty/libprocess\"> -I../../../3rdparty/libprocess/include -I../../../3rdparty/libprocess/3rdparty/stout/include -isystem 3rdparty/boost-1.53.0 -I3rdparty/libev-4.22 -I3rdparty/picojson-1.3.0 -DPICOJSON_USE_INT64 -D__STDC_FORMAT_MACROS -I3rdparty/glog-0.3.3/src -I3rdparty/http-parser-2.6.2 -I/usr/include/subversion-1 -I/usr/include/apr-1 -I/usr/include/apr-1.0 -g1 -O0 -Wno-unused-local-typedefs -std=c++11 -MT libprocess_la-authenticator.lo -MD -MP -MF .deps/libprocess_la-authenticator.Tpo -c ../../../3rdparty/libprocess/src/authenticator.cpp  -fPIC -DPIC -o libprocess_la-authenticator.o
libtool: compile:  g++ -DPACKAGE_NAME=\"libprocess\" -DPACKAGE_TARNAME=\"libprocess\" -DPACKAGE_VERSION=\"0.0.1\" "-DPACKAGE_STRING=\"libprocess 0.0.1\"" -DPACKAGE_BUGREPORT=\"\" -DPACKAGE_URL=\"\" -DPACKAGE=\"libprocess\" -DVERSION=\"0.0.1\" -DSTDC_HEADERS=1 -DHAVE_SYS_TYPES_H=1 -DHAVE_SYS_STAT_H=1 -DHAVE_STDLIB_H=1 -DHAVE_STRING_H=1 -DHAVE_MEMORY_H=1 -DHAVE_STRINGS_H=1 -DHAVE_INTTYPES_H=1 -DHAVE_STDINT_H=1 -DHAVE_UNISTD_H=1 -DHAVE_DLFCN_H=1 -DLT_OBJDIR=\".libs/\" -DHAVE_APR_POOLS_H=1 -DHAVE_LIBAPR_1=1 -DHAVE_SVN_VERSION_H=1 -DHAVE_LIBSVN_SUBR_1=1 -DHAVE_SVN_DELTA_H=1 -DHAVE_LIBSVN_DELTA_1=1 -DHAVE_LIBCURL=1 -DHAVE_CXX11=1 -DHAVE_PTHREAD_PRIO_INHERIT=1 -DHAVE_PTHREAD=1 -DHAVE_LIBZ=1 -DHAVE_LIBDL=1 -I. -I../../../3rdparty/libprocess -DBUILD_DIR=\"<https://builds.apache.org/job/mesos-reviewbot/ws/mesos-0.29.0/_build/3rdparty/libprocess\"> -I../../../3rdparty/libprocess/include -I../../../3rdparty/libprocess/3rdparty/stout/include -isystem 3rdparty/boost-1.53.0 -I3rdparty/libev-4.22 -I3rdparty/picojson-1.3.0 -DPICOJSON_USE_INT64 -D__STDC_FORMAT_MACROS -I3rdparty/glog-0.3.3/src -I3rdparty/http-parser-2.6.2 -I/usr/include/subversion-1 -I/usr/include/apr-1 -I/usr/include/apr-1.0 -g1 -O0 -Wno-unused-local-typedefs -std=c++11 -MT libprocess_la-logging.lo -MD -MP -MF .deps/libprocess_la-logging.Tpo -c ../../../3rdparty/libprocess/src/logging.cpp  -fPIC -DPIC -o libprocess_la-logging.o
libtool: compile:  g++ -DPACKAGE_NAME=\"libprocess\" -DPACKAGE_TARNAME=\"libprocess\" -DPACKAGE_VERSION=\"0.0.1\" "-DPACKAGE_STRING=\"libprocess 0.0.1\"" -DPACKAGE_BUGREPORT=\"\" -DPACKAGE_URL=\"\" -DPACKAGE=\"libprocess\" -DVERSION=\"0.0.1\" -DSTDC_HEADERS=1 -DHAVE_SYS_TYPES_H=1 -DHAVE_SYS_STAT_H=1 -DHAVE_STDLIB_H=1 -DHAVE_STRING_H=1 -DHAVE_MEMORY_H=1 -DHAVE_STRINGS_H=1 -DHAVE_INTTYPES_H=1 -DHAVE_STDINT_H=1 -DHAVE_UNISTD_H=1 -DHAVE_DLFCN_H=1 -DLT_OBJDIR=\".libs/\" -DHAVE_APR_POOLS_H=1 -DHAVE_LIBAPR_1=1 -DHAVE_SVN_VERSION_H=1 -DHAVE_LIBSVN_SUBR_1=1 -DHAVE_SVN_DELTA_H=1 -DHAVE_LIBSVN_DELTA_1=1 -DHAVE_LIBCURL=1 -DHAVE_CXX11=1 -DHAVE_PTHREAD_PRIO_INHERIT=1 -DHAVE_PTHREAD=1 -DHAVE_LIBZ=1 -DHAVE_LIBDL=1 -I. -I../../../3rdparty/libprocess -DBUILD_DIR=\"<https://builds.apache.org/job/mesos-reviewbot/ws/mesos-0.29.0/_build/3rdparty/libprocess\"> -I../../../3rdparty/libprocess/include -I../../../3rdparty/libprocess/3rdparty/stout/include -isystem 3rdparty/boost-1.53.0 -I3rdparty/libev-4.22 -I3rdparty/picojson-1.3.0 -DPICOJSON_USE_INT64 -D__STDC_FORMAT_MACROS -I3rdparty/glog-0.3.3/src -I3rdparty/http-parser-2.6.2 -I/usr/include/subversion-1 -I/usr/include/apr-1 -I/usr/include/apr-1.0 -g1 -O0 -Wno-unused-local-typedefs -std=c++11 -MT libprocess_la-authenticator_manager.lo -MD -MP -MF .deps/libprocess_la-authenticator_manager.Tpo -c ../../../3rdparty/libprocess/src/authenticator_manager.cpp  -fPIC -DPIC -o libprocess_la-authenticator_manager.o
libtool: compile:  g++ -DPACKAGE_NAME=\"libprocess\" -DPACKAGE_TARNAME=\"libprocess\" -DPACKAGE_VERSION=\"0.0.1\" "-DPACKAGE_STRING=\"libprocess 0.0.1\"" -DPACKAGE_BUGREPORT=\"\" -DPACKAGE_URL=\"\" -DPACKAGE=\"libprocess\" -DVERSION=\"0.0.1\" -DSTDC_HEADERS=1 -DHAVE_SYS_TYPES_H=1 -DHAVE_SYS_STAT_H=1 -DHAVE_STDLIB_H=1 -DHAVE_STRING_H=1 -DHAVE_MEMORY_H=1 -DHAVE_STRINGS_H=1 -DHAVE_INTTYPES_H=1 -DHAVE_STDINT_H=1 -DHAVE_UNISTD_H=1 -DHAVE_DLFCN_H=1 -DLT_OBJDIR=\".libs/\" -DHAVE_APR_POOLS_H=1 -DHAVE_LIBAPR_1=1 -DHAVE_SVN_VERSION_H=1 -DHAVE_LIBSVN_SUBR_1=1 -DHAVE_SVN_DELTA_H=1 -DHAVE_LIBSVN_DELTA_1=1 -DHAVE_LIBCURL=1 -DHAVE_CXX11=1 -DHAVE_PTHREAD_PRIO_INHERIT=1 -DHAVE_PTHREAD=1 -DHAVE_LIBZ=1 -DHAVE_LIBDL=1 -I. -I../../../3rdparty/libprocess -DBUILD_DIR=\"<https://builds.apache.org/job/mesos-reviewbot/ws/mesos-0.29.0/_build/3rdparty/libprocess\"> -I../../../3rdparty/libprocess/include -I../../../3rdparty/libprocess/3rdparty/stout/include -isystem 3rdparty/boost-1.53.0 -I3rdparty/libev-4.22 -I3rdparty/picojson-1.3.0 -DPICOJSON_USE_INT64 -D__STDC_FORMAT_MACROS -I3rdparty/glog-0.3.3/src -I3rdparty/http-parser-2.6.2 -I/usr/include/subversion-1 -I/usr/include/apr-1 -I/usr/include/apr-1.0 -g1 -O0 -Wno-unused-local-typedefs -std=c++11 -MT libprocess_la-clock.lo -MD -MP -MF .deps/libprocess_la-clock.Tpo -c ../../../3rdparty/libprocess/src/clock.cpp  -fPIC -DPIC -o libprocess_la-clock.o
libtool: compile:  g++ -DPACKAGE_NAME=\"libprocess\" -DPACKAGE_TARNAME=\"libprocess\" -DPACKAGE_VERSION=\"0.0.1\" "-DPACKAGE_STRING=\"libprocess 0.0.1\"" -DPACKAGE_BUGREPORT=\"\" -DPACKAGE_URL=\"\" -DPACKAGE=\"libprocess\" -DVERSION=\"0.0.1\" -DSTDC_HEADERS=1 -DHAVE_SYS_TYPES_H=1 -DHAVE_SYS_STAT_H=1 -DHAVE_STDLIB_H=1 -DHAVE_STRING_H=1 -DHAVE_MEMORY_H=1 -DHAVE_STRINGS_H=1 -DHAVE_INTTYPES_H=1 -DHAVE_STDINT_H=1 -DHAVE_UNISTD_H=1 -DHAVE_DLFCN_H=1 -DLT_OBJDIR=\".libs/\" -DHAVE_APR_POOLS_H=1 -DHAVE_LIBAPR_1=1 -DHAVE_SVN_VERSION_H=1 -DHAVE_LIBSVN_SUBR_1=1 -DHAVE_SVN_DELTA_H=1 -DHAVE_LIBSVN_DELTA_1=1 -DHAVE_LIBCURL=1 -DHAVE_CXX11=1 -DHAVE_PTHREAD_PRIO_INHERIT=1 -DHAVE_PTHREAD=1 -DHAVE_LIBZ=1 -DHAVE_LIBDL=1 -I. -I../../../3rdparty/libprocess -DBUILD_DIR=\"<https://builds.apache.org/job/mesos-reviewbot/ws/mesos-0.29.0/_build/3rdparty/libprocess\"> -I../../../3rdparty/libprocess/include -I../../../3rdparty/libprocess/3rdparty/stout/include -isystem 3rdparty/boost-1.53.0 -I3rdparty/libev-4.22 -I3rdparty/picojson-1.3.0 -DPICOJSON_USE_INT64 -D__STDC_FORMAT_MACROS -I3rdparty/glog-0.3.3/src -I3rdparty/http-parser-2.6.2 -I/usr/include/subversion-1 -I/usr/include/apr-1 -I/usr/include/apr-1.0 -g1 -O0 -Wno-unused-local-typedefs -std=c++11 -MT libprocess_la-help.lo -MD -MP -MF .deps/libprocess_la-help.Tpo -c ../../../3rdparty/libprocess/src/help.cpp  -fPIC -DPIC -o libprocess_la-help.o
libtool: compile:  g++ -DPACKAGE_NAME=\"libprocess\" -DPACKAGE_TARNAME=\"libprocess\" -DPACKAGE_VERSION=\"0.0.1\" "-DPACKAGE_STRING=\"libprocess 0.0.1\"" -DPACKAGE_BUGREPORT=\"\" -DPACKAGE_URL=\"\" -DPACKAGE=\"libprocess\" -DVERSION=\"0.0.1\" -DSTDC_HEADERS=1 -DHAVE_SYS_TYPES_H=1 -DHAVE_SYS_STAT_H=1 -DHAVE_STDLIB_H=1 -DHAVE_STRING_H=1 -DHAVE_MEMORY_H=1 -DHAVE_STRINGS_H=1 -DHAVE_INTTYPES_H=1 -DHAVE_STDINT_H=1 -DHAVE_UNISTD_H=1 -DHAVE_DLFCN_H=1 -DLT_OBJDIR=\".libs/\" -DHAVE_APR_POOLS_H=1 -DHAVE_LIBAPR_1=1 -DHAVE_SVN_VERSION_H=1 -DHAVE_LIBSVN_SUBR_1=1 -DHAVE_SVN_DELTA_H=1 -DHAVE_LIBSVN_DELTA_1=1 -DHAVE_LIBCURL=1 -DHAVE_CXX11=1 -DHAVE_PTHREAD_PRIO_INHERIT=1 -DHAVE_PTHREAD=1 -DHAVE_LIBZ=1 -DHAVE_LIBDL=1 -I. -I../../../3rdparty/libprocess -DBUILD_DIR=\"<https://builds.apache.org/job/mesos-reviewbot/ws/mesos-0.29.0/_build/3rdparty/libprocess\"> -I../../../3rdparty/libprocess/include -I../../../3rdparty/libprocess/3rdparty/stout/include -isystem 3rdparty/boost-1.53.0 -I3rdparty/libev-4.22 -I3rdparty/picojson-1.3.0 -DPICOJSON_USE_INT64 -D__STDC_FORMAT_MACROS -I3rdparty/glog-0.3.3/src -I3rdparty/http-parser-2.6.2 -I/usr/include/subversion-1 -I/usr/include/apr-1 -I/usr/include/apr-1.0 -g1 -O0 -Wno-unused-local-typedefs -std=c++11 -MT libprocess_la-metrics.lo -MD -MP -MF .deps/libprocess_la-metrics.Tpo -c ../../../3rdparty/libprocess/src/metrics/metrics.cpp  -fPIC -DPIC -o libprocess_la-metrics.o
libtool: compile:  g++ -DPACKAGE_NAME=\"libprocess\" -DPACKAGE_TARNAME=\"libprocess\" -DPACKAGE_VERSION=\"0.0.1\" "-DPACKAGE_STRING=\"libprocess 0.0.1\"" -DPACKAGE_BUGREPORT=\"\" -DPACKAGE_URL=\"\" -DPACKAGE=\"libprocess\" -DVERSION=\"0.0.1\" -DSTDC_HEADERS=1 -DHAVE_SYS_TYPES_H=1 -DHAVE_SYS_STAT_H=1 -DHAVE_STDLIB_H=1 -DHAVE_STRING_H=1 -DHAVE_MEMORY_H=1 -DHAVE_STRINGS_H=1 -DHAVE_INTTYPES_H=1 -DHAVE_STDINT_H=1 -DHAVE_UNISTD_H=1 -DHAVE_DLFCN_H=1 -DLT_OBJDIR=\".libs/\" -DHAVE_APR_POOLS_H=1 -DHAVE_LIBAPR_1=1 -DHAVE_SVN_VERSION_H=1 -DHAVE_LIBSVN_SUBR_1=1 -DHAVE_SVN_DELTA_H=1 -DHAVE_LIBSVN_DELTA_1=1 -DHAVE_LIBCURL=1 -DHAVE_CXX11=1 -DHAVE_PTHREAD_PRIO_INHERIT=1 -DHAVE_PTHREAD=1 -DHAVE_LIBZ=1 -DHAVE_LIBDL=1 -I. -I../../../3rdparty/libprocess -DBUILD_DIR=\"<https://builds.apache.org/job/mesos-reviewbot/ws/mesos-0.29.0/_build/3rdparty/libprocess\"> -I../../../3rdparty/libprocess/include -I../../../3rdparty/libprocess/3rdparty/stout/include -isystem 3rdparty/boost-1.53.0 -I3rdparty/libev-4.22 -I3rdparty/picojson-1.3.0 -DPICOJSON_USE_INT64 -D__STDC_FORMAT_MACROS -I3rdparty/glog-0.3.3/src -I3rdparty/http-parser-2.6.2 -I/usr/include/subversion-1 -I/usr/include/apr-1 -I/usr/include/apr-1.0 -g1 -O0 -Wno-unused-local-typedefs -std=c++11 -MT libprocess_la-http.lo -MD -MP -MF .deps/libprocess_la-http.Tpo -c ../../../3rdparty/libprocess/src/http.cpp  -fPIC -DPIC -o libprocess_la-http.o
libtool: compile:  g++ -DPACKAGE_NAME=\"libprocess\" -DPACKAGE_TARNAME=\"libprocess\" -DPACKAGE_VERSION=\"0.0.1\" "-DPACKAGE_STRING=\"libprocess 0.0.1\"" -DPACKAGE_BUGREPORT=\"\" -DPACKAGE_URL=\"\" -DPACKAGE=\"libprocess\" -DVERSION=\"0.0.1\" -DSTDC_HEADERS=1 -DHAVE_SYS_TYPES_H=1 -DHAVE_SYS_STAT_H=1 -DHAVE_STDLIB_H=1 -DHAVE_STRING_H=1 -DHAVE_MEMORY_H=1 -DHAVE_STRINGS_H=1 -DHAVE_INTTYPES_H=1 -DHAVE_STDINT_H=1 -DHAVE_UNISTD_H=1 -DHAVE_DLFCN_H=1 -DLT_OBJDIR=\".libs/\" -DHAVE_APR_POOLS_H=1 -DHAVE_LIBAPR_1=1 -DHAVE_SVN_VERSION_H=1 -DHAVE_LIBSVN_SUBR_1=1 -DHAVE_SVN_DELTA_H=1 -DHAVE_LIBSVN_DELTA_1=1 -DHAVE_LIBCURL=1 -DHAVE_CXX11=1 -DHAVE_PTHREAD_PRIO_INHERIT=1 -DHAVE_PTHREAD=1 -DHAVE_LIBZ=1 -DHAVE_LIBDL=1 -I. -I../../../3rdparty/libprocess -DBUILD_DIR=\"<https://builds.apache.org/job/mesos-reviewbot/ws/mesos-0.29.0/_build/3rdparty/libprocess\"> -I../../../3rdparty/libprocess/include -I../../../3rdparty/libprocess/3rdparty/stout/include -isystem 3rdparty/boost-1.53.0 -I3rdparty/libev-4.22 -I3rdparty/picojson-1.3.0 -DPICOJSON_USE_INT64 -D__STDC_FORMAT_MACROS -I3rdparty/glog-0.3.3/src -I3rdparty/http-parser-2.6.2 -I/usr/include/subversion-1 -I/usr/include/apr-1 -I/usr/include/apr-1.0 -g1 -O0 -Wno-unused-local-typedefs -std=c++11 -MT libprocess_la-latch.lo -MD -MP -MF .deps/libprocess_la-latch.Tpo -c ../../../3rdparty/libprocess/src/latch.cpp  -fPIC -DPIC -o libprocess_la-latch.o
libtool: compile:  g++ -DPACKAGE_NAME=\"libprocess\" -DPACKAGE_TARNAME=\"libprocess\" -DPACKAGE_VERSION=\"0.0.1\" "-DPACKAGE_STRING=\"libprocess 0.0.1\"" -DPACKAGE_BUGREPORT=\"\" -DPACKAGE_URL=\"\" -DPACKAGE=\"libprocess\" -DVERSION=\"0.0.1\" -DSTDC_HEADERS=1 -DHAVE_SYS_TYPES_H=1 -DHAVE_SYS_STAT_H=1 -DHAVE_STDLIB_H=1 -DHAVE_STRING_H=1 -DHAVE_MEMORY_H=1 -DHAVE_STRINGS_H=1 -DHAVE_INTTYPES_H=1 -DHAVE_STDINT_H=1 -DHAVE_UNISTD_H=1 -DHAVE_DLFCN_H=1 -DLT_OBJDIR=\".libs/\" -DHAVE_APR_POOLS_H=1 -DHAVE_LIBAPR_1=1 -DHAVE_SVN_VERSION_H=1 -DHAVE_LIBSVN_SUBR_1=1 -DHAVE_SVN_DELTA_H=1 -DHAVE_LIBSVN_DELTA_1=1 -DHAVE_LIBCURL=1 -DHAVE_CXX11=1 -DHAVE_PTHREAD_PRIO_INHERIT=1 -DHAVE_PTHREAD=1 -DHAVE_LIBZ=1 -DHAVE_LIBDL=1 -I. -I../../../3rdparty/libprocess -DBUILD_DIR=\"<https://builds.apache.org/job/mesos-reviewbot/ws/mesos-0.29.0/_build/3rdparty/libprocess\"> -I../../../3rdparty/libprocess/include -I../../../3rdparty/libprocess/3rdparty/stout/include -isystem 3rdparty/boost-1.53.0 -I3rdparty/libev-4.22 -I3rdparty/picojson-1.3.0 -DPICOJSON_USE_INT64 -D__STDC_FORMAT_MACROS -I3rdparty/glog-0.3.3/src -I3rdparty/http-parser-2.6.2 -I/usr/include/subversion-1 -I/usr/include/apr-1 -I/usr/include/apr-1.0 -g1 -O0 -Wno-unused-local-typedefs -std=c++11 -MT libprocess_la-io.lo -MD -MP -MF .deps/libprocess_la-io.Tpo -c ../../../3rdparty/libprocess/src/io.cpp  -fPIC -DPIC -o libprocess_la-io.o
libtool: compile:  g++ -DPACKAGE_NAME=\"libprocess\" -DPACKAGE_TARNAME=\"libprocess\" -DPACKAGE_VERSION=\"0.0.1\" "-DPACKAGE_STRING=\"libprocess 0.0.1\"" -DPACKAGE_BUGREPORT=\"\" -DPACKAGE_URL=\"\" -DPACKAGE=\"libprocess\" -DVERSION=\"0.0.1\" -DSTDC_HEADERS=1 -DHAVE_SYS_TYPES_H=1 -DHAVE_SYS_STAT_H=1 -DHAVE_STDLIB_H=1 -DHAVE_STRING_H=1 -DHAVE_MEMORY_H=1 -DHAVE_STRINGS_H=1 -DHAVE_INTTYPES_H=1 -DHAVE_STDINT_H=1 -DHAVE_UNISTD_H=1 -DHAVE_DLFCN_H=1 -DLT_OBJDIR=\".libs/\" -DHAVE_APR_POOLS_H=1 -DHAVE_LIBAPR_1=1 -DHAVE_SVN_VERSION_H=1 -DHAVE_LIBSVN_SUBR_1=1 -DHAVE_SVN_DELTA_H=1 -DHAVE_LIBSVN_DELTA_1=1 -DHAVE_LIBCURL=1 -DHAVE_CXX11=1 -DHAVE_PTHREAD_PRIO_INHERIT=1 -DHAVE_PTHREAD=1 -DHAVE_LIBZ=1 -DHAVE_LIBDL=1 -I. -I../../../3rdparty/libprocess -DBUILD_DIR=\"<https://builds.apache.org/job/mesos-reviewbot/ws/mesos-0.29.0/_build/3rdparty/libprocess\"> -I../../../3rdparty/libprocess/include -I../../../3rdparty/libprocess/3rdparty/stout/include -isystem 3rdparty/boost-1.53.0 -I3rdparty/libev-4.22 -I3rdparty/picojson-1.3.0 -DPICOJSON_USE_INT64 -D__STDC_FORMAT_MACROS -I3rdparty/glog-0.3.3/src -I3rdparty/http-parser-2.6.2 -I/usr/include/subversion-1 -I/usr/include/apr-1 -I/usr/include/apr-1.0 -g1 -O0 -Wno-unused-local-typedefs -std=c++11 -MT libprocess_la-firewall.lo -MD -MP -MF .deps/libprocess_la-firewall.Tpo -c ../../../3rdparty/libprocess/src/firewall.cpp  -fPIC -DPIC -o libprocess_la-firewall.o
In file included from ../../../3rdparty/libprocess/3rdparty/stout/include/stout/os/open.hpp:25:0,
                 from ../../../3rdparty/libprocess/3rdparty/stout/include/stout/net.hpp:57,
                 from ../../../3rdparty/libprocess/include/process/address.hpp:33,
                 from ../../../3rdparty/libprocess/include/process/pid.hpp:23,
                 from ../../../3rdparty/libprocess/include/process/latch.hpp:18,
                 from ../../../3rdparty/libprocess/include/process/future.hpp:30,
                 from ../../../3rdparty/libprocess/include/process/authenticator.hpp:18,
                 from ../../../3rdparty/libprocess/src/authenticator.cpp:13:
../../../3rdparty/libprocess/3rdparty/stout/include/stout/os/close.hpp:20:36: fatal error: stout/os/posix/close.hpp: No such file or directory
 #include <stout/os/posix/close.hpp>
                                    ^
compilation terminated.
In file included from ../../../3rdparty/libprocess/3rdparty/stout/include/stout/os/open.hpp:25:0,
                 from ../../../3rdparty/libprocess/3rdparty/stout/include/stout/net.hpp:57,
                 from ../../../3rdparty/libprocess/include/process/address.hpp:33,
                 from ../../../3rdparty/libprocess/include/process/pid.hpp:23,
                 from ../../../3rdparty/libprocess/include/process/latch.hpp:18,
                 from ../../../3rdparty/libprocess/include/process/future.hpp:30,
                 from ../../../3rdparty/libprocess/include/process/authenticator.hpp:18,
                 from ../../../3rdparty/libprocess/src/authenticator_manager.hpp:18,
                 from ../../../3rdparty/libprocess/src/authenticator_manager.cpp:13:
../../../3rdparty/libprocess/3rdparty/stout/include/stout/os/close.hpp:20:36: fatal error: stout/os/posix/close.hpp: No such file or directory
 #include <stout/os/posix/close.hpp>
                                    ^
compilation terminated.
In file included from ../../../3rdparty/libprocess/3rdparty/stout/include/stout/os/open.hpp:25:0,
                 from ../../../3rdparty/libprocess/3rdparty/stout/include/stout/net.hpp:57,
                 from ../../../3rdparty/libprocess/include/process/address.hpp:33,
                 from ../../../3rdparty/libprocess/include/process/pid.hpp:23,
                 from ../../../3rdparty/libprocess/src/clock.cpp:21:
../../../3rdparty/libprocess/3rdparty/stout/include/stout/os/close.hpp:20:36: fatal error: stout/os/posix/close.hpp: No such file or directory
 #include <stout/os/posix/close.hpp>
                                    ^
compilation terminated.
In file included from ../../../3rdparty/libprocess/3rdparty/stout/include/stout/os/open.hpp:25:0,
                 from ../../../3rdparty/libprocess/3rdparty/stout/include/stout/net.hpp:57,
                 from ../../../3rdparty/libprocess/include/process/address.hpp:33,
                 from ../../../3rdparty/libprocess/include/process/pid.hpp:23,
                 from ../../../3rdparty/libprocess/include/process/latch.hpp:18,
                 from ../../../3rdparty/libprocess/include/process/future.hpp:30,
                 from ../../../3rdparty/libprocess/include/process/help.hpp:18,
                 from ../../../3rdparty/libprocess/src/help.cpp:17:
../../../3rdparty/libprocess/3rdparty/stout/include/stout/os/close.hpp:20:36: fatal error: stout/os/posix/close.hpp: No such file or directory
 #include <stout/os/posix/close.hpp>
                                    ^
compilation terminated.
In file included from ../../../3rdparty/libprocess/3rdparty/stout/include/stout/os/open.hpp:25:0,
                 from ../../../3rdparty/libprocess/3rdparty/stout/include/stout/net.hpp:57,
                 from ../../../3rdparty/libprocess/include/process/address.hpp:33,
                 from ../../../3rdparty/libprocess/include/process/pid.hpp:23,
                 from ../../../3rdparty/libprocess/include/process/latch.hpp:18,
                 from ../../../3rdparty/libprocess/src/latch.cpp:14:
../../../3rdparty/libprocess/3rdparty/stout/include/stout/os/close.hpp:20:36: fatal error: stout/os/posix/close.hpp: No such file or directory
 #include <stout/os/posix/close.hpp>
                                    ^
compilation terminated.
In file included from ../../../3rdparty/libprocess/3rdparty/stout/include/stout/os/open.hpp:25:0,
                 from ../../../3rdparty/libprocess/3rdparty/stout/include/stout/net.hpp:57,
                 from ../../../3rdparty/libprocess/include/process/address.hpp:33,
                 from ../../../3rdparty/libprocess/include/process/pid.hpp:23,
                 from ../../../3rdparty/libprocess/include/process/latch.hpp:18,
                 from ../../../3rdparty/libprocess/include/process/future.hpp:30,
                 from ../../../3rdparty/libprocess/src/io.cpp:18:
../../../3rdparty/libprocess/3rdparty/stout/include/stout/os/close.hpp:20:36: fatal error: stout/os/posix/close.hpp: No such file or directory
 #include <stout/os/posix/close.hpp>
                                    ^
compilation terminated.
In file included from ../../../3rdparty/libprocess/3rdparty/stout/include/stout/os/open.hpp:25:0,
                 from ../../../3rdparty/libprocess/3rdparty/stout/include/stout/net.hpp:57,
                 from ../../../3rdparty/libprocess/include/process/address.hpp:33,
                 from ../../../3rdparty/libprocess/include/process/pid.hpp:23,
                 from ../../../3rdparty/libprocess/include/process/latch.hpp:18,
                 from ../../../3rdparty/libprocess/include/process/future.hpp:30,
                 from ../../../3rdparty/libprocess/include/process/check.hpp:21,
                 from ../../../3rdparty/libprocess/include/process/collect.hpp:20,
                 from ../../../3rdparty/libprocess/src/metrics/metrics.cpp:19:
../../../3rdparty/libprocess/3rdparty/stout/include/stout/os/close.hpp:20:36: fatal error: stout/os/posix/close.hpp: No such file or directory
 #include <stout/os/posix/close.hpp>
                                    ^
compilation terminated.
In file included from ../../../3rdparty/libprocess/3rdparty/stout/include/stout/os/open.hpp:25:0,
                 from ../../../3rdparty/libprocess/3rdparty/stout/include/stout/net.hpp:57,
                 from ../../../3rdparty/libprocess/include/process/address.hpp:33,
                 from ../../../3rdparty/libprocess/include/process/process.hpp:22,
                 from ../../../3rdparty/libprocess/include/process/dispatch.hpp:20,
                 from ../../../3rdparty/libprocess/include/process/async.hpp:18,
                 from ../../../3rdparty/libprocess/src/http.cpp:34:
../../../3rdparty/libprocess/3rdparty/stout/include/stout/os/close.hpp:20:36: fatal error: stout/os/posix/close.hpp: No such file or directory
 #include <stout/os/posix/close.hpp>
                                    ^
compilation terminated.
In file included from ../../../3rdparty/libprocess/3rdparty/stout/include/stout/os/open.hpp:25:0,
                 from ../../../3rdparty/libprocess/3rdparty/stout/include/stout/net.hpp:57,
                 from ../../../3rdparty/libprocess/include/process/address.hpp:33,
                 from ../../../3rdparty/libprocess/include/process/http.hpp:29,
                 from ../../../3rdparty/libprocess/include/process/firewall.hpp:18,
                 from ../../../3rdparty/libprocess/src/firewall.cpp:15:
../../../3rdparty/libprocess/3rdparty/stout/include/stout/os/close.hpp:20:36: fatal error: stout/os/posix/close.hpp: No such file or directory
 #include <stout/os/posix/close.hpp>
                                    ^
compilation terminated.
In file included from ../../../3rdparty/libprocess/3rdparty/stout/include/stout/os/open.hpp:25:0,
                 from ../../../3rdparty/libprocess/3rdparty/stout/include/stout/net.hpp:57,
                 from ../../../3rdparty/libprocess/include/process/address.hpp:33,
                 from ../../../3rdparty/libprocess/include/process/process.hpp:22,
                 from ../../../3rdparty/libprocess/include/process/dispatch.hpp:20,
                 from ../../../3rdparty/libprocess/include/process/delay.hpp:17,
                 from ../../../3rdparty/libprocess/src/logging.cpp:15:
../../../3rdparty/libprocess/3rdparty/stout/include/stout/os/close.hpp:20:36: fatal error: stout/os/posix/close.hpp: No such file or directory
 #include <stout/os/posix/close.hpp>
                                    ^
compilation terminated.
make[5]: *** [libprocess_la-help.lo] Error 1
make[5]: *** Waiting for unfinished jobs....
make[5]: *** [libprocess_la-authenticator.lo] Error 1
make[5]: *** [libprocess_la-latch.lo] Error 1
make[5]: *** [libprocess_la-clock.lo] Error 1
make[5]: *** [libprocess_la-logging.lo] Error 1
make[5]: *** [libprocess_la-firewall.lo] Error 1
make[5]: *** [libprocess_la-metrics.lo] Error 1
make[5]: *** [libprocess_la-io.lo] Error 1
make[5]: *** [libprocess_la-authenticator_manager.lo] Error 1
make[5]: *** [libprocess_la-http.lo] Error 1
make[5]: Leaving directory `<https://builds.apache.org/job/mesos-reviewbot/ws/mesos-0.29.0/_build/3rdparty/libprocess'>
make[4]: *** [all-recursive] Error 1
make[4]: Leaving directory `<https://builds.apache.org/job/mesos-reviewbot/ws/mesos-0.29.0/_build/3rdparty/libprocess'>
make[3]: *** [all-recursive] Error 1
make[3]: Leaving directory `<https://builds.apache.org/job/mesos-reviewbot/ws/mesos-0.29.0/_build/3rdparty'>
make[2]: *** [all] Error 2
make[2]: Leaving directory `<https://builds.apache.org/job/mesos-reviewbot/ws/mesos-0.29.0/_build/3rdparty'>
make[1]: *** [all-recursive] Error 1
make[1]: Leaving directory `<https://builds.apache.org/job/mesos-reviewbot/ws/mesos-0.29.0/_build'>
make: *** [distcheck] Error 1
Build step 'Execute shell' marked build as failure

Mime
View raw message