mesos-builds mailing list archives

Site index · List index
Message view « Date » · « Thread »
Top « Date » · « Thread »
From Greg Mann <g...@mesosphere.io>
Subject Re: Build failed in Jenkins: Mesos » gcc,--verbose --enable-libevent --enable-ssl,GLOG_v=1 MESOS_VERBOSE=1,ubuntu:14.04,(docker||Hadoop)&&(!ubuntu-us1) #1886
Date Tue, 29 Mar 2016 03:37:24 GMT
Fix here: https://reviews.apache.org/r/45397/

On Mon, Mar 28, 2016 at 7:19 PM, Apache Jenkins Server <
jenkins@builds.apache.org> wrote:

> See <
> https://builds.apache.org/job/Mesos/COMPILER=gcc,CONFIGURATION=--verbose%20--enable-libevent%20--enable-ssl,ENVIRONMENT=GLOG_v=1%20MESOS_VERBOSE=1,OS=ubuntu%3A14.04,label_exp=(docker%7C%7CHadoop)&&(!ubuntu-us1)/1886/changes
> >
>
> Changes:
>
> [bmahler] Added devices subsystem support in cgroups library.
>
> [bmahler] Added tests for cgroups devices subsystem.
>
> ------------------------------------------
> [...truncated 6568 lines...]
> ../../../3rdparty/libprocess/3rdparty/stout/include/stout/foreach.hpp:59:3:
> note: in expansion of macro 'foreachpair'
>    foreachpair (__foreach__::ignore, VAR, COL)
>    ^
> ../../../3rdparty/libprocess/3rdparty/stout/include/stout/flags/flags.hpp:805:3:
> note: in expansion of macro 'foreachvalue'
>    foreachvalue (const flags::Flag& flag, *this) {
>    ^
> ../../../3rdparty/libprocess/3rdparty/stout/include/stout/foreach.hpp:44:29:
> note: candidate is:
>              for (VARFIRST = BOOST_FOREACH_DEREF(COL).first;             \
>                              ^
> ../../../3rdparty/libprocess/3rdparty/stout/include/stout/foreach.hpp:53:21:
> note: in expansion of macro 'BOOST_FOREACH_PAIR'
>  #define foreachpair BOOST_FOREACH_PAIR
>                      ^
> ../../../3rdparty/libprocess/3rdparty/stout/include/stout/foreach.hpp:59:3:
> note: in expansion of macro 'foreachpair'
>    foreachpair (__foreach__::ignore, VAR, COL)
>    ^
> ../../../3rdparty/libprocess/3rdparty/stout/include/stout/flags/flags.hpp:805:3:
> note: in expansion of macro 'foreachvalue'
>    foreachvalue (const flags::Flag& flag, *this) {
>    ^
> 3rdparty/boost-1.53.0/boost/foreach.hpp:769:1: note: template<class T,
> class C> typename boost::foreach_detail_::foreach_reference<T, C>::type
> boost::foreach_detail_::deref(boost::foreach_detail_::auto_any_t,
> boost::foreach_detail_::type2type<T, C>*)
>  deref(auto_any_t cur, type2type<T, C> *)
>  ^
> 3rdparty/boost-1.53.0/boost/foreach.hpp:769:1: note:   substitution of
> deduced template arguments resulted in errors seen above
> In file included from
> ../../../3rdparty/libprocess/3rdparty/stout/include/stout/strings.hpp:22:0,
>                  from
> ../../../3rdparty/libprocess/3rdparty/stout/include/stout/numify.hpp:25,
>                  from
> ../../../3rdparty/libprocess/3rdparty/stout/include/stout/ip.hpp:56,
>                  from
> ../../../3rdparty/libprocess/include/process/address.hpp:32,
>                  from ../../../3rdparty/libprocess/src/process.cpp:57:
> ../../../3rdparty/libprocess/3rdparty/stout/include/stout/flags/flags.hpp:805:23:
> error: 'Flag' in 'enum flags' does not name a type
>    foreachvalue (const flags::Flag& flag, *this) {
>                        ^
> ../../../3rdparty/libprocess/3rdparty/stout/include/stout/foreach.hpp:48:22:
> note: in definition of macro 'BOOST_FOREACH_PAIR'
>                  for (VARSECOND = BOOST_FOREACH_DEREF(COL).second;       \
>                       ^
> ../../../3rdparty/libprocess/3rdparty/stout/include/stout/flags/flags.hpp:805:3:
> note: in expansion of macro 'foreachvalue'
>    foreachvalue (const flags::Flag& flag, *this) {
>    ^
> ../../../3rdparty/libprocess/3rdparty/stout/include/stout/foreach.hpp:49:22:
> error: expected ';' before '!' token
>                       !BOOST_FOREACH_ID(_foreach_continue);              \
>                       ^
> ../../../3rdparty/libprocess/3rdparty/stout/include/stout/foreach.hpp:53:21:
> note: in expansion of macro 'BOOST_FOREACH_PAIR'
>  #define foreachpair BOOST_FOREACH_PAIR
>                      ^
> ../../../3rdparty/libprocess/3rdparty/stout/include/stout/foreach.hpp:59:3:
> note: in expansion of macro 'foreachpair'
>    foreachpair (__foreach__::ignore, VAR, COL)
>    ^
> ../../../3rdparty/libprocess/3rdparty/stout/include/stout/flags/flags.hpp:805:3:
> note: in expansion of macro 'foreachvalue'
>    foreachvalue (const flags::Flag& flag, *this) {
>    ^
> In file included from
> ../../../3rdparty/libprocess/3rdparty/stout/include/stout/flags.hpp:16:0,
>                  from ../../../3rdparty/libprocess/src/openssl.hpp:20,
>                  from ../../../3rdparty/libprocess/src/process.cpp:105:
> ../../../3rdparty/libprocess/3rdparty/stout/include/stout/flags/flags.hpp:806:9:
> error: 'flag' was not declared in this scope
>      if (flag.boolean) {
>          ^
> ../../../3rdparty/libprocess/3rdparty/stout/include/stout/flags/flags.hpp:811:34:
> error: 'flag' was not declared in this scope
>      width = std::max(width, col1[flag.name].size());
>                                   ^
> In file included from
> ../../../3rdparty/libprocess/3rdparty/stout/include/stout/foreach.hpp:16:0,
>                  from
> ../../../3rdparty/libprocess/3rdparty/stout/include/stout/strings.hpp:22,
>                  from
> ../../../3rdparty/libprocess/3rdparty/stout/include/stout/numify.hpp:25,
>                  from
> ../../../3rdparty/libprocess/3rdparty/stout/include/stout/ip.hpp:56,
>                  from
> ../../../3rdparty/libprocess/include/process/address.hpp:32,
>                  from ../../../3rdparty/libprocess/src/process.cpp:57:
> ../../../3rdparty/libprocess/3rdparty/stout/include/stout/foreach.hpp:44:29:
> error: no matching function for call to 'deref(const
> boost::foreach_detail_::auto_any_base&,
> boost::foreach_detail_::type2type<flags::FlagsBase, mpl_::bool_<true> >*)'
>              for (VARFIRST = BOOST_FOREACH_DEREF(COL).first;             \
>                              ^
> ../../../3rdparty/libprocess/3rdparty/stout/include/stout/foreach.hpp:53:21:
> note: in expansion of macro 'BOOST_FOREACH_PAIR'
>  #define foreachpair BOOST_FOREACH_PAIR
>                      ^
> ../../../3rdparty/libprocess/3rdparty/stout/include/stout/foreach.hpp:59:3:
> note: in expansion of macro 'foreachpair'
>    foreachpair (__foreach__::ignore, VAR, COL)
>    ^
> ../../../3rdparty/libprocess/3rdparty/stout/include/stout/flags/flags.hpp:814:3:
> note: in expansion of macro 'foreachvalue'
>    foreachvalue (const flags::Flag& flag, *this) {
>    ^
> ../../../3rdparty/libprocess/3rdparty/stout/include/stout/foreach.hpp:44:29:
> note: candidate is:
>              for (VARFIRST = BOOST_FOREACH_DEREF(COL).first;             \
>                              ^
> ../../../3rdparty/libprocess/3rdparty/stout/include/stout/foreach.hpp:53:21:
> note: in expansion of macro 'BOOST_FOREACH_PAIR'
>  #define foreachpair BOOST_FOREACH_PAIR
>                      ^
> ../../../3rdparty/libprocess/3rdparty/stout/include/stout/foreach.hpp:59:3:
> note: in expansion of macro 'foreachpair'
>    foreachpair (__foreach__::ignore, VAR, COL)
>    ^
> ../../../3rdparty/libprocess/3rdparty/stout/include/stout/flags/flags.hpp:814:3:
> note: in expansion of macro 'foreachvalue'
>    foreachvalue (const flags::Flag& flag, *this) {
>    ^
> 3rdparty/boost-1.53.0/boost/foreach.hpp:769:1: note: template<class T,
> class C> typename boost::foreach_detail_::foreach_reference<T, C>::type
> boost::foreach_detail_::deref(boost::foreach_detail_::auto_any_t,
> boost::foreach_detail_::type2type<T, C>*)
>  deref(auto_any_t cur, type2type<T, C> *)
>  ^
> 3rdparty/boost-1.53.0/boost/foreach.hpp:769:1: note:   template argument
> deduction/substitution failed:
> In file included from
> ../../../3rdparty/libprocess/3rdparty/stout/include/stout/strings.hpp:22:0,
>                  from
> ../../../3rdparty/libprocess/3rdparty/stout/include/stout/numify.hpp:25,
>                  from
> ../../../3rdparty/libprocess/3rdparty/stout/include/stout/ip.hpp:56,
>                  from
> ../../../3rdparty/libprocess/include/process/address.hpp:32,
>                  from ../../../3rdparty/libprocess/src/process.cpp:57:
> ../../../3rdparty/libprocess/3rdparty/stout/include/stout/flags/flags.hpp:814:23:
> error: 'Flag' in 'enum flags' does not name a type
>    foreachvalue (const flags::Flag& flag, *this) {
>                        ^
> ../../../3rdparty/libprocess/3rdparty/stout/include/stout/foreach.hpp:48:22:
> note: in definition of macro 'BOOST_FOREACH_PAIR'
>                  for (VARSECOND = BOOST_FOREACH_DEREF(COL).second;       \
>                       ^
> ../../../3rdparty/libprocess/3rdparty/stout/include/stout/flags/flags.hpp:814:3:
> note: in expansion of macro 'foreachvalue'
>    foreachvalue (const flags::Flag& flag, *this) {
>    ^
> ../../../3rdparty/libprocess/3rdparty/stout/include/stout/foreach.hpp:49:22:
> error: expected ';' before '!' token
>                       !BOOST_FOREACH_ID(_foreach_continue);              \
>                       ^
> ../../../3rdparty/libprocess/3rdparty/stout/include/stout/foreach.hpp:53:21:
> note: in expansion of macro 'BOOST_FOREACH_PAIR'
>  #define foreachpair BOOST_FOREACH_PAIR
>                      ^
> ../../../3rdparty/libprocess/3rdparty/stout/include/stout/foreach.hpp:59:3:
> note: in expansion of macro 'foreachpair'
>    foreachpair (__foreach__::ignore, VAR, COL)
>    ^
> ../../../3rdparty/libprocess/3rdparty/stout/include/stout/flags/flags.hpp:814:3:
> note: in expansion of macro 'foreachvalue'
>    foreachvalue (const flags::Flag& flag, *this) {
>    ^
> In file included from
> ../../../3rdparty/libprocess/3rdparty/stout/include/stout/flags.hpp:16:0,
>                  from ../../../3rdparty/libprocess/src/openssl.hpp:20,
>                  from ../../../3rdparty/libprocess/src/process.cpp:105:
> ../../../3rdparty/libprocess/3rdparty/stout/include/stout/flags/flags.hpp:815:29:
> error: 'flag' was not declared in this scope
>      std::string line = col1[flag.name];
>                              ^
> In file included from
> ../../../3rdparty/libprocess/3rdparty/stout/include/stout/foreach.hpp:16:0,
>                  from
> ../../../3rdparty/libprocess/3rdparty/stout/include/stout/strings.hpp:22,
>                  from
> ../../../3rdparty/libprocess/3rdparty/stout/include/stout/numify.hpp:25,
>                  from
> ../../../3rdparty/libprocess/3rdparty/stout/include/stout/ip.hpp:56,
>                  from
> ../../../3rdparty/libprocess/include/process/address.hpp:32,
>                  from ../../../3rdparty/libprocess/src/process.cpp:57:
> ../../../3rdparty/libprocess/3rdparty/stout/include/stout/flags/flags.hpp:
> In function 'std::ostream& flags::operator<<(std::ostream&, const
> flags::FlagsBase&)':
> ../../../3rdparty/libprocess/3rdparty/stout/include/stout/foreach.hpp:44:29:
> error: no matching function for call to 'deref(const
> boost::foreach_detail_::auto_any_base&,
> boost::foreach_detail_::type2type<flags::FlagsBase, mpl_::bool_<true> >*)'
>              for (VARFIRST = BOOST_FOREACH_DEREF(COL).first;             \
>                              ^
> ../../../3rdparty/libprocess/3rdparty/stout/include/stout/foreach.hpp:53:21:
> note: in expansion of macro 'BOOST_FOREACH_PAIR'
>  #define foreachpair BOOST_FOREACH_PAIR
>                      ^
> ../../../3rdparty/libprocess/3rdparty/stout/include/stout/foreach.hpp:59:3:
> note: in expansion of macro 'foreachpair'
>    foreachpair (__foreach__::ignore, VAR, COL)
>    ^
> ../../../3rdparty/libprocess/3rdparty/stout/include/stout/flags/flags.hpp:844:3:
> note: in expansion of macro 'foreachvalue'
>    foreachvalue (const flags::Flag& flag, flags) {
>    ^
> ../../../3rdparty/libprocess/3rdparty/stout/include/stout/foreach.hpp:44:29:
> note: candidate is:
>              for (VARFIRST = BOOST_FOREACH_DEREF(COL).first;             \
>                              ^
> ../../../3rdparty/libprocess/3rdparty/stout/include/stout/foreach.hpp:53:21:
> note: in expansion of macro 'BOOST_FOREACH_PAIR'
>  #define foreachpair BOOST_FOREACH_PAIR
>                      ^
> ../../../3rdparty/libprocess/3rdparty/stout/include/stout/foreach.hpp:59:3:
> note: in expansion of macro 'foreachpair'
>    foreachpair (__foreach__::ignore, VAR, COL)
>    ^
> ../../../3rdparty/libprocess/3rdparty/stout/include/stout/flags/flags.hpp:844:3:
> note: in expansion of macro 'foreachvalue'
>    foreachvalue (const flags::Flag& flag, flags) {
>    ^
> 3rdparty/boost-1.53.0/boost/foreach.hpp:769:1: note: template<class T,
> class C> typename boost::foreach_detail_::foreach_reference<T, C>::type
> boost::foreach_detail_::deref(boost::foreach_detail_::auto_any_t,
> boost::foreach_detail_::type2type<T, C>*)
>  deref(auto_any_t cur, type2type<T, C> *)
>  ^
> 3rdparty/boost-1.53.0/boost/foreach.hpp:769:1: note:   template argument
> deduction/substitution failed:
> In file included from
> ../../../3rdparty/libprocess/3rdparty/stout/include/stout/strings.hpp:22:0,
>                  from
> ../../../3rdparty/libprocess/3rdparty/stout/include/stout/numify.hpp:25,
>                  from
> ../../../3rdparty/libprocess/3rdparty/stout/include/stout/ip.hpp:56,
>                  from
> ../../../3rdparty/libprocess/include/process/address.hpp:32,
>                  from ../../../3rdparty/libprocess/src/process.cpp:57:
> ../../../3rdparty/libprocess/3rdparty/stout/include/stout/flags/flags.hpp:844:23:
> error: 'flags' does not name a type
>    foreachvalue (const flags::Flag& flag, flags) {
>                        ^
> ../../../3rdparty/libprocess/3rdparty/stout/include/stout/foreach.hpp:48:22:
> note: in definition of macro 'BOOST_FOREACH_PAIR'
>                  for (VARSECOND = BOOST_FOREACH_DEREF(COL).second;       \
>                       ^
> ../../../3rdparty/libprocess/3rdparty/stout/include/stout/flags/flags.hpp:844:3:
> note: in expansion of macro 'foreachvalue'
>    foreachvalue (const flags::Flag& flag, flags) {
>    ^
> ../../../3rdparty/libprocess/3rdparty/stout/include/stout/foreach.hpp:49:22:
> error: expected ';' before '!' token
>                       !BOOST_FOREACH_ID(_foreach_continue);              \
>                       ^
> ../../../3rdparty/libprocess/3rdparty/stout/include/stout/foreach.hpp:53:21:
> note: in expansion of macro 'BOOST_FOREACH_PAIR'
>  #define foreachpair BOOST_FOREACH_PAIR
>                      ^
> ../../../3rdparty/libprocess/3rdparty/stout/include/stout/foreach.hpp:59:3:
> note: in expansion of macro 'foreachpair'
>    foreachpair (__foreach__::ignore, VAR, COL)
>    ^
> ../../../3rdparty/libprocess/3rdparty/stout/include/stout/flags/flags.hpp:844:3:
> note: in expansion of macro 'foreachvalue'
>    foreachvalue (const flags::Flag& flag, flags) {
>    ^
> In file included from
> ../../../3rdparty/libprocess/3rdparty/stout/include/stout/flags.hpp:16:0,
>                  from ../../../3rdparty/libprocess/src/openssl.hpp:20,
>                  from ../../../3rdparty/libprocess/src/process.cpp:105:
> ../../../3rdparty/libprocess/3rdparty/stout/include/stout/flags/flags.hpp:845:39:
> error: 'flag' was not declared in this scope
>      const Option<std::string> value = flag.stringify(flags);
>                                        ^
> In file included from ../../../3rdparty/libprocess/src/process.cpp:105:0:
> ../../../3rdparty/libprocess/src/openssl.hpp: At global scope:
> ../../../3rdparty/libprocess/src/openssl.hpp:32:1: error: expected
> class-name before '{' token
>  {
>  ^
> libtool: compile:  g++ -DPACKAGE_NAME=\"libprocess\"
> -DPACKAGE_TARNAME=\"libprocess\" -DPACKAGE_VERSION=\"0.0.1\"
> "-DPACKAGE_STRING=\"libprocess 0.0.1\"" -DPACKAGE_BUGREPORT=\"\"
> -DPACKAGE_URL=\"\" -DPACKAGE=\"libprocess\" -DVERSION=\"0.0.1\"
> -DSTDC_HEADERS=1 -DHAVE_SYS_TYPES_H=1 -DHAVE_SYS_STAT_H=1 -DHAVE_STDLIB_H=1
> -DHAVE_STRING_H=1 -DHAVE_MEMORY_H=1 -DHAVE_STRINGS_H=1 -DHAVE_INTTYPES_H=1
> -DHAVE_STDINT_H=1 -DHAVE_UNISTD_H=1 -DHAVE_DLFCN_H=1 -DLT_OBJDIR=\".libs/\"
> -DHAVE_APR_POOLS_H=1 -DHAVE_LIBAPR_1=1 -DHAVE_SVN_VERSION_H=1
> -DHAVE_LIBSVN_SUBR_1=1 -DHAVE_SVN_DELTA_H=1 -DHAVE_LIBSVN_DELTA_1=1
> -DHAVE_LIBCURL=1 -DHAVE_EVENT2_EVENT_H=1 -DHAVE_LIBEVENT=1
> -DHAVE_EVENT2_THREAD_H=1 -DHAVE_LIBEVENT_PTHREADS=1 -DHAVE_OPENSSL_SSL_H=1
> -DHAVE_LIBSSL=1 -DHAVE_LIBCRYPTO=1 -DHAVE_EVENT2_BUFFEREVENT_SSL_H=1
> -DHAVE_LIBEVENT_OPENSSL=1 -DUSE_SSL_SOCKET=1 -DHAVE_CXX11=1
> -DHAVE_PTHREAD_PRIO_INHERIT=1 -DHAVE_PTHREAD=1 -DHAVE_LIBZ=1 -DHAVE_LIBDL=1
> -I. -I../../../3rdparty/libprocess
> -DBUILD_DIR=\"/mesos/mesos-0.29.0/_build/3rdparty/libprocess\"
> -I../../../3rdparty/libprocess/include
> -I../../../3rdparty/libprocess/3rdparty/stout/include -isystem
> 3rdparty/boost-1.53.0 -I3rdparty/libev-4.15 -I3rdparty/picojson-1.3.0
> -DPICOJSON_USE_INT64 -D__STDC_FORMAT_MACROS -I3rdparty/glog-0.3.3/src
> -I3rdparty/http-parser-2.6.1 -I/usr/include/subversion-1
> -I/usr/include/apr-1 -I/usr/include/apr-1.0 -g1 -O0
> -Wno-unused-local-typedefs -std=c++11 -MT libprocess_la-timeseries.lo -MD
> -MP -MF .deps/libprocess_la-timeseries.Tpo -c
> ../../../3rdparty/libprocess/src/timeseries.cpp  -fPIC -DPIC -o
> libprocess_la-timeseries.o
> mv -f .deps/libprocess_la-http.Tpo .deps/libprocess_la-http.Plo
> /bin/bash ./libtool  --tag=CXX   --mode=compile g++
> -DPACKAGE_NAME=\"libprocess\" -DPACKAGE_TARNAME=\"libprocess\"
> -DPACKAGE_VERSION=\"0.0.1\" -DPACKAGE_STRING=\"libprocess\ 0.0.1\"
> -DPACKAGE_BUGREPORT=\"\" -DPACKAGE_URL=\"\" -DPACKAGE=\"libprocess\"
> -DVERSION=\"0.0.1\" -DSTDC_HEADERS=1 -DHAVE_SYS_TYPES_H=1
> -DHAVE_SYS_STAT_H=1 -DHAVE_STDLIB_H=1 -DHAVE_STRING_H=1 -DHAVE_MEMORY_H=1
> -DHAVE_STRINGS_H=1 -DHAVE_INTTYPES_H=1 -DHAVE_STDINT_H=1 -DHAVE_UNISTD_H=1
> -DHAVE_DLFCN_H=1 -DLT_OBJDIR=\".libs/\" -DHAVE_APR_POOLS_H=1
> -DHAVE_LIBAPR_1=1 -DHAVE_SVN_VERSION_H=1 -DHAVE_LIBSVN_SUBR_1=1
> -DHAVE_SVN_DELTA_H=1 -DHAVE_LIBSVN_DELTA_1=1 -DHAVE_LIBCURL=1
> -DHAVE_EVENT2_EVENT_H=1 -DHAVE_LIBEVENT=1 -DHAVE_EVENT2_THREAD_H=1
> -DHAVE_LIBEVENT_PTHREADS=1 -DHAVE_OPENSSL_SSL_H=1 -DHAVE_LIBSSL=1
> -DHAVE_LIBCRYPTO=1 -DHAVE_EVENT2_BUFFEREVENT_SSL_H=1
> -DHAVE_LIBEVENT_OPENSSL=1 -DUSE_SSL_SOCKET=1 -DHAVE_CXX11=1
> -DHAVE_PTHREAD_PRIO_INHERIT=1 -DHAVE_PTHREAD=1 -DHAVE_LIBZ=1 -DHAVE_LIBDL=1
> -I. -I../../../3rdparty/libprocess
> -DBUILD_DIR=\"/mesos/mesos-0.29.0/_build/3rdparty/libprocess\"
> -I../../../3rdparty/libprocess/include
> -I../../../3rdparty/libprocess/3rdparty/stout/include -isystem
> 3rdparty/boost-1.53.0 -I3rdparty/libev-4.15 -I3rdparty/picojson-1.3.0
> -DPICOJSON_USE_INT64 -D__STDC_FORMAT_MACROS  -I3rdparty/glog-0.3.3/src
> -I3rdparty/http-parser-2.6.1  -I/usr/include/subversion-1
> -I/usr/include/apr-1 -I/usr/include/apr-1.0   -g1 -O0
> -Wno-unused-local-typedefs -std=c++11 -MT
> libprocess_la-libevent_ssl_socket.lo -MD -MP -MF
> .deps/libprocess_la-libevent_ssl_socket.Tpo -c -o
> libprocess_la-libevent_ssl_socket.lo `test -f 'src/libevent_ssl_socket.cpp'
> || echo '../../../3rdparty/libprocess/'`src/libevent_ssl_socket.cpp
> libtool: compile:  g++ -DPACKAGE_NAME=\"libprocess\"
> -DPACKAGE_TARNAME=\"libprocess\" -DPACKAGE_VERSION=\"0.0.1\"
> "-DPACKAGE_STRING=\"libprocess 0.0.1\"" -DPACKAGE_BUGREPORT=\"\"
> -DPACKAGE_URL=\"\" -DPACKAGE=\"libprocess\" -DVERSION=\"0.0.1\"
> -DSTDC_HEADERS=1 -DHAVE_SYS_TYPES_H=1 -DHAVE_SYS_STAT_H=1 -DHAVE_STDLIB_H=1
> -DHAVE_STRING_H=1 -DHAVE_MEMORY_H=1 -DHAVE_STRINGS_H=1 -DHAVE_INTTYPES_H=1
> -DHAVE_STDINT_H=1 -DHAVE_UNISTD_H=1 -DHAVE_DLFCN_H=1 -DLT_OBJDIR=\".libs/\"
> -DHAVE_APR_POOLS_H=1 -DHAVE_LIBAPR_1=1 -DHAVE_SVN_VERSION_H=1
> -DHAVE_LIBSVN_SUBR_1=1 -DHAVE_SVN_DELTA_H=1 -DHAVE_LIBSVN_DELTA_1=1
> -DHAVE_LIBCURL=1 -DHAVE_EVENT2_EVENT_H=1 -DHAVE_LIBEVENT=1
> -DHAVE_EVENT2_THREAD_H=1 -DHAVE_LIBEVENT_PTHREADS=1 -DHAVE_OPENSSL_SSL_H=1
> -DHAVE_LIBSSL=1 -DHAVE_LIBCRYPTO=1 -DHAVE_EVENT2_BUFFEREVENT_SSL_H=1
> -DHAVE_LIBEVENT_OPENSSL=1 -DUSE_SSL_SOCKET=1 -DHAVE_CXX11=1
> -DHAVE_PTHREAD_PRIO_INHERIT=1 -DHAVE_PTHREAD=1 -DHAVE_LIBZ=1 -DHAVE_LIBDL=1
> -I. -I../../../3rdparty/libprocess
> -DBUILD_DIR=\"/mesos/mesos-0.29.0/_build/3rdparty/libprocess\"
> -I../../../3rdparty/libprocess/include
> -I../../../3rdparty/libprocess/3rdparty/stout/include -isystem
> 3rdparty/boost-1.53.0 -I3rdparty/libev-4.15 -I3rdparty/picojson-1.3.0
> -DPICOJSON_USE_INT64 -D__STDC_FORMAT_MACROS -I3rdparty/glog-0.3.3/src
> -I3rdparty/http-parser-2.6.1 -I/usr/include/subversion-1
> -I/usr/include/apr-1 -I/usr/include/apr-1.0 -g1 -O0
> -Wno-unused-local-typedefs -std=c++11 -MT
> libprocess_la-libevent_ssl_socket.lo -MD -MP -MF
> .deps/libprocess_la-libevent_ssl_socket.Tpo -c
> ../../../3rdparty/libprocess/src/libevent_ssl_socket.cpp  -fPIC -DPIC -o
> libprocess_la-libevent_ssl_socket.o
> mv -f .deps/libprocess_la-time.Tpo .deps/libprocess_la-time.Plo
> /bin/bash ./libtool  --tag=CXX   --mode=compile g++
> -DPACKAGE_NAME=\"libprocess\" -DPACKAGE_TARNAME=\"libprocess\"
> -DPACKAGE_VERSION=\"0.0.1\" -DPACKAGE_STRING=\"libprocess\ 0.0.1\"
> -DPACKAGE_BUGREPORT=\"\" -DPACKAGE_URL=\"\" -DPACKAGE=\"libprocess\"
> -DVERSION=\"0.0.1\" -DSTDC_HEADERS=1 -DHAVE_SYS_TYPES_H=1
> -DHAVE_SYS_STAT_H=1 -DHAVE_STDLIB_H=1 -DHAVE_STRING_H=1 -DHAVE_MEMORY_H=1
> -DHAVE_STRINGS_H=1 -DHAVE_INTTYPES_H=1 -DHAVE_STDINT_H=1 -DHAVE_UNISTD_H=1
> -DHAVE_DLFCN_H=1 -DLT_OBJDIR=\".libs/\" -DHAVE_APR_POOLS_H=1
> -DHAVE_LIBAPR_1=1 -DHAVE_SVN_VERSION_H=1 -DHAVE_LIBSVN_SUBR_1=1
> -DHAVE_SVN_DELTA_H=1 -DHAVE_LIBSVN_DELTA_1=1 -DHAVE_LIBCURL=1
> -DHAVE_EVENT2_EVENT_H=1 -DHAVE_LIBEVENT=1 -DHAVE_EVENT2_THREAD_H=1
> -DHAVE_LIBEVENT_PTHREADS=1 -DHAVE_OPENSSL_SSL_H=1 -DHAVE_LIBSSL=1
> -DHAVE_LIBCRYPTO=1 -DHAVE_EVENT2_BUFFEREVENT_SSL_H=1
> -DHAVE_LIBEVENT_OPENSSL=1 -DUSE_SSL_SOCKET=1 -DHAVE_CXX11=1
> -DHAVE_PTHREAD_PRIO_INHERIT=1 -DHAVE_PTHREAD=1 -DHAVE_LIBZ=1 -DHAVE_LIBDL=1
> -I. -I../../../3rdparty/libprocess
> -DBUILD_DIR=\"/mesos/mesos-0.29.0/_build/3rdparty/libprocess\"
> -I../../../3rdparty/libprocess/include
> -I../../../3rdparty/libprocess/3rdparty/stout/include -isystem
> 3rdparty/boost-1.53.0 -I3rdparty/libev-4.15 -I3rdparty/picojson-1.3.0
> -DPICOJSON_USE_INT64 -D__STDC_FORMAT_MACROS  -I3rdparty/glog-0.3.3/src
> -I3rdparty/http-parser-2.6.1  -I/usr/include/subversion-1
> -I/usr/include/apr-1 -I/usr/include/apr-1.0   -g1 -O0
> -Wno-unused-local-typedefs -std=c++11 -MT libprocess_la-openssl.lo -MD -MP
> -MF .deps/libprocess_la-openssl.Tpo -c -o libprocess_la-openssl.lo `test -f
> 'src/openssl.cpp' || echo '../../../3rdparty/libprocess/'`src/openssl.cpp
> libtool: compile:  g++ -DPACKAGE_NAME=\"libprocess\"
> -DPACKAGE_TARNAME=\"libprocess\" -DPACKAGE_VERSION=\"0.0.1\"
> "-DPACKAGE_STRING=\"libprocess 0.0.1\"" -DPACKAGE_BUGREPORT=\"\"
> -DPACKAGE_URL=\"\" -DPACKAGE=\"libprocess\" -DVERSION=\"0.0.1\"
> -DSTDC_HEADERS=1 -DHAVE_SYS_TYPES_H=1 -DHAVE_SYS_STAT_H=1 -DHAVE_STDLIB_H=1
> -DHAVE_STRING_H=1 -DHAVE_MEMORY_H=1 -DHAVE_STRINGS_H=1 -DHAVE_INTTYPES_H=1
> -DHAVE_STDINT_H=1 -DHAVE_UNISTD_H=1 -DHAVE_DLFCN_H=1 -DLT_OBJDIR=\".libs/\"
> -DHAVE_APR_POOLS_H=1 -DHAVE_LIBAPR_1=1 -DHAVE_SVN_VERSION_H=1
> -DHAVE_LIBSVN_SUBR_1=1 -DHAVE_SVN_DELTA_H=1 -DHAVE_LIBSVN_DELTA_1=1
> -DHAVE_LIBCURL=1 -DHAVE_EVENT2_EVENT_H=1 -DHAVE_LIBEVENT=1
> -DHAVE_EVENT2_THREAD_H=1 -DHAVE_LIBEVENT_PTHREADS=1 -DHAVE_OPENSSL_SSL_H=1
> -DHAVE_LIBSSL=1 -DHAVE_LIBCRYPTO=1 -DHAVE_EVENT2_BUFFEREVENT_SSL_H=1
> -DHAVE_LIBEVENT_OPENSSL=1 -DUSE_SSL_SOCKET=1 -DHAVE_CXX11=1
> -DHAVE_PTHREAD_PRIO_INHERIT=1 -DHAVE_PTHREAD=1 -DHAVE_LIBZ=1 -DHAVE_LIBDL=1
> -I. -I../../../3rdparty/libprocess
> -DBUILD_DIR=\"/mesos/mesos-0.29.0/_build/3rdparty/libprocess\"
> -I../../../3rdparty/libprocess/include
> -I../../../3rdparty/libprocess/3rdparty/stout/include -isystem
> 3rdparty/boost-1.53.0 -I3rdparty/libev-4.15 -I3rdparty/picojson-1.3.0
> -DPICOJSON_USE_INT64 -D__STDC_FORMAT_MACROS -I3rdparty/glog-0.3.3/src
> -I3rdparty/http-parser-2.6.1 -I/usr/include/subversion-1
> -I/usr/include/apr-1 -I/usr/include/apr-1.0 -g1 -O0
> -Wno-unused-local-typedefs -std=c++11 -MT libprocess_la-openssl.lo -MD -MP
> -MF .deps/libprocess_la-openssl.Tpo -c
> ../../../3rdparty/libprocess/src/openssl.cpp  -fPIC -DPIC -o
> libprocess_la-openssl.o
> mv -f .deps/libprocess_la-timeseries.Tpo .deps/libprocess_la-timeseries.Plo
> /bin/bash ./libtool  --tag=CXX   --mode=compile g++
> -DPACKAGE_NAME=\"libprocess\" -DPACKAGE_TARNAME=\"libprocess\"
> -DPACKAGE_VERSION=\"0.0.1\" -DPACKAGE_STRING=\"libprocess\ 0.0.1\"
> -DPACKAGE_BUGREPORT=\"\" -DPACKAGE_URL=\"\" -DPACKAGE=\"libprocess\"
> -DVERSION=\"0.0.1\" -DSTDC_HEADERS=1 -DHAVE_SYS_TYPES_H=1
> -DHAVE_SYS_STAT_H=1 -DHAVE_STDLIB_H=1 -DHAVE_STRING_H=1 -DHAVE_MEMORY_H=1
> -DHAVE_STRINGS_H=1 -DHAVE_INTTYPES_H=1 -DHAVE_STDINT_H=1 -DHAVE_UNISTD_H=1
> -DHAVE_DLFCN_H=1 -DLT_OBJDIR=\".libs/\" -DHAVE_APR_POOLS_H=1
> -DHAVE_LIBAPR_1=1 -DHAVE_SVN_VERSION_H=1 -DHAVE_LIBSVN_SUBR_1=1
> -DHAVE_SVN_DELTA_H=1 -DHAVE_LIBSVN_DELTA_1=1 -DHAVE_LIBCURL=1
> -DHAVE_EVENT2_EVENT_H=1 -DHAVE_LIBEVENT=1 -DHAVE_EVENT2_THREAD_H=1
> -DHAVE_LIBEVENT_PTHREADS=1 -DHAVE_OPENSSL_SSL_H=1 -DHAVE_LIBSSL=1
> -DHAVE_LIBCRYPTO=1 -DHAVE_EVENT2_BUFFEREVENT_SSL_H=1
> -DHAVE_LIBEVENT_OPENSSL=1 -DUSE_SSL_SOCKET=1 -DHAVE_CXX11=1
> -DHAVE_PTHREAD_PRIO_INHERIT=1 -DHAVE_PTHREAD=1 -DHAVE_LIBZ=1 -DHAVE_LIBDL=1
> -I. -I../../../3rdparty/libprocess
> -DBUILD_DIR=\"/mesos/mesos-0.29.0/_build/3rdparty/libprocess\"
> -I../../../3rdparty/libprocess/include
> -I../../../3rdparty/libprocess/3rdparty/stout/include -isystem
> 3rdparty/boost-1.53.0 -I3rdparty/libev-4.15 -I3rdparty/picojson-1.3.0
> -DPICOJSON_USE_INT64 -D__STDC_FORMAT_MACROS  -I3rdparty/glog-0.3.3/src
> -I3rdparty/http-parser-2.6.1  -I/usr/include/subversion-1
> -I/usr/include/apr-1 -I/usr/include/apr-1.0   -g1 -O0
> -Wno-unused-local-typedefs -std=c++11 -MT libprocess_la-utilities.lo -MD
> -MP -MF .deps/libprocess_la-utilities.Tpo -c -o libprocess_la-utilities.lo
> `test -f 'src/ssl/utilities.cpp' || echo
> '../../../3rdparty/libprocess/'`src/ssl/utilities.cpp
> libtool: compile:  g++ -DPACKAGE_NAME=\"libprocess\"
> -DPACKAGE_TARNAME=\"libprocess\" -DPACKAGE_VERSION=\"0.0.1\"
> "-DPACKAGE_STRING=\"libprocess 0.0.1\"" -DPACKAGE_BUGREPORT=\"\"
> -DPACKAGE_URL=\"\" -DPACKAGE=\"libprocess\" -DVERSION=\"0.0.1\"
> -DSTDC_HEADERS=1 -DHAVE_SYS_TYPES_H=1 -DHAVE_SYS_STAT_H=1 -DHAVE_STDLIB_H=1
> -DHAVE_STRING_H=1 -DHAVE_MEMORY_H=1 -DHAVE_STRINGS_H=1 -DHAVE_INTTYPES_H=1
> -DHAVE_STDINT_H=1 -DHAVE_UNISTD_H=1 -DHAVE_DLFCN_H=1 -DLT_OBJDIR=\".libs/\"
> -DHAVE_APR_POOLS_H=1 -DHAVE_LIBAPR_1=1 -DHAVE_SVN_VERSION_H=1
> -DHAVE_LIBSVN_SUBR_1=1 -DHAVE_SVN_DELTA_H=1 -DHAVE_LIBSVN_DELTA_1=1
> -DHAVE_LIBCURL=1 -DHAVE_EVENT2_EVENT_H=1 -DHAVE_LIBEVENT=1
> -DHAVE_EVENT2_THREAD_H=1 -DHAVE_LIBEVENT_PTHREADS=1 -DHAVE_OPENSSL_SSL_H=1
> -DHAVE_LIBSSL=1 -DHAVE_LIBCRYPTO=1 -DHAVE_EVENT2_BUFFEREVENT_SSL_H=1
> -DHAVE_LIBEVENT_OPENSSL=1 -DUSE_SSL_SOCKET=1 -DHAVE_CXX11=1
> -DHAVE_PTHREAD_PRIO_INHERIT=1 -DHAVE_PTHREAD=1 -DHAVE_LIBZ=1 -DHAVE_LIBDL=1
> -I. -I../../../3rdparty/libprocess
> -DBUILD_DIR=\"/mesos/mesos-0.29.0/_build/3rdparty/libprocess\"
> -I../../../3rdparty/libprocess/include
> -I../../../3rdparty/libprocess/3rdparty/stout/include -isystem
> 3rdparty/boost-1.53.0 -I3rdparty/libev-4.15 -I3rdparty/picojson-1.3.0
> -DPICOJSON_USE_INT64 -D__STDC_FORMAT_MACROS -I3rdparty/glog-0.3.3/src
> -I3rdparty/http-parser-2.6.1 -I/usr/include/subversion-1
> -I/usr/include/apr-1 -I/usr/include/apr-1.0 -g1 -O0
> -Wno-unused-local-typedefs -std=c++11 -MT libprocess_la-utilities.lo -MD
> -MP -MF .deps/libprocess_la-utilities.Tpo -c
> ../../../3rdparty/libprocess/src/ssl/utilities.cpp  -fPIC -DPIC -o
> libprocess_la-utilities.o
> mv -f .deps/libprocess_la-reap.Tpo .deps/libprocess_la-reap.Plo
> /bin/bash ./libtool  --tag=CXX   --mode=compile g++
> -DPACKAGE_NAME=\"libprocess\" -DPACKAGE_TARNAME=\"libprocess\"
> -DPACKAGE_VERSION=\"0.0.1\" -DPACKAGE_STRING=\"libprocess\ 0.0.1\"
> -DPACKAGE_BUGREPORT=\"\" -DPACKAGE_URL=\"\" -DPACKAGE=\"libprocess\"
> -DVERSION=\"0.0.1\" -DSTDC_HEADERS=1 -DHAVE_SYS_TYPES_H=1
> -DHAVE_SYS_STAT_H=1 -DHAVE_STDLIB_H=1 -DHAVE_STRING_H=1 -DHAVE_MEMORY_H=1
> -DHAVE_STRINGS_H=1 -DHAVE_INTTYPES_H=1 -DHAVE_STDINT_H=1 -DHAVE_UNISTD_H=1
> -DHAVE_DLFCN_H=1 -DLT_OBJDIR=\".libs/\" -DHAVE_APR_POOLS_H=1
> -DHAVE_LIBAPR_1=1 -DHAVE_SVN_VERSION_H=1 -DHAVE_LIBSVN_SUBR_1=1
> -DHAVE_SVN_DELTA_H=1 -DHAVE_LIBSVN_DELTA_1=1 -DHAVE_LIBCURL=1
> -DHAVE_EVENT2_EVENT_H=1 -DHAVE_LIBEVENT=1 -DHAVE_EVENT2_THREAD_H=1
> -DHAVE_LIBEVENT_PTHREADS=1 -DHAVE_OPENSSL_SSL_H=1 -DHAVE_LIBSSL=1
> -DHAVE_LIBCRYPTO=1 -DHAVE_EVENT2_BUFFEREVENT_SSL_H=1
> -DHAVE_LIBEVENT_OPENSSL=1 -DUSE_SSL_SOCKET=1 -DHAVE_CXX11=1
> -DHAVE_PTHREAD_PRIO_INHERIT=1 -DHAVE_PTHREAD=1 -DHAVE_LIBZ=1 -DHAVE_LIBDL=1
> -I. -I../../../3rdparty/libprocess
> -DBUILD_DIR=\"/mesos/mesos-0.29.0/_build/3rdparty/libprocess\"
> -I../../../3rdparty/libprocess/include
> -I../../../3rdparty/libprocess/3rdparty/stout/include -isystem
> 3rdparty/boost-1.53.0 -I3rdparty/libev-4.15 -I3rdparty/picojson-1.3.0
> -DPICOJSON_USE_INT64 -D__STDC_FORMAT_MACROS  -I3rdparty/glog-0.3.3/src
> -I3rdparty/http-parser-2.6.1  -I/usr/include/subversion-1
> -I/usr/include/apr-1 -I/usr/include/apr-1.0   -g1 -O0
> -Wno-unused-local-typedefs -std=c++11 -MT libprocess_la-libevent.lo -MD -MP
> -MF .deps/libprocess_la-libevent.Tpo -c -o libprocess_la-libevent.lo `test
> -f 'src/libevent.cpp' || echo
> '../../../3rdparty/libprocess/'`src/libevent.cpp
> libtool: compile:  g++ -DPACKAGE_NAME=\"libprocess\"
> -DPACKAGE_TARNAME=\"libprocess\" -DPACKAGE_VERSION=\"0.0.1\"
> "-DPACKAGE_STRING=\"libprocess 0.0.1\"" -DPACKAGE_BUGREPORT=\"\"
> -DPACKAGE_URL=\"\" -DPACKAGE=\"libprocess\" -DVERSION=\"0.0.1\"
> -DSTDC_HEADERS=1 -DHAVE_SYS_TYPES_H=1 -DHAVE_SYS_STAT_H=1 -DHAVE_STDLIB_H=1
> -DHAVE_STRING_H=1 -DHAVE_MEMORY_H=1 -DHAVE_STRINGS_H=1 -DHAVE_INTTYPES_H=1
> -DHAVE_STDINT_H=1 -DHAVE_UNISTD_H=1 -DHAVE_DLFCN_H=1 -DLT_OBJDIR=\".libs/\"
> -DHAVE_APR_POOLS_H=1 -DHAVE_LIBAPR_1=1 -DHAVE_SVN_VERSION_H=1
> -DHAVE_LIBSVN_SUBR_1=1 -DHAVE_SVN_DELTA_H=1 -DHAVE_LIBSVN_DELTA_1=1
> -DHAVE_LIBCURL=1 -DHAVE_EVENT2_EVENT_H=1 -DHAVE_LIBEVENT=1
> -DHAVE_EVENT2_THREAD_H=1 -DHAVE_LIBEVENT_PTHREADS=1 -DHAVE_OPENSSL_SSL_H=1
> -DHAVE_LIBSSL=1 -DHAVE_LIBCRYPTO=1 -DHAVE_EVENT2_BUFFEREVENT_SSL_H=1
> -DHAVE_LIBEVENT_OPENSSL=1 -DUSE_SSL_SOCKET=1 -DHAVE_CXX11=1
> -DHAVE_PTHREAD_PRIO_INHERIT=1 -DHAVE_PTHREAD=1 -DHAVE_LIBZ=1 -DHAVE_LIBDL=1
> -I. -I../../../3rdparty/libprocess
> -DBUILD_DIR=\"/mesos/mesos-0.29.0/_build/3rdparty/libprocess\"
> -I../../../3rdparty/libprocess/include
> -I../../../3rdparty/libprocess/3rdparty/stout/include -isystem
> 3rdparty/boost-1.53.0 -I3rdparty/libev-4.15 -I3rdparty/picojson-1.3.0
> -DPICOJSON_USE_INT64 -D__STDC_FORMAT_MACROS -I3rdparty/glog-0.3.3/src
> -I3rdparty/http-parser-2.6.1 -I/usr/include/subversion-1
> -I/usr/include/apr-1 -I/usr/include/apr-1.0 -g1 -O0
> -Wno-unused-local-typedefs -std=c++11 -MT libprocess_la-libevent.lo -MD -MP
> -MF .deps/libprocess_la-libevent.Tpo -c
> ../../../3rdparty/libprocess/src/libevent.cpp  -fPIC -DPIC -o
> libprocess_la-libevent.o
> mv -f .deps/libprocess_la-utilities.Tpo .deps/libprocess_la-utilities.Plo
> /bin/bash ./libtool  --tag=CXX   --mode=compile g++
> -DPACKAGE_NAME=\"libprocess\" -DPACKAGE_TARNAME=\"libprocess\"
> -DPACKAGE_VERSION=\"0.0.1\" -DPACKAGE_STRING=\"libprocess\ 0.0.1\"
> -DPACKAGE_BUGREPORT=\"\" -DPACKAGE_URL=\"\" -DPACKAGE=\"libprocess\"
> -DVERSION=\"0.0.1\" -DSTDC_HEADERS=1 -DHAVE_SYS_TYPES_H=1
> -DHAVE_SYS_STAT_H=1 -DHAVE_STDLIB_H=1 -DHAVE_STRING_H=1 -DHAVE_MEMORY_H=1
> -DHAVE_STRINGS_H=1 -DHAVE_INTTYPES_H=1 -DHAVE_STDINT_H=1 -DHAVE_UNISTD_H=1
> -DHAVE_DLFCN_H=1 -DLT_OBJDIR=\".libs/\" -DHAVE_APR_POOLS_H=1
> -DHAVE_LIBAPR_1=1 -DHAVE_SVN_VERSION_H=1 -DHAVE_LIBSVN_SUBR_1=1
> -DHAVE_SVN_DELTA_H=1 -DHAVE_LIBSVN_DELTA_1=1 -DHAVE_LIBCURL=1
> -DHAVE_EVENT2_EVENT_H=1 -DHAVE_LIBEVENT=1 -DHAVE_EVENT2_THREAD_H=1
> -DHAVE_LIBEVENT_PTHREADS=1 -DHAVE_OPENSSL_SSL_H=1 -DHAVE_LIBSSL=1
> -DHAVE_LIBCRYPTO=1 -DHAVE_EVENT2_BUFFEREVENT_SSL_H=1
> -DHAVE_LIBEVENT_OPENSSL=1 -DUSE_SSL_SOCKET=1 -DHAVE_CXX11=1
> -DHAVE_PTHREAD_PRIO_INHERIT=1 -DHAVE_PTHREAD=1 -DHAVE_LIBZ=1 -DHAVE_LIBDL=1
> -I. -I../../../3rdparty/libprocess
> -DBUILD_DIR=\"/mesos/mesos-0.29.0/_build/3rdparty/libprocess\"
> -I../../../3rdparty/libprocess/include
> -I../../../3rdparty/libprocess/3rdparty/stout/include -isystem
> 3rdparty/boost-1.53.0 -I3rdparty/libev-4.15 -I3rdparty/picojson-1.3.0
> -DPICOJSON_USE_INT64 -D__STDC_FORMAT_MACROS  -I3rdparty/glog-0.3.3/src
> -I3rdparty/http-parser-2.6.1  -I/usr/include/subversion-1
> -I/usr/include/apr-1 -I/usr/include/apr-1.0   -g1 -O0
> -Wno-unused-local-typedefs -std=c++11 -MT libprocess_la-libevent_poll.lo
> -MD -MP -MF .deps/libprocess_la-libevent_poll.Tpo -c -o
> libprocess_la-libevent_poll.lo `test -f 'src/libevent_poll.cpp' || echo
> '../../../3rdparty/libprocess/'`src/libevent_poll.cpp
> libtool: compile:  g++ -DPACKAGE_NAME=\"libprocess\"
> -DPACKAGE_TARNAME=\"libprocess\" -DPACKAGE_VERSION=\"0.0.1\"
> "-DPACKAGE_STRING=\"libprocess 0.0.1\"" -DPACKAGE_BUGREPORT=\"\"
> -DPACKAGE_URL=\"\" -DPACKAGE=\"libprocess\" -DVERSION=\"0.0.1\"
> -DSTDC_HEADERS=1 -DHAVE_SYS_TYPES_H=1 -DHAVE_SYS_STAT_H=1 -DHAVE_STDLIB_H=1
> -DHAVE_STRING_H=1 -DHAVE_MEMORY_H=1 -DHAVE_STRINGS_H=1 -DHAVE_INTTYPES_H=1
> -DHAVE_STDINT_H=1 -DHAVE_UNISTD_H=1 -DHAVE_DLFCN_H=1 -DLT_OBJDIR=\".libs/\"
> -DHAVE_APR_POOLS_H=1 -DHAVE_LIBAPR_1=1 -DHAVE_SVN_VERSION_H=1
> -DHAVE_LIBSVN_SUBR_1=1 -DHAVE_SVN_DELTA_H=1 -DHAVE_LIBSVN_DELTA_1=1
> -DHAVE_LIBCURL=1 -DHAVE_EVENT2_EVENT_H=1 -DHAVE_LIBEVENT=1
> -DHAVE_EVENT2_THREAD_H=1 -DHAVE_LIBEVENT_PTHREADS=1 -DHAVE_OPENSSL_SSL_H=1
> -DHAVE_LIBSSL=1 -DHAVE_LIBCRYPTO=1 -DHAVE_EVENT2_BUFFEREVENT_SSL_H=1
> -DHAVE_LIBEVENT_OPENSSL=1 -DUSE_SSL_SOCKET=1 -DHAVE_CXX11=1
> -DHAVE_PTHREAD_PRIO_INHERIT=1 -DHAVE_PTHREAD=1 -DHAVE_LIBZ=1 -DHAVE_LIBDL=1
> -I. -I../../../3rdparty/libprocess
> -DBUILD_DIR=\"/mesos/mesos-0.29.0/_build/3rdparty/libprocess\"
> -I../../../3rdparty/libprocess/include
> -I../../../3rdparty/libprocess/3rdparty/stout/include -isystem
> 3rdparty/boost-1.53.0 -I3rdparty/libev-4.15 -I3rdparty/picojson-1.3.0
> -DPICOJSON_USE_INT64 -D__STDC_FORMAT_MACROS -I3rdparty/glog-0.3.3/src
> -I3rdparty/http-parser-2.6.1 -I/usr/include/subversion-1
> -I/usr/include/apr-1 -I/usr/include/apr-1.0 -g1 -O0
> -Wno-unused-local-typedefs -std=c++11 -MT libprocess_la-libevent_poll.lo
> -MD -MP -MF .deps/libprocess_la-libevent_poll.Tpo -c
> ../../../3rdparty/libprocess/src/libevent_poll.cpp  -fPIC -DPIC -o
> libprocess_la-libevent_poll.o
> mv -f .deps/libprocess_la-subprocess.Tpo .deps/libprocess_la-subprocess.Plo
> mv -f .deps/libprocess_la-metrics.Tpo .deps/libprocess_la-metrics.Plo
> mv -f .deps/libprocess_la-socket.Tpo .deps/libprocess_la-socket.Plo
> mv -f .deps/libprocess_la-openssl.Tpo .deps/libprocess_la-openssl.Plo
> make[5]: *** [libprocess_la-process.lo] Error 1
> make[5]: *** Waiting for unfinished jobs....
> mv -f .deps/libprocess_la-libevent.Tpo .deps/libprocess_la-libevent.Plo
> mv -f .deps/libprocess_la-libevent_ssl_socket.Tpo
> .deps/libprocess_la-libevent_ssl_socket.Plo
> mv -f .deps/libprocess_la-libevent_poll.Tpo
> .deps/libprocess_la-libevent_poll.Plo
> make[5]: Leaving directory `/mesos/mesos-0.29.0/_build/3rdparty/libprocess'
> make[4]: *** [all-recursive] Error 1
> make[4]: Leaving directory `/mesos/mesos-0.29.0/_build/3rdparty/libprocess'
> make[3]: Leaving directory `/mesos/mesos-0.29.0/_build/3rdparty'
> make[2]: Leaving directory `/mesos/mesos-0.29.0/_build/3rdparty'
> make[3]: *** [all-recursive] Error 1
> make[2]: *** [all] Error 2
> make[1]: *** [all-recursive] Error 1
> make[1]: Leaving directory `/mesos/mesos-0.29.0/_build'
> make: *** [distcheck] Error 1
> + docker rmi mesos-1459217531-31256
> Untagged: mesos-1459217531-31256:latest
> Deleted: 83009dc0f11fb56e2886138b93e5a0d4ae6e84de47c597aec3943c3e35da8678
> Deleted: 3550f014abf744a3b07d497629bcddfd017099758377382d0faca27217a7401f
> Deleted: 4e1982cbc17a6ea74889d88525eb62191003046e411296916a0c5a03414659b9
> Deleted: bdc54ff7977ee5c5309b939001ec814e070fa0b2a40703f729bdf22489f3f2ce
> Deleted: 98f5685f813f63f1f2d29316933a8dd50ecf7cea72dd9ae0fb2f7f3bb586a9ab
> Deleted: b33fa37362599903bcc1d5dcb52561af30936f84c47f0d96af3db94e9a50583f
> Deleted: 8e868c3d2ad439f88952125e873becc2ba40916c3d9d177dcf71c95a5ee6aa5b
> Deleted: fd706db4aad6c4c1b5cf887c0ee8d47fd9fcd438e3daf6bb7150a3609a1b4b72
> Deleted: 95a3fe08781ce1bd4005eedebc21020a6d7322c034608cc235dbf9071e0c2602
> Deleted: 20d78684e5bf064d2f25523f20a583ceb99858f76fcc4ceb0e55082bc6dc45f2
> Deleted: 0ae330803d94eb8098be7a5cf5b4ed9840f5de18bcec1b40c1d69b8dd0bf0a3d
> Deleted: 79903616d61cb2373c4c89b6ba5d0812d5ac9a7c3270f88788a25f12c7511333
> Deleted: 39c4e9cc02e3e11fd84ecd8076f558ca4f35e23ccde8db50ba2091a70e1c5d5f
> Deleted: 4a25f071e09ef2726b4221398727a9fd55ac29fcc84be28b20b80fbaf0ad6b6f
> Deleted: fbe65c111942a1656fc74f4ecd02552f722fc6a089fe570245d831d2dea72481
> Deleted: c519851f32bdabf6d698e8615a0a10b628e7446b74dd4ed8ed7dbbaab9bb7abc
> Build step 'Execute shell' marked build as failure
>

Mime
  • Unnamed multipart/alternative (inline, None, 0 bytes)
View raw message