mesos-builds mailing list archives

Site index · List index
Message view « Date » · « Thread »
Top « Date » · « Thread »
From Apache Jenkins Server <jenk...@builds.apache.org>
Subject Build failed in Jenkins: Mesos » clang,--verbose,GLOG_v=1 MESOS_VERBOSE=1,ubuntu:14.04,(docker||Hadoop)&&(!ubuntu-us1) #1751
Date Tue, 01 Mar 2016 22:39:24 GMT
See <https://builds.apache.org/job/Mesos/COMPILER=clang,CONFIGURATION=--verbose,ENVIRONMENT=GLOG_v=1%20MESOS_VERBOSE=1,OS=ubuntu%3A14.04,label_exp=(docker%7C%7CHadoop)&&(!ubuntu-us1)/1751/changes>

Changes:

[joris.van.remoortere] Stout: Added `WindowsError` constructor to `Result`.

[joris.van.remoortere] Windows: Launch: Removed `rootfs` launcher flag, preventing `chroot`.

[vinodkone] Clarified docs for `--offer_timeout` master flag.

[vinodkone] Updated flag examples to use /metrics/snapshot instead of stats.json.

[vinodkone] Updated UI controller to use master/state endpoint.

[vinodkone] Updated tests to use /state endpoint.

[joris.van.remoortere] Windows: Removed `user` launcher flag, preventing `su`.

[joris.van.remoortere] Windows: Stout: Removed user based functions.

------------------------------------------
[...truncated 162016 lines...]
I0301 22:32:18.050770 31533 hierarchical.cpp:1130] Performed allocation for 0 slaves in 201465ns
I0301 22:32:18.053164 31500 master.cpp:1026] Master terminating
I0301 22:32:18.053493 31533 hierarchical.cpp:326] Removed framework 5635fc33-8d66-4127-a760-dea363e338d4-0000
[       OK ] ContentType/SchedulerHttpApiTest.DefaultAccept/1 (76 ms)
[----------] 20 tests from ContentType/SchedulerHttpApiTest (1669 ms total)

[----------] 26 tests from ContentType/SchedulerTest
[ RUN      ] ContentType/SchedulerTest.Subscribe/0
I0301 22:32:18.069444 31500 leveldb.cpp:174] Opened db in 2.303022ms
I0301 22:32:18.071758 31500 leveldb.cpp:181] Compacted db in 2.280286ms
I0301 22:32:18.071914 31500 leveldb.cpp:196] Created db iterator in 35082ns
I0301 22:32:18.072024 31500 leveldb.cpp:202] Seeked to beginning of db in 15411ns
I0301 22:32:18.072119 31500 leveldb.cpp:271] Iterated through 0 keys in the db in 12408ns
I0301 22:32:18.072245 31500 replica.cpp:779] Replica recovered with log positions 0 ->
0 with 1 holes and 0 unlearned
I0301 22:32:18.073053 31531 recover.cpp:447] Starting replica recovery
I0301 22:32:18.073349 31527 recover.cpp:473] Replica is in EMPTY status
I0301 22:32:18.074687 31519 replica.cpp:673] Replica in EMPTY status received a broadcasted
recover request from (14393)@172.17.0.2:44992
I0301 22:32:18.076740 31528 master.cpp:375] Master 00141d74-fe99-4ee8-b0fc-e46f8dac1254 (489f7eb52de0)
started on 172.17.0.2:44992
I0301 22:32:18.076822 31528 master.cpp:377] Flags at startup: --acls="" --allocation_interval="1secs"
--allocator="HierarchicalDRF" --authenticate="false" --authenticate_http="true" --authenticate_slaves="true"
--authenticators="crammd5" --authorizers="local" --credentials="/tmp/ij0DSj/credentials" --framework_sorter="drf"
--help="false" --hostname_lookup="true" --http_authenticators="basic" --initialize_driver_logging="true"
--log_auto_initialize="true" --logbufsecs="0" --logging_level="INFO" --max_completed_frameworks="50"
--max_completed_tasks_per_framework="1000" --max_slave_ping_timeouts="5" --quiet="false" --recovery_slave_removal_limit="100%"
--registry="replicated_log" --registry_fetch_timeout="1mins" --registry_store_timeout="100secs"
--registry_strict="true" --root_submissions="true" --slave_ping_timeout="15secs" --slave_reregister_timeout="10mins"
--user_sorter="drf" --version="false" --webui_dir="/mesos/mesos-0.28.0/_inst/share/mesos/webui"
--work_dir="/tmp/ij0DSj/master" --zk_session_timeout="10secs"
I0301 22:32:18.077231 31528 master.cpp:424] Master allowing unauthenticated frameworks to
register
I0301 22:32:18.077245 31528 master.cpp:427] Master only allowing authenticated slaves to register
I0301 22:32:18.077257 31528 credentials.hpp:35] Loading credentials for authentication from
'/tmp/ij0DSj/credentials'
I0301 22:32:18.077625 31528 master.cpp:467] Using default 'crammd5' authenticator
I0301 22:32:18.077770 31519 recover.cpp:193] Received a recover response from a replica in
EMPTY status
I0301 22:32:18.077832 31528 master.cpp:536] Using default 'basic' HTTP authenticator
I0301 22:32:18.078029 31528 master.cpp:570] Authorization enabled
I0301 22:32:18.078258 31520 hierarchical.cpp:144] Initialized hierarchical allocator process
I0301 22:32:18.078335 31520 whitelist_watcher.cpp:77] No whitelist given
I0301 22:32:18.078377 31520 recover.cpp:564] Updating replica status to STARTING
I0301 22:32:18.079735 31519 leveldb.cpp:304] Persisting metadata (8 bytes) to leveldb took
1.238554ms
I0301 22:32:18.079882 31519 replica.cpp:320] Persisted replica status to STARTING
I0301 22:32:18.080215 31519 recover.cpp:473] Replica is in STARTING status
I0301 22:32:18.080922 31520 master.cpp:1711] The newly elected leader is master@172.17.0.2:44992
with id 00141d74-fe99-4ee8-b0fc-e46f8dac1254
I0301 22:32:18.081709 31520 master.cpp:1724] Elected as the leading master!
I0301 22:32:18.081737 31520 master.cpp:1469] Recovering from registrar
I0301 22:32:18.081985 31532 registrar.cpp:307] Recovering registrar
I0301 22:32:18.083318 31524 replica.cpp:673] Replica in STARTING status received a broadcasted
recover request from (14395)@172.17.0.2:44992
I0301 22:32:18.083760 31531 recover.cpp:193] Received a recover response from a replica in
STARTING status
I0301 22:32:18.084532 31531 recover.cpp:564] Updating replica status to VOTING
I0301 22:32:18.085721 31519 leveldb.cpp:304] Persisting metadata (8 bytes) to leveldb took
936018ns
I0301 22:32:18.085762 31519 replica.cpp:320] Persisted replica status to VOTING
I0301 22:32:18.085908 31519 recover.cpp:578] Successfully joined the Paxos group
I0301 22:32:18.086125 31519 recover.cpp:462] Recover process terminated
I0301 22:32:18.086798 31519 log.cpp:659] Attempting to start the writer
I0301 22:32:18.088101 31519 replica.cpp:493] Replica received implicit promise request from
(14396)@172.17.0.2:44992 with proposal 1
I0301 22:32:18.088589 31519 leveldb.cpp:304] Persisting metadata (8 bytes) to leveldb took
458409ns
I0301 22:32:18.088712 31519 replica.cpp:342] Persisted promised to 1
I0301 22:32:18.089923 31519 coordinator.cpp:238] Coordinator attempting to fill missing positions
I0301 22:32:18.092862 31531 replica.cpp:388] Replica received explicit promise request from
(14397)@172.17.0.2:44992 for position 0 with proposal 2
I0301 22:32:18.093729 31531 leveldb.cpp:341] Persisting action (8 bytes) to leveldb took 807621ns
I0301 22:32:18.093765 31531 replica.cpp:712] Persisted action at 0
I0301 22:32:18.095700 31530 replica.cpp:537] Replica received write request for position 0
from (14398)@172.17.0.2:44992
I0301 22:32:18.095821 31530 leveldb.cpp:436] Reading position from leveldb took 60317ns
I0301 22:32:18.096698 31530 leveldb.cpp:341] Persisting action (14 bytes) to leveldb took
840192ns
I0301 22:32:18.096729 31530 replica.cpp:712] Persisted action at 0
I0301 22:32:18.097584 31530 replica.cpp:691] Replica received learned notice for position
0 from @0.0.0.0:0
I0301 22:32:18.098723 31530 leveldb.cpp:341] Persisting action (16 bytes) to leveldb took
1.027751ms
I0301 22:32:18.098767 31530 replica.cpp:712] Persisted action at 0
I0301 22:32:18.098791 31530 replica.cpp:697] Replica learned NOP action at position 0
I0301 22:32:18.099741 31533 log.cpp:675] Writer started with ending position 0
I0301 22:32:18.101130 31530 leveldb.cpp:436] Reading position from leveldb took 70909ns
I0301 22:32:18.102481 31530 registrar.cpp:340] Successfully fetched the registry (0B) in 20.349184ms
I0301 22:32:18.102726 31530 registrar.cpp:439] Applied 1 operations in 63267ns; attempting
to update the 'registry'
I0301 22:32:18.103988 31528 log.cpp:683] Attempting to append 170 bytes to the log
I0301 22:32:18.104276 31526 coordinator.cpp:348] Coordinator attempting to write APPEND action
at position 1
I0301 22:32:18.105343 31526 replica.cpp:537] Replica received write request for position 1
from (14399)@172.17.0.2:44992
I0301 22:32:18.106745 31526 leveldb.cpp:341] Persisting action (189 bytes) to leveldb took
1.368198ms
I0301 22:32:18.106799 31526 replica.cpp:712] Persisted action at 1
I0301 22:32:18.108192 31532 replica.cpp:691] Replica received learned notice for position
1 from @0.0.0.0:0
I0301 22:32:18.108726 31532 leveldb.cpp:341] Persisting action (191 bytes) to leveldb took
508170ns
I0301 22:32:18.108759 31532 replica.cpp:712] Persisted action at 1
I0301 22:32:18.108786 31532 replica.cpp:697] Replica learned APPEND action at position 1
I0301 22:32:18.110859 31527 registrar.cpp:484] Successfully updated the 'registry' in 7.95904ms
I0301 22:32:18.111088 31527 registrar.cpp:370] Successfully recovered registrar
I0301 22:32:18.111420 31519 log.cpp:702] Attempting to truncate the log to 1
I0301 22:32:18.111553 31526 coordinator.cpp:348] Coordinator attempting to write TRUNCATE
action at position 2
I0301 22:32:18.111574 31532 master.cpp:1521] Recovered 0 slaves from the Registry (131B) ;
allowing 10mins for slaves to re-register
I0301 22:32:18.111697 31519 hierarchical.cpp:171] Skipping recovery of hierarchical allocator:
nothing to recover
I0301 22:32:18.112565 31523 replica.cpp:537] Replica received write request for position 2
from (14400)@172.17.0.2:44992
I0301 22:32:18.113734 31523 leveldb.cpp:341] Persisting action (16 bytes) to leveldb took
1.138605ms
I0301 22:32:18.113782 31523 replica.cpp:712] Persisted action at 2
I0301 22:32:18.114940 31526 replica.cpp:691] Replica received learned notice for position
2 from @0.0.0.0:0
I0301 22:32:18.115725 31526 leveldb.cpp:341] Persisting action (18 bytes) to leveldb took
758811ns
I0301 22:32:18.115802 31526 leveldb.cpp:399] Deleting ~1 keys from leveldb took 57878ns
I0301 22:32:18.115829 31526 replica.cpp:712] Persisted action at 2
I0301 22:32:18.115857 31526 replica.cpp:697] Replica learned TRUNCATE action at position 2
I0301 22:32:18.124531 31500 scheduler.cpp:172] Version: 0.28.0
I0301 22:32:18.125470 31530 scheduler.cpp:432] New master detected at master@172.17.0.2:44992
I0301 22:32:18.127701 31530 scheduler.cpp:332] Connected with the master at http://172.17.0.2:44992/master/api/v1/scheduler
I0301 22:32:18.129575 31530 scheduler.cpp:230] Sending SUBSCRIBE call to http://172.17.0.2:44992/master/api/v1/scheduler
I0301 22:32:18.131461 31520 process.cpp:3141] Handling HTTP event for process 'master' with
path: '/master/api/v1/scheduler'
I0301 22:32:18.132069 31530 http.cpp:311] HTTP POST for /master/api/v1/scheduler from 172.17.0.2:57702
I0301 22:32:18.132369 31530 master.cpp:1973] Received subscription request for HTTP framework
'default'
I0301 22:32:18.132396 31530 master.cpp:1750] Authorizing framework principal 'test-principal'
to receive offers for role '*'
I0301 22:32:18.132812 31530 master.cpp:2064] Subscribing framework 'default' with checkpointing
disabled and capabilities [  ]
I0301 22:32:18.133330 31533 hierarchical.cpp:265] Added framework 00141d74-fe99-4ee8-b0fc-e46f8dac1254-0000
I0301 22:32:18.133402 31530 master.hpp:1657] Sending heartbeat to 00141d74-fe99-4ee8-b0fc-e46f8dac1254-0000
I0301 22:32:18.133414 31533 hierarchical.cpp:1437] No resources available to allocate!
I0301 22:32:18.133446 31533 hierarchical.cpp:1532] No inverse offers to send out!
I0301 22:32:18.133474 31533 hierarchical.cpp:1130] Performed allocation for 0 slaves in 128820ns
I0301 22:32:18.135706 31525 scheduler.cpp:602] Enqueuing event SUBSCRIBED received from http://172.17.0.2:44992/master/api/v1/scheduler
I0301 22:32:18.136734 31530 scheduler.cpp:602] Enqueuing event HEARTBEAT received from http://172.17.0.2:44992/master/api/v1/scheduler
I0301 22:32:18.137121 31530 master_maintenance_tests.cpp:177] Ignoring HEARTBEAT event
I0301 22:32:18.137570 31500 master.cpp:1026] Master terminating
I0301 22:32:18.137966 31519 hierarchical.cpp:326] Removed framework 00141d74-fe99-4ee8-b0fc-e46f8dac1254-0000
E0301 22:32:18.140622 31522 scheduler.cpp:575] End-Of-File received from master. The master
closed the event stream
I0301 22:32:18.142974 31522 scheduler.cpp:414] Re-detecting master
I0301 22:32:18.143271 31522 scheduler.cpp:365] Ignoring disconnection attempt from stale connection
I0301 22:32:18.143311 31522 scheduler.cpp:365] Ignoring disconnection attempt from stale connection
I0301 22:32:18.143860 31523 scheduler.cpp:432] New master detected at master@172.17.0.2:44992
I0301 22:32:18.146761 31524 scheduler.cpp:332] Connected with the master at http://172.17.0.2:44992/master/api/v1/scheduler
F0301 22:32:18.146761 31520 logging.cpp:64] RAW: Pure virtual method called
[       OK ] ContentType/SchedulerTest.Subscribe/0 (87 ms)
[ RUN      ] ContentType/SchedulerTest.Subscribe/1
I0301 22:32:18.159003 31500 leveldb.cpp:174] Opened db in 4.106115ms
I0301 22:32:18.162915 31500 leveldb.cpp:181] Compacted db in 3.875799ms
I0301 22:32:18.163028 31500 leveldb.cpp:196] Created db iterator in 41358ns
I0301 22:32:18.163049 31500 leveldb.cpp:202] Seeked to beginning of db in 11596ns
I0301 22:32:18.163063 31500 leveldb.cpp:271] Iterated through 0 keys in the db in 10560ns
I0301 22:32:18.163118 31500 replica.cpp:779] Replica recovered with log positions 0 ->
0 with 1 holes and 0 unlearned
I0301 22:32:18.166224 31521 master.cpp:375] Master dd30e384-02bd-4d7b-8e8d-3173e956adcf (489f7eb52de0)
started on 172.17.0.2:44992
I0301 22:32:18.166296 31521 master.cpp:377] Flags at startup: --acls="" --allocation_interval="1secs"
--allocator="HierarchicalDRF" --authenticate="false" --authenticate_http="true" --authenticate_slaves="true"
--authenticators="crammd5" --authorizers="local" --credentials="/tmp/p1tpzz/credentials" --framework_sorter="drf"
--help="false" --hostname_lookup="true" --http_authenticators="basic" --initialize_driver_logging="true"
--log_auto_initialize="true" --logbufsecs="0" --logging_level="INFO" --max_completed_frameworks="50"
--max_completed_tasks_per_framework="1000" --max_slave_ping_timeouts="5" --quiet="false" --recovery_slave_removal_limit="100%"
--registry="replicated_log" --registry_fetch_timeout="1mins" --registry_store_timeout="100secs"
--registry_strict="true" --root_submissions="true" --slave_ping_timeout="15secs" --slave_reregister_timeout="10mins"
--user_sorter="drf" --version="false" --webui_dir="/mesos/mesos-0.28.0/_inst/share/mesos/webui"
--work_dir="/tmp/p1tpzz/master" --zk_session_timeout="10secs"
I0301 22:32:18.166759 31521 master.cpp:424] Master allowing unauthenticated frameworks to
register
I0301 22:32:18.166774 31521 master.cpp:427] Master only allowing authenticated slaves to register
I0301 22:32:18.166784 31521 credentials.hpp:35] Loading credentials for authentication from
'/tmp/p1tpzz/credentials'
I0301 22:32:18.166815 31533 recover.cpp:447] Starting replica recovery
I0301 22:32:18.167143 31533 recover.cpp:473] Replica is in EMPTY status
I0301 22:32:18.167354 31521 master.cpp:467] Using default 'crammd5' authenticator
I0301 22:32:18.167526 31521 master.cpp:536] Using default 'basic' HTTP authenticator
I0301 22:32:18.167675 31521 master.cpp:570] Authorization enabled
I0301 22:32:18.167891 31524 hierarchical.cpp:144] Initialized hierarchical allocator process
I0301 22:32:18.167973 31528 whitelist_watcher.cpp:77] No whitelist given
I0301 22:32:18.168871 31524 replica.cpp:673] Replica in EMPTY status received a broadcasted
recover request from (14408)@172.17.0.2:44992
I0301 22:32:18.169406 31526 recover.cpp:193] Received a recover response from a replica in
EMPTY status
I0301 22:32:18.174275 31518 recover.cpp:564] Updating replica status to STARTING
I0301 22:32:18.175457 31518 master.cpp:1711] The newly elected leader is master@172.17.0.2:44992
with id dd30e384-02bd-4d7b-8e8d-3173e956adcf
I0301 22:32:18.175494 31518 master.cpp:1724] Elected as the leading master!
I0301 22:32:18.175509 31518 master.cpp:1469] Recovering from registrar
I0301 22:32:18.175739 31524 registrar.cpp:307] Recovering registrar
I0301 22:32:18.175784 31526 leveldb.cpp:304] Persisting metadata (8 bytes) to leveldb took
1.342253ms
I0301 22:32:18.175840 31526 replica.cpp:320] Persisted replica status to STARTING
I0301 22:32:18.176234 31530 recover.cpp:473] Replica is in STARTING status
I0301 22:32:18.177446 31531 replica.cpp:673] Replica in STARTING status received a broadcasted
recover request from (14409)@172.17.0.2:44992
I0301 22:32:18.177783 31526 recover.cpp:193] Received a recover response from a replica in
STARTING status
    @     0x2abed3caddbd  google::LogMessage::Fail()
I0301 22:32:18.178369 31531 recover.cpp:564] Updating replica status to VOTING
I0301 22:32:18.179106 31531 leveldb.cpp:304] Persisting metadata (8 bytes) to leveldb took
494887ns
I0301 22:32:18.179200 31531 replica.cpp:320] Persisted replica status to VOTING
I0301 22:32:18.179414 31531 recover.cpp:578] Successfully joined the Paxos group
I0301 22:32:18.179710 31531 recover.cpp:462] Recover process terminated
I0301 22:32:18.180217 31527 log.cpp:659] Attempting to start the writer
I0301 22:32:18.181856 31522 replica.cpp:493] Replica received implicit promise request from
(14410)@172.17.0.2:44992 with proposal 1
I0301 22:32:18.182631 31522 leveldb.cpp:304] Persisting metadata (8 bytes) to leveldb took
401361ns
I0301 22:32:18.182850 31522 replica.cpp:342] Persisted promised to 1
I0301 22:32:18.183843 31532 coordinator.cpp:238] Coordinator attempting to fill missing positions
    @     0x2abed3cb5980  google::RawLog__()
I0301 22:32:18.186357 31531 replica.cpp:388] Replica received explicit promise request from
(14411)@172.17.0.2:44992 for position 0 with proposal 2
I0301 22:32:18.186936 31531 leveldb.cpp:341] Persisting action (8 bytes) to leveldb took 522851ns
I0301 22:32:18.186967 31531 replica.cpp:712] Persisted action at 0
I0301 22:32:18.188347 31531 replica.cpp:537] Replica received write request for position 0
from (14412)@172.17.0.2:44992
I0301 22:32:18.188478 31531 leveldb.cpp:436] Reading position from leveldb took 45104ns
I0301 22:32:18.189580 31531 leveldb.cpp:341] Persisting action (14 bytes) to leveldb took
993569ns
I0301 22:32:18.189676 31531 replica.cpp:712] Persisted action at 0
I0301 22:32:18.190524 31531 replica.cpp:691] Replica received learned notice for position
0 from @0.0.0.0:0
I0301 22:32:18.191062 31531 leveldb.cpp:341] Persisting action (16 bytes) to leveldb took
459470ns
I0301 22:32:18.191148 31531 replica.cpp:712] Persisted action at 0
I0301 22:32:18.191246 31531 replica.cpp:697] Replica learned NOP action at position 0
I0301 22:32:18.192235 31531 log.cpp:675] Writer started with ending position 0
I0301 22:32:18.193620 31531 leveldb.cpp:436] Reading position from leveldb took 59660ns
    @     0x2abed2abda08  __cxa_pure_virtual
I0301 22:32:18.194839 31524 registrar.cpp:340] Successfully fetched the registry (0B) in 19.060224ms
I0301 22:32:18.194972 31524 registrar.cpp:439] Applied 1 operations in 46049ns; attempting
to update the 'registry'
I0301 22:32:18.196099 31531 log.cpp:683] Attempting to append 170 bytes to the log
I0301 22:32:18.196305 31531 coordinator.cpp:348] Coordinator attempting to write APPEND action
at position 1
I0301 22:32:18.197530 31522 replica.cpp:537] Replica received write request for position 1
from (14413)@172.17.0.2:44992
I0301 22:32:18.198740 31522 leveldb.cpp:341] Persisting action (189 bytes) to leveldb took
1.156261ms
I0301 22:32:18.198787 31522 replica.cpp:712] Persisted action at 1
I0301 22:32:18.200004 31527 replica.cpp:691] Replica received learned notice for position
1 from @0.0.0.0:0
I0301 22:32:18.200438 31527 leveldb.cpp:341] Persisting action (191 bytes) to leveldb took
405796ns
I0301 22:32:18.200467 31527 replica.cpp:712] Persisted action at 1
I0301 22:32:18.200492 31527 replica.cpp:697] Replica learned APPEND action at position 1
I0301 22:32:18.202607 31527 registrar.cpp:484] Successfully updated the 'registry' in 7.54304ms
I0301 22:32:18.203107 31527 registrar.cpp:370] Successfully recovered registrar
I0301 22:32:18.203619 31527 log.cpp:702] Attempting to truncate the log to 1
    @          0x18cd35f  testing::internal::UntypedFunctionMockerBase::UntypedInvokeWith()
I0301 22:32:18.204648 31527 master.cpp:1521] Recovered 0 slaves from the Registry (131B) ;
allowing 10mins for slaves to re-register
I0301 22:32:18.204987 31527 coordinator.cpp:348] Coordinator attempting to write TRUNCATE
action at position 2
I0301 22:32:18.205811 31527 hierarchical.cpp:171] Skipping recovery of hierarchical allocator:
nothing to recover
I0301 22:32:18.207159 31527 replica.cpp:537] Replica received write request for position 2
from (14414)@172.17.0.2:44992
I0301 22:32:18.207893 31527 leveldb.cpp:341] Persisting action (16 bytes) to leveldb took
684325ns
I0301 22:32:18.208173 31527 replica.cpp:712] Persisted action at 2
I0301 22:32:18.210052 31531 replica.cpp:691] Replica received learned notice for position
2 from @0.0.0.0:0
I0301 22:32:18.211107 31531 leveldb.cpp:341] Persisting action (18 bytes) to leveldb took
638472ns
I0301 22:32:18.211469 31531 leveldb.cpp:399] Deleting ~1 keys from leveldb took 124112ns
I0301 22:32:18.211742 31531 replica.cpp:712] Persisted action at 2
I0301 22:32:18.212087 31531 replica.cpp:697] Replica learned TRUNCATE action at position 2
    @           0xf40448  _ZN7testing8internal18FunctionMockerBaseIFvvEE10InvokeWithERKSt5tupleIJEE
    @           0xf40419  testing::internal::FunctionMocker<>::Invoke()
    @          0x1419406  mesos::internal::tests::SchedulerTest::Callbacks::connected()
    @          0x146d982  _ZNKSt7_Mem_fnIMN5mesos8internal5tests13SchedulerTest9CallbacksEFvvEEclIJEvEEvRS4_DpOT_
    @          0x146d903  _ZNSt5_BindIFSt7_Mem_fnIMN5mesos8internal5tests13SchedulerTest9CallbacksEFvvEESt17reference_wrapperIS5_EEE6__callIvJEJLm0EEEET_OSt5tupleIJDpT0_EESt12_Index_tupleIJXspT1_EEE
    @          0x146d8b6  _ZNSt5_BindIFSt7_Mem_fnIMN5mesos8internal5tests13SchedulerTest9CallbacksEFvvEESt17reference_wrapperIS5_EEEclIJEvEET0_DpOT_
    @          0x146d5bd  std::_Function_handler<>::_M_invoke()
    @           0x84363e  std::function<>::operator()()
    @     0x2abed29e7acd  process::AsyncExecutorProcess::execute<>()
    @     0x2abed29e8427  _ZZN7process8dispatchI7NothingNS_20AsyncExecutorProcessERKSt8functionIFvvEEPvS5_S8_EENS_6FutureIT_EERKNS_3PIDIT0_EEMSD_FSA_T1_T2_ET3_T4_ENKUlPNS_11ProcessBaseEE_clESO_
    @     0x2abed29e8022  _ZNSt17_Function_handlerIFvPN7process11ProcessBaseEEZNS0_8dispatchI7NothingNS0_20AsyncExecutorProcessERKSt8functionIFvvEEPvS9_SC_EENS0_6FutureIT_EERKNS0_3PIDIT0_EEMSH_FSE_T1_T2_ET3_T4_EUlS2_E_E9_M_invokeERKSt9_Any_dataS2_
    @     0x2abed3c0b0d8  std::function<>::operator()()
    @     0x2abed3bf50f4  process::ProcessBase::visit()
    @     0x2abed3c4b79e  process::DispatchEvent::visit()
    @           0x85f931  process::ProcessBase::serve()
    @     0x2abed3bf2e14  process::ProcessManager::resume()
    @     0x2abed3bfb085  process::ProcessManager::init_threads()::$_1::operator()()
    @     0x2abed3bfafc3  _ZNSt5_BindIFZN7process14ProcessManager12init_threadsEvE3$_1St17reference_wrapperIKSt11atomic_boolEEE6__callIvJEJLm0EEEET_OSt5tupleIJDpT0_EESt12_Index_tupleIJXspT1_EEE
    @     0x2abed3bfaf76  _ZNSt5_BindIFZN7process14ProcessManager12init_threadsEvE3$_1St17reference_wrapperIKSt11atomic_boolEEEclIJEvEET0_DpOT_
    @     0x2abed3bfaf25  _ZNSt12_Bind_simpleIFSt5_BindIFZN7process14ProcessManager12init_threadsEvE3$_1St17reference_wrapperIKSt11atomic_boolEEEvEE9_M_invokeIJEEEvSt12_Index_tupleIJXspT_EEE
    @     0x2abed3bfaef5  std::_Bind_simple<>::operator()()
    @     0x2abed3bfaecc  std::thread::_Impl<>::_M_run()
    @     0x2abed53c6a60  (unknown)
    @     0x2abed5b3d182  start_thread
    @     0x2abed5e4d47d  (unknown)
make[4]: Leaving directory `/mesos/mesos-0.28.0/_build/src'
make[4]: *** [check-local] Aborted
make[3]: Leaving directory `/mesos/mesos-0.28.0/_build/src'
make[3]: *** [check-am] Error 2
make[2]: Leaving directory `/mesos/mesos-0.28.0/_build/src'
make[2]: *** [check] Error 2
make[1]: Leaving directory `/mesos/mesos-0.28.0/_build'
make[1]: *** [check-recursive] Error 1
make: *** [distcheck] Error 1
+ docker rmi mesos-1456869521-9883
Untagged: mesos-1456869521-9883:latest
Deleted: 814009e4db862bfb5f2ed70fbbc3120eab28bd336ad826591391a2b971adef28
Deleted: c6670071c9d532ae7f4d79ce1471afaeca1f96a4ecf0afcafdfb2329db6fc3ef
Deleted: 47d7328dd97149ba2889c0b6ffa9fbefeb4e63638d09e3a2c39c9c2d9aaf63e9
Deleted: ce4cdf16fbfa9b136c5edd23d0d91747eb96579a70c941271297c49579a1cdc3
Deleted: 9b7ad872933ed52e053a461f5afa6c9bfe2c314e074b72594dec70b21ea8dbe5
Deleted: 0c74e4624ba15f6747e7e48252a5334803b682a70aac42303068f2dc376f243e
Deleted: 4d767c24d9729f4e35cce82a215af2fefe3a5c294566841437ba9cc43ade41cb
Deleted: ce79beddc8b93c2ae98139b0e57b0391bf49b3fe60986781e5eca4e15dbeca01
Deleted: 85dd4330b38980af09c64c8b61553b50b02cabd7c41eb0ed8b74ae2737d84f05
Deleted: d76639204cd7abe703502fede5c0817e4aadb9fb0b1a5d3d0417334b1680e181
Deleted: dca6f588f7a0f9b4c6057c9b0213ed4d8dc8065e268d391efef265cfa19174b9
Deleted: 421ee6f5407a79dd65f46d8bec9d424e6582b739b2c4da1993d890a99b631c9e
Deleted: 1f7082463cc98dd0a3ee51b0196fa7ad87b4f340e435dedf797c20f45934cf34
Deleted: dd594bd004b3d2b4c099bfcef1f606a24b736a140885ea5cfc5a261bac495bcc
Deleted: 3eb7d87fabaf6a96dcdc8d00e80db223e178aa36bc21e0fc654acb2f5f852a09
Deleted: 0c7067a6ef24c3889b8f9a99801e991d4778dba9e9fe4e77475992152815a8d6
Build step 'Execute shell' marked build as failure

Mime
View raw message