mesos-builds mailing list archives

Site index · List index
Message view « Date » · « Thread »
Top « Date » · « Thread »
From Apache Jenkins Server <jenk...@builds.apache.org>
Subject Build failed in Jenkins: Mesos » gcc,--verbose --enable-libevent --enable-ssl,GLOG_v=1 MESOS_VERBOSE=1,ubuntu:14.04,(docker||Hadoop)&&(!ubuntu-us1) #1894
Date Tue, 29 Mar 2016 19:13:36 GMT
See <https://builds.apache.org/job/Mesos/COMPILER=gcc,CONFIGURATION=--verbose%20--enable-libevent%20--enable-ssl,ENVIRONMENT=GLOG_v=1%20MESOS_VERBOSE=1,OS=ubuntu%3A14.04,label_exp=(docker%7C%7CHadoop)&&(!ubuntu-us1)/1894/>

------------------------------------------
[...truncated 18962 lines...]
[       OK ] ProcessTest.FirewallUninstall (5 ms)
[----------] 30 tests from ProcessTest (75 ms total)

[----------] 3 tests from QueueTest
[ RUN      ] QueueTest.Block
[       OK ] QueueTest.Block (0 ms)
[ RUN      ] QueueTest.Noblock
[       OK ] QueueTest.Noblock (0 ms)
[ RUN      ] QueueTest.Queue
[       OK ] QueueTest.Queue (0 ms)
[----------] 3 tests from QueueTest (0 ms total)

[----------] 3 tests from ReapTest
[ RUN      ] ReapTest.NonChildProcess
[       OK ] ReapTest.NonChildProcess (44 ms)
[ RUN      ] ReapTest.ChildProcess
[       OK ] ReapTest.ChildProcess (31 ms)
[ RUN      ] ReapTest.TerminatedChildProcess
[       OK ] ReapTest.TerminatedChildProcess (22 ms)
[----------] 3 tests from ReapTest (97 ms total)

[----------] 4 tests from SequenceTest
[ RUN      ] SequenceTest.Serialize
[       OK ] SequenceTest.Serialize (11 ms)
[ RUN      ] SequenceTest.DiscardOne
[       OK ] SequenceTest.DiscardOne (11 ms)
[ RUN      ] SequenceTest.DiscardAll
[       OK ] SequenceTest.DiscardAll (11 ms)
[ RUN      ] SequenceTest.Random
[       OK ] SequenceTest.Random (11 ms)
[----------] 4 tests from SequenceTest (44 ms total)

[----------] 4 tests from SharedTest
[ RUN      ] SharedTest.ConstAccess
[       OK ] SharedTest.ConstAccess (0 ms)
[ RUN      ] SharedTest.Null
[       OK ] SharedTest.Null (0 ms)
[ RUN      ] SharedTest.Reset
[       OK ] SharedTest.Reset (0 ms)
[ RUN      ] SharedTest.Own
[       OK ] SharedTest.Own (2 ms)
[----------] 4 tests from SharedTest (2 ms total)

[----------] 3 tests from StatisticsTest
[ RUN      ] StatisticsTest.Empty
[       OK ] StatisticsTest.Empty (0 ms)
[ RUN      ] StatisticsTest.Single
[       OK ] StatisticsTest.Single (0 ms)
[ RUN      ] StatisticsTest.Statistics
[       OK ] StatisticsTest.Statistics (0 ms)
[----------] 3 tests from StatisticsTest (0 ms total)

[----------] 14 tests from SubprocessTest
[ RUN      ] SubprocessTest.Status
[       OK ] SubprocessTest.Status (84 ms)
[ RUN      ] SubprocessTest.PipeOutput
[       OK ] SubprocessTest.PipeOutput (25 ms)
[ RUN      ] SubprocessTest.PipeInput
[       OK ] SubprocessTest.PipeInput (13 ms)
[ RUN      ] SubprocessTest.PipeRedirect
[       OK ] SubprocessTest.PipeRedirect (12 ms)
[ RUN      ] SubprocessTest.PathOutput
[       OK ] SubprocessTest.PathOutput (43 ms)
[ RUN      ] SubprocessTest.PathInput
[       OK ] SubprocessTest.PathInput (13 ms)
[ RUN      ] SubprocessTest.FdOutput
[       OK ] SubprocessTest.FdOutput (42 ms)
[ RUN      ] SubprocessTest.FdInput
[       OK ] SubprocessTest.FdInput (13 ms)
[ RUN      ] SubprocessTest.Default
hello world
[       OK ] SubprocessTest.Default (21 ms)
[ RUN      ] SubprocessTest.Flags
[       OK ] SubprocessTest.Flags (22 ms)
[ RUN      ] SubprocessTest.Environment
[       OK ] SubprocessTest.Environment (24 ms)
[ RUN      ] SubprocessTest.EnvironmentWithSpaces
[       OK ] SubprocessTest.EnvironmentWithSpaces (13 ms)
[ RUN      ] SubprocessTest.EnvironmentWithSpacesAndQuotes
[       OK ] SubprocessTest.EnvironmentWithSpacesAndQuotes (12 ms)
[ RUN      ] SubprocessTest.EnvironmentOverride
[       OK ] SubprocessTest.EnvironmentOverride (13 ms)
[----------] 14 tests from SubprocessTest (350 ms total)

[----------] 3 tests from TimeSeriesTest
[ RUN      ] TimeSeriesTest.Set
[       OK ] TimeSeriesTest.Set (0 ms)
[ RUN      ] TimeSeriesTest.Sparsify
[       OK ] TimeSeriesTest.Sparsify (0 ms)
[ RUN      ] TimeSeriesTest.Truncate
[       OK ] TimeSeriesTest.Truncate (1 ms)
[----------] 3 tests from TimeSeriesTest (1 ms total)

[----------] 5 tests from TimeTest
[ RUN      ] TimeTest.Arithmetic
[       OK ] TimeTest.Arithmetic (0 ms)
[ RUN      ] TimeTest.Now
[       OK ] TimeTest.Now (0 ms)
[ RUN      ] TimeTest.RFC1123Output
[       OK ] TimeTest.RFC1123Output (0 ms)
[ RUN      ] TimeTest.RFC3339Output
[       OK ] TimeTest.RFC3339Output (0 ms)
[ RUN      ] TimeTest.Output
[       OK ] TimeTest.Output (0 ms)
[----------] 5 tests from TimeTest (0 ms total)

[----------] 1 test from SSL
[ RUN      ] SSL.Disabled
[       OK ] SSL.Disabled (0 ms)
[----------] 1 test from SSL (0 ms total)

[----------] 16 tests from SSLTest
[ RUN      ] SSLTest.BasicSameProcess
[       OK ] SSLTest.BasicSameProcess (471 ms)
[ RUN      ] SSLTest.SSLSocket
[       OK ] SSLTest.SSLSocket (333 ms)
[ RUN      ] SSLTest.NonSSLSocket
I0329 19:13:29.631881 31562 libevent_ssl_socket.cpp:1066] Socket error: error:140760FC:SSL
routines:SSL23_GET_CLIENT_HELLO:unknown protocol
[       OK ] SSLTest.NonSSLSocket (502 ms)
[ RUN      ] SSLTest.NoVerifyBadCA
[       OK ] SSLTest.NoVerifyBadCA (301 ms)
[ RUN      ] SSLTest.RequireBadCA
W0329 19:13:30.534339 31562 openssl.cpp:250] Error with certificate at depth: 0
Issuer: /C=US/O=Test/CN=3b4e4d98ece7
Subject: /C=US/O=Test/CN=3b4e4d98ece7
Error (18): self signed certificate
I0329 19:13:30.534523 31562 libevent_ssl_socket.cpp:1066] Socket error: error:140890B2:SSL
routines:SSL3_GET_CLIENT_CERTIFICATE:no certificate returned
[       OK ] SSLTest.RequireBadCA (603 ms)
[ RUN      ] SSLTest.VerifyBadCA
W0329 19:13:31.250694 31562 openssl.cpp:250] Error with certificate at depth: 0
Issuer: /C=US/O=Test/CN=3b4e4d98ece7
Subject: /C=US/O=Test/CN=3b4e4d98ece7
Error (18): self signed certificate
I0329 19:13:31.251324 31562 libevent_ssl_socket.cpp:1066] Socket error: error:140890B2:SSL
routines:SSL3_GET_CLIENT_CERTIFICATE:no certificate returned
[       OK ] SSLTest.VerifyBadCA (704 ms)
[ RUN      ] SSLTest.VerifyCertificate
[       OK ] SSLTest.VerifyCertificate (804 ms)
[ RUN      ] SSLTest.RequireCertificate
[       OK ] SSLTest.RequireCertificate (201 ms)
[ RUN      ] SSLTest.ProtocolMismatch
I0329 19:13:32.686421 31545 ssl_tests.cpp:390] Testing server protocol 'SSL_ENABLE_SSL_V3'
with client protocol 'SSL_ENABLE_SSL_V3'
I0329 19:13:32.727771 31545 ssl_tests.cpp:390] Testing server protocol 'SSL_ENABLE_SSL_V3'
with client protocol 'SSL_ENABLE_TLS_V1_0'
I0329 19:13:32.739912 31562 libevent_ssl_socket.cpp:1066] Socket error: Connection reset by
peer
I0329 19:13:32.828697 31545 ssl_tests.cpp:390] Testing server protocol 'SSL_ENABLE_SSL_V3'
with client protocol 'SSL_ENABLE_TLS_V1_1'
I0329 19:13:32.842799 31562 libevent_ssl_socket.cpp:1066] Socket error: Connection reset by
peer
I0329 19:13:32.929580 31545 ssl_tests.cpp:390] Testing server protocol 'SSL_ENABLE_SSL_V3'
with client protocol 'SSL_ENABLE_TLS_V1_2'
I0329 19:13:32.940413 31562 libevent_ssl_socket.cpp:1066] Socket error: Connection reset by
peer
I0329 19:13:33.030313 31545 ssl_tests.cpp:390] Testing server protocol 'SSL_ENABLE_TLS_V1_0'
with client protocol 'SSL_ENABLE_SSL_V3'
I0329 19:13:33.044900 31562 libevent_ssl_socket.cpp:1066] Socket error: error:1408A10B:SSL
routines:SSL3_GET_CLIENT_HELLO:wrong version number
I0329 19:13:33.130849 31545 ssl_tests.cpp:390] Testing server protocol 'SSL_ENABLE_TLS_V1_0'
with client protocol 'SSL_ENABLE_TLS_V1_0'
I0329 19:13:33.231649 31545 ssl_tests.cpp:390] Testing server protocol 'SSL_ENABLE_TLS_V1_0'
with client protocol 'SSL_ENABLE_TLS_V1_1'
I0329 19:13:33.245203 31562 libevent_ssl_socket.cpp:1066] Socket error: Connection reset by
peer
I0329 19:13:33.332027 31545 ssl_tests.cpp:390] Testing server protocol 'SSL_ENABLE_TLS_V1_0'
with client protocol 'SSL_ENABLE_TLS_V1_2'
I0329 19:13:33.347427 31562 libevent_ssl_socket.cpp:1066] Socket error: Connection reset by
peer
I0329 19:13:33.433233 31545 ssl_tests.cpp:390] Testing server protocol 'SSL_ENABLE_TLS_V1_1'
with client protocol 'SSL_ENABLE_SSL_V3'
I0329 19:13:33.450075 31562 libevent_ssl_socket.cpp:1066] Socket error: error:140760FC:SSL
routines:SSL23_GET_CLIENT_HELLO:unknown protocol
I0329 19:13:33.533895 31545 ssl_tests.cpp:390] Testing server protocol 'SSL_ENABLE_TLS_V1_1'
with client protocol 'SSL_ENABLE_TLS_V1_0'
I0329 19:13:33.548272 31562 libevent_ssl_socket.cpp:1066] Socket error: error:140760FC:SSL
routines:SSL23_GET_CLIENT_HELLO:unknown protocol
I0329 19:13:33.635052 31545 ssl_tests.cpp:390] Testing server protocol 'SSL_ENABLE_TLS_V1_1'
with client protocol 'SSL_ENABLE_TLS_V1_1'
I0329 19:13:33.736445 31545 ssl_tests.cpp:390] Testing server protocol 'SSL_ENABLE_TLS_V1_1'
with client protocol 'SSL_ENABLE_TLS_V1_2'
I0329 19:13:33.751145 31562 libevent_ssl_socket.cpp:1066] Socket error: Connection reset by
peer
I0329 19:13:33.837260 31545 ssl_tests.cpp:390] Testing server protocol 'SSL_ENABLE_TLS_V1_2'
with client protocol 'SSL_ENABLE_SSL_V3'
I0329 19:13:33.847903 31562 libevent_ssl_socket.cpp:1066] Socket error: error:140760FC:SSL
routines:SSL23_GET_CLIENT_HELLO:unknown protocol
I0329 19:13:33.937732 31545 ssl_tests.cpp:390] Testing server protocol 'SSL_ENABLE_TLS_V1_2'
with client protocol 'SSL_ENABLE_TLS_V1_0'
I0329 19:13:33.949523 31562 libevent_ssl_socket.cpp:1066] Socket error: error:140760FC:SSL
routines:SSL23_GET_CLIENT_HELLO:unknown protocol
I0329 19:13:34.038811 31545 ssl_tests.cpp:390] Testing server protocol 'SSL_ENABLE_TLS_V1_2'
with client protocol 'SSL_ENABLE_TLS_V1_1'
I0329 19:13:34.051609 31562 libevent_ssl_socket.cpp:1066] Socket error: error:140760FC:SSL
routines:SSL23_GET_CLIENT_HELLO:unknown protocol
I0329 19:13:34.139714 31545 ssl_tests.cpp:390] Testing server protocol 'SSL_ENABLE_TLS_V1_2'
with client protocol 'SSL_ENABLE_TLS_V1_2'
[       OK ] SSLTest.ProtocolMismatch (1916 ms)
[ RUN      ] SSLTest.ValidDowngrade
W0329 19:13:34.387130 31545 openssl.cpp:363] Failed SSL connections will be downgraded to
a non-SSL socket
[       OK ] SSLTest.ValidDowngrade (201 ms)
[ RUN      ] SSLTest.NoValidDowngrade
I0329 19:13:34.707190 31562 libevent_ssl_socket.cpp:1066] Socket error: error:140760FC:SSL
routines:SSL23_GET_CLIENT_HELLO:unknown protocol
[       OK ] SSLTest.NoValidDowngrade (302 ms)
[ RUN      ] SSLTest.ValidDowngradeEachProtocol
I0329 19:13:35.342311 31545 ssl_tests.cpp:509] Testing server protocol 'SSL_ENABLE_SSL_V3'
W0329 19:13:35.342865 31545 openssl.cpp:363] Failed SSL connections will be downgraded to
a non-SSL socket
I0329 19:13:35.447290 31545 ssl_tests.cpp:509] Testing server protocol 'SSL_ENABLE_TLS_V1_0'
W0329 19:13:35.447887 31545 openssl.cpp:363] Failed SSL connections will be downgraded to
a non-SSL socket
I0329 19:13:35.547715 31545 ssl_tests.cpp:509] Testing server protocol 'SSL_ENABLE_TLS_V1_1'
W0329 19:13:35.548286 31545 openssl.cpp:363] Failed SSL connections will be downgraded to
a non-SSL socket
I0329 19:13:35.648443 31545 ssl_tests.cpp:509] Testing server protocol 'SSL_ENABLE_TLS_V1_2'
W0329 19:13:35.649459 31545 openssl.cpp:363] Failed SSL connections will be downgraded to
a non-SSL socket
[       OK ] SSLTest.ValidDowngradeEachProtocol (1005 ms)
[ RUN      ] SSLTest.NoValidDowngradeEachProtocol
I0329 19:13:36.023844 31545 ssl_tests.cpp:556] Testing server protocol 'SSL_ENABLE_SSL_V3'
I0329 19:13:36.034986 31562 libevent_ssl_socket.cpp:1066] Socket error: error:140760FC:SSL
routines:SSL23_GET_CLIENT_HELLO:unknown protocol
I0329 19:13:36.050943 31545 ssl_tests.cpp:556] Testing server protocol 'SSL_ENABLE_TLS_V1_0'
I0329 19:13:36.059715 31562 libevent_ssl_socket.cpp:1066] Socket error: error:140760FC:SSL
routines:SSL23_GET_CLIENT_HELLO:unknown protocol
I0329 19:13:36.151999 31545 ssl_tests.cpp:556] Testing server protocol 'SSL_ENABLE_TLS_V1_1'
I0329 19:13:36.162920 31562 libevent_ssl_socket.cpp:1066] Socket error: error:140760FC:SSL
routines:SSL23_GET_CLIENT_HELLO:unknown protocol
I0329 19:13:36.253232 31545 ssl_tests.cpp:556] Testing server protocol 'SSL_ENABLE_TLS_V1_2'
I0329 19:13:36.262586 31562 libevent_ssl_socket.cpp:1066] Socket error: error:140760FC:SSL
routines:SSL23_GET_CLIENT_HELLO:unknown protocol
[       OK ] SSLTest.NoValidDowngradeEachProtocol (605 ms)
[ RUN      ] SSLTest.PeerAddress
[       OK ] SSLTest.PeerAddress (141 ms)
[ RUN      ] SSLTest.HTTPSGet
../../../3rdparty/libprocess/src/tests/ssl_tests.cpp:663: Failure
(response).failure(): Failed to decode response
[  FAILED  ] SSLTest.HTTPSGet (563 ms)
[ RUN      ] SSLTest.HTTPSPost
../../../3rdparty/libprocess/src/tests/ssl_tests.cpp:704: Failure
(response).failure(): Failed to decode response
[  FAILED  ] SSLTest.HTTPSPost (261 ms)
[----------] 16 tests from SSLTest (8915 ms total)

[----------] Global test environment tear-down
[==========] 172 tests from 25 test cases ran. (10072 ms total)
[  PASSED  ] 170 tests.
[  FAILED  ] 2 tests, listed below:
[  FAILED  ] SSLTest.HTTPSGet
[  FAILED  ] SSLTest.HTTPSPost

 2 FAILED TESTS
  YOU HAVE 2 DISABLED TESTS

make[6]: *** [check-local] Error 1
make[6]: Leaving directory `/mesos/mesos-0.29.0/_build/3rdparty/libprocess'
make[5]: *** [check-am] Error 2
make[5]: Leaving directory `/mesos/mesos-0.29.0/_build/3rdparty/libprocess'
make[4]: *** [check-recursive] Error 1
make[4]: Leaving directory `/mesos/mesos-0.29.0/_build/3rdparty/libprocess'
make[3]: *** [check-recursive] Error 1
make[3]: Leaving directory `/mesos/mesos-0.29.0/_build/3rdparty'
make[2]: Leaving directory `/mesos/mesos-0.29.0/_build/3rdparty'
make[2]: *** [check] Error 2
make[1]: *** [check-recursive] Error 1
make[1]: Leaving directory `/mesos/mesos-0.29.0/_build'
make: *** [distcheck] Error 1
+ docker rmi mesos-1459277620-27979
Untagged: mesos-1459277620-27979:latest
Deleted: 260f6513ff5e0f73bf07e52cadcad172c4dd16c560ad04f5bf718f2aefb9d504
Deleted: 2c099372362f21edee2dfe5602ce97dcc1b11999213d594a718c5f2724c6b8e3
Deleted: ed24f97cd1684fa790d03edd8b5d313557ff81262ac1eefa9e02b22b77807477
Deleted: 02679b67b6bc5b86134411a2a71619e0fd66d25ad3c3e0428adc00ccaf7df077
Deleted: ea383d706e3dc3046d31a12b45b1e2d75f1dddb77a59ff1c844aa838a37a082a
Deleted: 59baa219fdad9abc1772bcbf41c56339d3f7e8d3cb521d77815d82ddad42bb07
Deleted: 57377dde89865ef27e38dce8b9b84bb93279b52e4c79cba21169195e65adbd21
Deleted: 0eebe8f0a53af966e80d7e3004d181d40248ea0d071b50660c9e6af6b7324d21
Deleted: ff0bbb3b5b03ea5e48110233a7c6320899d084d4fe70699c4fb7348ea8136bb7
Deleted: a44bceee45c9d6b2d8e56f039ffe50346f637fd91a1346ebdda24ab7958909d0
Deleted: 8e4e807a77971cacafe3ab32d642e9262ac8f1289b080b2884e784a3e0d2a281
Deleted: 0c2fad9aad7ece93f000ce64fb864b2a87ced1755b520d1885ee1aad3ca17208
Deleted: 1167edcb2189eb90859758c7c866dba572605b8331c0a88eba3d410545f34a7d
Deleted: 1f211597028d63fe7a6d06b2d738a894819bde1bfd31f553be566f67bc6a9a5c
Deleted: c242cd43bd024a119c002c31774c39e2752088e90d32ec295d67102234b47bc4
Deleted: 016478e4b5b7e3432b9432783698662e665d1e62d908d783035696e07017f9c7
Build step 'Execute shell' marked build as failure

Mime
View raw message