mesos-builds mailing list archives

Site index · List index
Message view « Date » · « Thread »
Top « Date » · « Thread »
From Apache Jenkins Server <jenk...@builds.apache.org>
Subject Build failed in Jenkins: Mesos » gcc,--verbose --enable-libevent --enable-ssl,GLOG_v=1 MESOS_VERBOSE=1,centos:7,(docker||Hadoop)&&(!ubuntu-us1) #1886
Date Tue, 29 Mar 2016 02:16:45 GMT
See <https://builds.apache.org/job/Mesos/COMPILER=gcc,CONFIGURATION=--verbose%20--enable-libevent%20--enable-ssl,ENVIRONMENT=GLOG_v=1%20MESOS_VERBOSE=1,OS=centos%3A7,label_exp=(docker%7C%7CHadoop)&&(!ubuntu-us1)/1886/changes>

Changes:

[bmahler] Added devices subsystem support in cgroups library.

[bmahler] Added tests for cgroups devices subsystem.

------------------------------------------
[...truncated 5313 lines...]
   ^
../../../3rdparty/libprocess/3rdparty/stout/include/stout/flags/flags.hpp:805:3: note: in
expansion of macro 'foreachvalue'
   foreachvalue (const flags::Flag& flag, *this) {
   ^
../../../3rdparty/libprocess/3rdparty/stout/include/stout/foreach.hpp:44:29: note: candidate
is:
             for (VARFIRST = BOOST_FOREACH_DEREF(COL).first;             \
                             ^
../../../3rdparty/libprocess/3rdparty/stout/include/stout/foreach.hpp:53:21: note: in expansion
of macro 'BOOST_FOREACH_PAIR'
 #define foreachpair BOOST_FOREACH_PAIR
                     ^
../../../3rdparty/libprocess/3rdparty/stout/include/stout/foreach.hpp:59:3: note: in expansion
of macro 'foreachpair'
   foreachpair (__foreach__::ignore, VAR, COL)
   ^
../../../3rdparty/libprocess/3rdparty/stout/include/stout/flags/flags.hpp:805:3: note: in
expansion of macro 'foreachvalue'
   foreachvalue (const flags::Flag& flag, *this) {
   ^
3rdparty/boost-1.53.0/boost/foreach.hpp:769:1: note: template<class T, class C> typename
boost::foreach_detail_::foreach_reference<T, C>::type boost::foreach_detail_::deref(boost::foreach_detail_::auto_any_t,
boost::foreach_detail_::type2type<T, C>*)
 deref(auto_any_t cur, type2type<T, C> *)
 ^
3rdparty/boost-1.53.0/boost/foreach.hpp:769:1: note:   substitution of deduced template arguments
resulted in errors seen above
In file included from ../../../3rdparty/libprocess/3rdparty/stout/include/stout/strings.hpp:22:0,
                 from ../../../3rdparty/libprocess/3rdparty/stout/include/stout/numify.hpp:25,
                 from ../../../3rdparty/libprocess/3rdparty/stout/include/stout/ip.hpp:56,
                 from ../../../3rdparty/libprocess/include/process/address.hpp:32,
                 from ../../../3rdparty/libprocess/src/process.cpp:57:
../../../3rdparty/libprocess/3rdparty/stout/include/stout/flags/flags.hpp:805:23: error: 'Flag'
in 'enum flags' does not name a type
   foreachvalue (const flags::Flag& flag, *this) {
                       ^
../../../3rdparty/libprocess/3rdparty/stout/include/stout/foreach.hpp:48:22: note: in definition
of macro 'BOOST_FOREACH_PAIR'
                 for (VARSECOND = BOOST_FOREACH_DEREF(COL).second;       \
                      ^
../../../3rdparty/libprocess/3rdparty/stout/include/stout/flags/flags.hpp:805:3: note: in
expansion of macro 'foreachvalue'
   foreachvalue (const flags::Flag& flag, *this) {
   ^
../../../3rdparty/libprocess/3rdparty/stout/include/stout/foreach.hpp:49:22: error: expected
';' before '!' token
                      !BOOST_FOREACH_ID(_foreach_continue);              \
                      ^
../../../3rdparty/libprocess/3rdparty/stout/include/stout/foreach.hpp:53:21: note: in expansion
of macro 'BOOST_FOREACH_PAIR'
 #define foreachpair BOOST_FOREACH_PAIR
                     ^
../../../3rdparty/libprocess/3rdparty/stout/include/stout/foreach.hpp:59:3: note: in expansion
of macro 'foreachpair'
   foreachpair (__foreach__::ignore, VAR, COL)
   ^
../../../3rdparty/libprocess/3rdparty/stout/include/stout/flags/flags.hpp:805:3: note: in
expansion of macro 'foreachvalue'
   foreachvalue (const flags::Flag& flag, *this) {
   ^
In file included from ../../../3rdparty/libprocess/3rdparty/stout/include/stout/flags.hpp:16:0,
                 from ../../../3rdparty/libprocess/src/openssl.hpp:20,
                 from ../../../3rdparty/libprocess/src/process.cpp:105:
../../../3rdparty/libprocess/3rdparty/stout/include/stout/flags/flags.hpp:806:9: error: 'flag'
was not declared in this scope
     if (flag.boolean) {
         ^
../../../3rdparty/libprocess/3rdparty/stout/include/stout/flags/flags.hpp:811:34: error: 'flag'
was not declared in this scope
     width = std::max(width, col1[flag.name].size());
                                  ^
In file included from ../../../3rdparty/libprocess/3rdparty/stout/include/stout/foreach.hpp:16:0,
                 from ../../../3rdparty/libprocess/3rdparty/stout/include/stout/strings.hpp:22,
                 from ../../../3rdparty/libprocess/3rdparty/stout/include/stout/numify.hpp:25,
                 from ../../../3rdparty/libprocess/3rdparty/stout/include/stout/ip.hpp:56,
                 from ../../../3rdparty/libprocess/include/process/address.hpp:32,
                 from ../../../3rdparty/libprocess/src/process.cpp:57:
../../../3rdparty/libprocess/3rdparty/stout/include/stout/foreach.hpp:44:29: error: no matching
function for call to 'deref(const boost::foreach_detail_::auto_any_base&, boost::foreach_detail_::type2type<flags::FlagsBase,
mpl_::bool_<true> >*)'
             for (VARFIRST = BOOST_FOREACH_DEREF(COL).first;             \
                             ^
../../../3rdparty/libprocess/3rdparty/stout/include/stout/foreach.hpp:53:21: note: in expansion
of macro 'BOOST_FOREACH_PAIR'
 #define foreachpair BOOST_FOREACH_PAIR
                     ^
../../../3rdparty/libprocess/3rdparty/stout/include/stout/foreach.hpp:59:3: note: in expansion
of macro 'foreachpair'
   foreachpair (__foreach__::ignore, VAR, COL)
   ^
../../../3rdparty/libprocess/3rdparty/stout/include/stout/flags/flags.hpp:814:3: note: in
expansion of macro 'foreachvalue'
   foreachvalue (const flags::Flag& flag, *this) {
   ^
../../../3rdparty/libprocess/3rdparty/stout/include/stout/foreach.hpp:44:29: note: candidate
is:
             for (VARFIRST = BOOST_FOREACH_DEREF(COL).first;             \
                             ^
../../../3rdparty/libprocess/3rdparty/stout/include/stout/foreach.hpp:53:21: note: in expansion
of macro 'BOOST_FOREACH_PAIR'
 #define foreachpair BOOST_FOREACH_PAIR
                     ^
../../../3rdparty/libprocess/3rdparty/stout/include/stout/foreach.hpp:59:3: note: in expansion
of macro 'foreachpair'
   foreachpair (__foreach__::ignore, VAR, COL)
   ^
../../../3rdparty/libprocess/3rdparty/stout/include/stout/flags/flags.hpp:814:3: note: in
expansion of macro 'foreachvalue'
   foreachvalue (const flags::Flag& flag, *this) {
   ^
3rdparty/boost-1.53.0/boost/foreach.hpp:769:1: note: template<class T, class C> typename
boost::foreach_detail_::foreach_reference<T, C>::type boost::foreach_detail_::deref(boost::foreach_detail_::auto_any_t,
boost::foreach_detail_::type2type<T, C>*)
 deref(auto_any_t cur, type2type<T, C> *)
 ^
3rdparty/boost-1.53.0/boost/foreach.hpp:769:1: note:   template argument deduction/substitution
failed:
In file included from ../../../3rdparty/libprocess/3rdparty/stout/include/stout/strings.hpp:22:0,
                 from ../../../3rdparty/libprocess/3rdparty/stout/include/stout/numify.hpp:25,
                 from ../../../3rdparty/libprocess/3rdparty/stout/include/stout/ip.hpp:56,
                 from ../../../3rdparty/libprocess/include/process/address.hpp:32,
                 from ../../../3rdparty/libprocess/src/process.cpp:57:
../../../3rdparty/libprocess/3rdparty/stout/include/stout/flags/flags.hpp:814:23: error: 'Flag'
in 'enum flags' does not name a type
   foreachvalue (const flags::Flag& flag, *this) {
                       ^
../../../3rdparty/libprocess/3rdparty/stout/include/stout/foreach.hpp:48:22: note: in definition
of macro 'BOOST_FOREACH_PAIR'
                 for (VARSECOND = BOOST_FOREACH_DEREF(COL).second;       \
                      ^
../../../3rdparty/libprocess/3rdparty/stout/include/stout/flags/flags.hpp:814:3: note: in
expansion of macro 'foreachvalue'
   foreachvalue (const flags::Flag& flag, *this) {
   ^
../../../3rdparty/libprocess/3rdparty/stout/include/stout/foreach.hpp:49:22: error: expected
';' before '!' token
                      !BOOST_FOREACH_ID(_foreach_continue);              \
                      ^
../../../3rdparty/libprocess/3rdparty/stout/include/stout/foreach.hpp:53:21: note: in expansion
of macro 'BOOST_FOREACH_PAIR'
 #define foreachpair BOOST_FOREACH_PAIR
                     ^
../../../3rdparty/libprocess/3rdparty/stout/include/stout/foreach.hpp:59:3: note: in expansion
of macro 'foreachpair'
   foreachpair (__foreach__::ignore, VAR, COL)
   ^
../../../3rdparty/libprocess/3rdparty/stout/include/stout/flags/flags.hpp:814:3: note: in
expansion of macro 'foreachvalue'
   foreachvalue (const flags::Flag& flag, *this) {
   ^
In file included from ../../../3rdparty/libprocess/3rdparty/stout/include/stout/flags.hpp:16:0,
                 from ../../../3rdparty/libprocess/src/openssl.hpp:20,
                 from ../../../3rdparty/libprocess/src/process.cpp:105:
../../../3rdparty/libprocess/3rdparty/stout/include/stout/flags/flags.hpp:815:29: error: 'flag'
was not declared in this scope
     std::string line = col1[flag.name];
                             ^
In file included from ../../../3rdparty/libprocess/3rdparty/stout/include/stout/foreach.hpp:16:0,
                 from ../../../3rdparty/libprocess/3rdparty/stout/include/stout/strings.hpp:22,
                 from ../../../3rdparty/libprocess/3rdparty/stout/include/stout/numify.hpp:25,
                 from ../../../3rdparty/libprocess/3rdparty/stout/include/stout/ip.hpp:56,
                 from ../../../3rdparty/libprocess/include/process/address.hpp:32,
                 from ../../../3rdparty/libprocess/src/process.cpp:57:
../../../3rdparty/libprocess/3rdparty/stout/include/stout/flags/flags.hpp: In function 'std::ostream&
flags::operator<<(std::ostream&, const flags::FlagsBase&)':
../../../3rdparty/libprocess/3rdparty/stout/include/stout/foreach.hpp:44:29: error: no matching
function for call to 'deref(const boost::foreach_detail_::auto_any_base&, boost::foreach_detail_::type2type<flags::FlagsBase,
mpl_::bool_<true> >*)'
             for (VARFIRST = BOOST_FOREACH_DEREF(COL).first;             \
                             ^
../../../3rdparty/libprocess/3rdparty/stout/include/stout/foreach.hpp:53:21: note: in expansion
of macro 'BOOST_FOREACH_PAIR'
 #define foreachpair BOOST_FOREACH_PAIR
                     ^
../../../3rdparty/libprocess/3rdparty/stout/include/stout/foreach.hpp:59:3: note: in expansion
of macro 'foreachpair'
   foreachpair (__foreach__::ignore, VAR, COL)
   ^
../../../3rdparty/libprocess/3rdparty/stout/include/stout/flags/flags.hpp:844:3: note: in
expansion of macro 'foreachvalue'
   foreachvalue (const flags::Flag& flag, flags) {
   ^
../../../3rdparty/libprocess/3rdparty/stout/include/stout/foreach.hpp:44:29: note: candidate
is:
             for (VARFIRST = BOOST_FOREACH_DEREF(COL).first;             \
                             ^
../../../3rdparty/libprocess/3rdparty/stout/include/stout/foreach.hpp:53:21: note: in expansion
of macro 'BOOST_FOREACH_PAIR'
 #define foreachpair BOOST_FOREACH_PAIR
                     ^
../../../3rdparty/libprocess/3rdparty/stout/include/stout/foreach.hpp:59:3: note: in expansion
of macro 'foreachpair'
   foreachpair (__foreach__::ignore, VAR, COL)
   ^
../../../3rdparty/libprocess/3rdparty/stout/include/stout/flags/flags.hpp:844:3: note: in
expansion of macro 'foreachvalue'
   foreachvalue (const flags::Flag& flag, flags) {
   ^
3rdparty/boost-1.53.0/boost/foreach.hpp:769:1: note: template<class T, class C> typename
boost::foreach_detail_::foreach_reference<T, C>::type boost::foreach_detail_::deref(boost::foreach_detail_::auto_any_t,
boost::foreach_detail_::type2type<T, C>*)
 deref(auto_any_t cur, type2type<T, C> *)
 ^
3rdparty/boost-1.53.0/boost/foreach.hpp:769:1: note:   template argument deduction/substitution
failed:
In file included from ../../../3rdparty/libprocess/3rdparty/stout/include/stout/strings.hpp:22:0,
                 from ../../../3rdparty/libprocess/3rdparty/stout/include/stout/numify.hpp:25,
                 from ../../../3rdparty/libprocess/3rdparty/stout/include/stout/ip.hpp:56,
                 from ../../../3rdparty/libprocess/include/process/address.hpp:32,
                 from ../../../3rdparty/libprocess/src/process.cpp:57:
../../../3rdparty/libprocess/3rdparty/stout/include/stout/flags/flags.hpp:844:23: error: 'flags'
does not name a type
   foreachvalue (const flags::Flag& flag, flags) {
                       ^
../../../3rdparty/libprocess/3rdparty/stout/include/stout/foreach.hpp:48:22: note: in definition
of macro 'BOOST_FOREACH_PAIR'
                 for (VARSECOND = BOOST_FOREACH_DEREF(COL).second;       \
                      ^
../../../3rdparty/libprocess/3rdparty/stout/include/stout/flags/flags.hpp:844:3: note: in
expansion of macro 'foreachvalue'
   foreachvalue (const flags::Flag& flag, flags) {
   ^
../../../3rdparty/libprocess/3rdparty/stout/include/stout/foreach.hpp:49:22: error: expected
';' before '!' token
                      !BOOST_FOREACH_ID(_foreach_continue);              \
                      ^
../../../3rdparty/libprocess/3rdparty/stout/include/stout/foreach.hpp:53:21: note: in expansion
of macro 'BOOST_FOREACH_PAIR'
 #define foreachpair BOOST_FOREACH_PAIR
                     ^
../../../3rdparty/libprocess/3rdparty/stout/include/stout/foreach.hpp:59:3: note: in expansion
of macro 'foreachpair'
   foreachpair (__foreach__::ignore, VAR, COL)
   ^
../../../3rdparty/libprocess/3rdparty/stout/include/stout/flags/flags.hpp:844:3: note: in
expansion of macro 'foreachvalue'
   foreachvalue (const flags::Flag& flag, flags) {
   ^
In file included from ../../../3rdparty/libprocess/3rdparty/stout/include/stout/flags.hpp:16:0,
                 from ../../../3rdparty/libprocess/src/openssl.hpp:20,
                 from ../../../3rdparty/libprocess/src/process.cpp:105:
../../../3rdparty/libprocess/3rdparty/stout/include/stout/flags/flags.hpp:845:39: error: 'flag'
was not declared in this scope
     const Option<std::string> value = flag.stringify(flags);
                                       ^
In file included from ../../../3rdparty/libprocess/src/process.cpp:105:0:
../../../3rdparty/libprocess/src/openssl.hpp: At global scope:
../../../3rdparty/libprocess/src/openssl.hpp:32:1: error: expected class-name before '{' token
 {
 ^
mv -f .deps/libprocess_la-poll_socket.Tpo .deps/libprocess_la-poll_socket.Plo
/bin/sh ./libtool  --tag=CXX   --mode=compile g++ -DPACKAGE_NAME=\"libprocess\" -DPACKAGE_TARNAME=\"libprocess\"
-DPACKAGE_VERSION=\"0.0.1\" -DPACKAGE_STRING=\"libprocess\ 0.0.1\" -DPACKAGE_BUGREPORT=\"\"
-DPACKAGE_URL=\"\" -DPACKAGE=\"libprocess\" -DVERSION=\"0.0.1\" -DSTDC_HEADERS=1 -DHAVE_SYS_TYPES_H=1
-DHAVE_SYS_STAT_H=1 -DHAVE_STDLIB_H=1 -DHAVE_STRING_H=1 -DHAVE_MEMORY_H=1 -DHAVE_STRINGS_H=1
-DHAVE_INTTYPES_H=1 -DHAVE_STDINT_H=1 -DHAVE_UNISTD_H=1 -DHAVE_DLFCN_H=1 -DLT_OBJDIR=\".libs/\"
-DHAVE_APR_POOLS_H=1 -DHAVE_LIBAPR_1=1 -DHAVE_SVN_VERSION_H=1 -DHAVE_LIBSVN_SUBR_1=1 -DHAVE_SVN_DELTA_H=1
-DHAVE_LIBSVN_DELTA_1=1 -DHAVE_LIBCURL=1 -DHAVE_EVENT2_EVENT_H=1 -DHAVE_LIBEVENT=1 -DHAVE_EVENT2_THREAD_H=1
-DHAVE_LIBEVENT_PTHREADS=1 -DHAVE_OPENSSL_SSL_H=1 -DHAVE_LIBSSL=1 -DHAVE_LIBCRYPTO=1 -DHAVE_EVENT2_BUFFEREVENT_SSL_H=1
-DHAVE_LIBEVENT_OPENSSL=1 -DUSE_SSL_SOCKET=1 -DHAVE_CXX11=1 -DHAVE_PTHREAD_PRIO_INHERIT=1
-DHAVE_PTHREAD=1 -DHAVE_LIBZ=1 -DHAVE_LIBDL=1 -I. -I../../../3rdparty/libprocess  -DBUILD_DIR=\"/mesos/mesos-0.29.0/_build/3rdparty/libprocess\"
-I../../../3rdparty/libprocess/include -I../../../3rdparty/libprocess/3rdparty/stout/include
-isystem 3rdparty/boost-1.53.0 -I3rdparty/libev-4.15 -I3rdparty/picojson-1.3.0 -DPICOJSON_USE_INT64
-D__STDC_FORMAT_MACROS  -I3rdparty/glog-0.3.3/src -I3rdparty/http-parser-2.6.1  -I/usr/include/subversion-1
-I/usr/include/apr-1 -I/usr/include/apr-1.0   -g1 -O0 -Wno-unused-local-typedefs -std=c++11
-MT libprocess_la-timeseries.lo -MD -MP -MF .deps/libprocess_la-timeseries.Tpo -c -o libprocess_la-timeseries.lo
`test -f 'src/timeseries.cpp' || echo '../../../3rdparty/libprocess/'`src/timeseries.cpp
libtool: compile:  g++ -DPACKAGE_NAME=\"libprocess\" -DPACKAGE_TARNAME=\"libprocess\" -DPACKAGE_VERSION=\"0.0.1\"
"-DPACKAGE_STRING=\"libprocess 0.0.1\"" -DPACKAGE_BUGREPORT=\"\" -DPACKAGE_URL=\"\" -DPACKAGE=\"libprocess\"
-DVERSION=\"0.0.1\" -DSTDC_HEADERS=1 -DHAVE_SYS_TYPES_H=1 -DHAVE_SYS_STAT_H=1 -DHAVE_STDLIB_H=1
-DHAVE_STRING_H=1 -DHAVE_MEMORY_H=1 -DHAVE_STRINGS_H=1 -DHAVE_INTTYPES_H=1 -DHAVE_STDINT_H=1
-DHAVE_UNISTD_H=1 -DHAVE_DLFCN_H=1 -DLT_OBJDIR=\".libs/\" -DHAVE_APR_POOLS_H=1 -DHAVE_LIBAPR_1=1
-DHAVE_SVN_VERSION_H=1 -DHAVE_LIBSVN_SUBR_1=1 -DHAVE_SVN_DELTA_H=1 -DHAVE_LIBSVN_DELTA_1=1
-DHAVE_LIBCURL=1 -DHAVE_EVENT2_EVENT_H=1 -DHAVE_LIBEVENT=1 -DHAVE_EVENT2_THREAD_H=1 -DHAVE_LIBEVENT_PTHREADS=1
-DHAVE_OPENSSL_SSL_H=1 -DHAVE_LIBSSL=1 -DHAVE_LIBCRYPTO=1 -DHAVE_EVENT2_BUFFEREVENT_SSL_H=1
-DHAVE_LIBEVENT_OPENSSL=1 -DUSE_SSL_SOCKET=1 -DHAVE_CXX11=1 -DHAVE_PTHREAD_PRIO_INHERIT=1
-DHAVE_PTHREAD=1 -DHAVE_LIBZ=1 -DHAVE_LIBDL=1 -I. -I../../../3rdparty/libprocess -DBUILD_DIR=\"/mesos/mesos-0.29.0/_build/3rdparty/libprocess\"
-I../../../3rdparty/libprocess/include -I../../../3rdparty/libprocess/3rdparty/stout/include
-isystem 3rdparty/boost-1.53.0 -I3rdparty/libev-4.15 -I3rdparty/picojson-1.3.0 -DPICOJSON_USE_INT64
-D__STDC_FORMAT_MACROS -I3rdparty/glog-0.3.3/src -I3rdparty/http-parser-2.6.1 -I/usr/include/subversion-1
-I/usr/include/apr-1 -I/usr/include/apr-1.0 -g1 -O0 -Wno-unused-local-typedefs -std=c++11
-MT libprocess_la-timeseries.lo -MD -MP -MF .deps/libprocess_la-timeseries.Tpo -c ../../../3rdparty/libprocess/src/timeseries.cpp
 -fPIC -DPIC -o libprocess_la-timeseries.o
mv -f .deps/libprocess_la-time.Tpo .deps/libprocess_la-time.Plo
/bin/sh ./libtool  --tag=CXX   --mode=compile g++ -DPACKAGE_NAME=\"libprocess\" -DPACKAGE_TARNAME=\"libprocess\"
-DPACKAGE_VERSION=\"0.0.1\" -DPACKAGE_STRING=\"libprocess\ 0.0.1\" -DPACKAGE_BUGREPORT=\"\"
-DPACKAGE_URL=\"\" -DPACKAGE=\"libprocess\" -DVERSION=\"0.0.1\" -DSTDC_HEADERS=1 -DHAVE_SYS_TYPES_H=1
-DHAVE_SYS_STAT_H=1 -DHAVE_STDLIB_H=1 -DHAVE_STRING_H=1 -DHAVE_MEMORY_H=1 -DHAVE_STRINGS_H=1
-DHAVE_INTTYPES_H=1 -DHAVE_STDINT_H=1 -DHAVE_UNISTD_H=1 -DHAVE_DLFCN_H=1 -DLT_OBJDIR=\".libs/\"
-DHAVE_APR_POOLS_H=1 -DHAVE_LIBAPR_1=1 -DHAVE_SVN_VERSION_H=1 -DHAVE_LIBSVN_SUBR_1=1 -DHAVE_SVN_DELTA_H=1
-DHAVE_LIBSVN_DELTA_1=1 -DHAVE_LIBCURL=1 -DHAVE_EVENT2_EVENT_H=1 -DHAVE_LIBEVENT=1 -DHAVE_EVENT2_THREAD_H=1
-DHAVE_LIBEVENT_PTHREADS=1 -DHAVE_OPENSSL_SSL_H=1 -DHAVE_LIBSSL=1 -DHAVE_LIBCRYPTO=1 -DHAVE_EVENT2_BUFFEREVENT_SSL_H=1
-DHAVE_LIBEVENT_OPENSSL=1 -DUSE_SSL_SOCKET=1 -DHAVE_CXX11=1 -DHAVE_PTHREAD_PRIO_INHERIT=1
-DHAVE_PTHREAD=1 -DHAVE_LIBZ=1 -DHAVE_LIBDL=1 -I. -I../../../3rdparty/libprocess  -DBUILD_DIR=\"/mesos/mesos-0.29.0/_build/3rdparty/libprocess\"
-I../../../3rdparty/libprocess/include -I../../../3rdparty/libprocess/3rdparty/stout/include
-isystem 3rdparty/boost-1.53.0 -I3rdparty/libev-4.15 -I3rdparty/picojson-1.3.0 -DPICOJSON_USE_INT64
-D__STDC_FORMAT_MACROS  -I3rdparty/glog-0.3.3/src -I3rdparty/http-parser-2.6.1  -I/usr/include/subversion-1
-I/usr/include/apr-1 -I/usr/include/apr-1.0   -g1 -O0 -Wno-unused-local-typedefs -std=c++11
-MT libprocess_la-libevent_ssl_socket.lo -MD -MP -MF .deps/libprocess_la-libevent_ssl_socket.Tpo
-c -o libprocess_la-libevent_ssl_socket.lo `test -f 'src/libevent_ssl_socket.cpp' || echo
'../../../3rdparty/libprocess/'`src/libevent_ssl_socket.cpp
libtool: compile:  g++ -DPACKAGE_NAME=\"libprocess\" -DPACKAGE_TARNAME=\"libprocess\" -DPACKAGE_VERSION=\"0.0.1\"
"-DPACKAGE_STRING=\"libprocess 0.0.1\"" -DPACKAGE_BUGREPORT=\"\" -DPACKAGE_URL=\"\" -DPACKAGE=\"libprocess\"
-DVERSION=\"0.0.1\" -DSTDC_HEADERS=1 -DHAVE_SYS_TYPES_H=1 -DHAVE_SYS_STAT_H=1 -DHAVE_STDLIB_H=1
-DHAVE_STRING_H=1 -DHAVE_MEMORY_H=1 -DHAVE_STRINGS_H=1 -DHAVE_INTTYPES_H=1 -DHAVE_STDINT_H=1
-DHAVE_UNISTD_H=1 -DHAVE_DLFCN_H=1 -DLT_OBJDIR=\".libs/\" -DHAVE_APR_POOLS_H=1 -DHAVE_LIBAPR_1=1
-DHAVE_SVN_VERSION_H=1 -DHAVE_LIBSVN_SUBR_1=1 -DHAVE_SVN_DELTA_H=1 -DHAVE_LIBSVN_DELTA_1=1
-DHAVE_LIBCURL=1 -DHAVE_EVENT2_EVENT_H=1 -DHAVE_LIBEVENT=1 -DHAVE_EVENT2_THREAD_H=1 -DHAVE_LIBEVENT_PTHREADS=1
-DHAVE_OPENSSL_SSL_H=1 -DHAVE_LIBSSL=1 -DHAVE_LIBCRYPTO=1 -DHAVE_EVENT2_BUFFEREVENT_SSL_H=1
-DHAVE_LIBEVENT_OPENSSL=1 -DUSE_SSL_SOCKET=1 -DHAVE_CXX11=1 -DHAVE_PTHREAD_PRIO_INHERIT=1
-DHAVE_PTHREAD=1 -DHAVE_LIBZ=1 -DHAVE_LIBDL=1 -I. -I../../../3rdparty/libprocess -DBUILD_DIR=\"/mesos/mesos-0.29.0/_build/3rdparty/libprocess\"
-I../../../3rdparty/libprocess/include -I../../../3rdparty/libprocess/3rdparty/stout/include
-isystem 3rdparty/boost-1.53.0 -I3rdparty/libev-4.15 -I3rdparty/picojson-1.3.0 -DPICOJSON_USE_INT64
-D__STDC_FORMAT_MACROS -I3rdparty/glog-0.3.3/src -I3rdparty/http-parser-2.6.1 -I/usr/include/subversion-1
-I/usr/include/apr-1 -I/usr/include/apr-1.0 -g1 -O0 -Wno-unused-local-typedefs -std=c++11
-MT libprocess_la-libevent_ssl_socket.lo -MD -MP -MF .deps/libprocess_la-libevent_ssl_socket.Tpo
-c ../../../3rdparty/libprocess/src/libevent_ssl_socket.cpp  -fPIC -DPIC -o libprocess_la-libevent_ssl_socket.o
mv -f .deps/libprocess_la-http.Tpo .deps/libprocess_la-http.Plo
/bin/sh ./libtool  --tag=CXX   --mode=compile g++ -DPACKAGE_NAME=\"libprocess\" -DPACKAGE_TARNAME=\"libprocess\"
-DPACKAGE_VERSION=\"0.0.1\" -DPACKAGE_STRING=\"libprocess\ 0.0.1\" -DPACKAGE_BUGREPORT=\"\"
-DPACKAGE_URL=\"\" -DPACKAGE=\"libprocess\" -DVERSION=\"0.0.1\" -DSTDC_HEADERS=1 -DHAVE_SYS_TYPES_H=1
-DHAVE_SYS_STAT_H=1 -DHAVE_STDLIB_H=1 -DHAVE_STRING_H=1 -DHAVE_MEMORY_H=1 -DHAVE_STRINGS_H=1
-DHAVE_INTTYPES_H=1 -DHAVE_STDINT_H=1 -DHAVE_UNISTD_H=1 -DHAVE_DLFCN_H=1 -DLT_OBJDIR=\".libs/\"
-DHAVE_APR_POOLS_H=1 -DHAVE_LIBAPR_1=1 -DHAVE_SVN_VERSION_H=1 -DHAVE_LIBSVN_SUBR_1=1 -DHAVE_SVN_DELTA_H=1
-DHAVE_LIBSVN_DELTA_1=1 -DHAVE_LIBCURL=1 -DHAVE_EVENT2_EVENT_H=1 -DHAVE_LIBEVENT=1 -DHAVE_EVENT2_THREAD_H=1
-DHAVE_LIBEVENT_PTHREADS=1 -DHAVE_OPENSSL_SSL_H=1 -DHAVE_LIBSSL=1 -DHAVE_LIBCRYPTO=1 -DHAVE_EVENT2_BUFFEREVENT_SSL_H=1
-DHAVE_LIBEVENT_OPENSSL=1 -DUSE_SSL_SOCKET=1 -DHAVE_CXX11=1 -DHAVE_PTHREAD_PRIO_INHERIT=1
-DHAVE_PTHREAD=1 -DHAVE_LIBZ=1 -DHAVE_LIBDL=1 -I. -I../../../3rdparty/libprocess  -DBUILD_DIR=\"/mesos/mesos-0.29.0/_build/3rdparty/libprocess\"
-I../../../3rdparty/libprocess/include -I../../../3rdparty/libprocess/3rdparty/stout/include
-isystem 3rdparty/boost-1.53.0 -I3rdparty/libev-4.15 -I3rdparty/picojson-1.3.0 -DPICOJSON_USE_INT64
-D__STDC_FORMAT_MACROS  -I3rdparty/glog-0.3.3/src -I3rdparty/http-parser-2.6.1  -I/usr/include/subversion-1
-I/usr/include/apr-1 -I/usr/include/apr-1.0   -g1 -O0 -Wno-unused-local-typedefs -std=c++11
-MT libprocess_la-openssl.lo -MD -MP -MF .deps/libprocess_la-openssl.Tpo -c -o libprocess_la-openssl.lo
`test -f 'src/openssl.cpp' || echo '../../../3rdparty/libprocess/'`src/openssl.cpp
mv -f .deps/libprocess_la-timeseries.Tpo .deps/libprocess_la-timeseries.Plo
/bin/sh ./libtool  --tag=CXX   --mode=compile g++ -DPACKAGE_NAME=\"libprocess\" -DPACKAGE_TARNAME=\"libprocess\"
-DPACKAGE_VERSION=\"0.0.1\" -DPACKAGE_STRING=\"libprocess\ 0.0.1\" -DPACKAGE_BUGREPORT=\"\"
-DPACKAGE_URL=\"\" -DPACKAGE=\"libprocess\" -DVERSION=\"0.0.1\" -DSTDC_HEADERS=1 -DHAVE_SYS_TYPES_H=1
-DHAVE_SYS_STAT_H=1 -DHAVE_STDLIB_H=1 -DHAVE_STRING_H=1 -DHAVE_MEMORY_H=1 -DHAVE_STRINGS_H=1
-DHAVE_INTTYPES_H=1 -DHAVE_STDINT_H=1 -DHAVE_UNISTD_H=1 -DHAVE_DLFCN_H=1 -DLT_OBJDIR=\".libs/\"
-DHAVE_APR_POOLS_H=1 -DHAVE_LIBAPR_1=1 -DHAVE_SVN_VERSION_H=1 -DHAVE_LIBSVN_SUBR_1=1 -DHAVE_SVN_DELTA_H=1
-DHAVE_LIBSVN_DELTA_1=1 -DHAVE_LIBCURL=1 -DHAVE_EVENT2_EVENT_H=1 -DHAVE_LIBEVENT=1 -DHAVE_EVENT2_THREAD_H=1
-DHAVE_LIBEVENT_PTHREADS=1 -DHAVE_OPENSSL_SSL_H=1 -DHAVE_LIBSSL=1 -DHAVE_LIBCRYPTO=1 -DHAVE_EVENT2_BUFFEREVENT_SSL_H=1
-DHAVE_LIBEVENT_OPENSSL=1 -DUSE_SSL_SOCKET=1 -DHAVE_CXX11=1 -DHAVE_PTHREAD_PRIO_INHERIT=1
-DHAVE_PTHREAD=1 -DHAVE_LIBZ=1 -DHAVE_LIBDL=1 -I. -I../../../3rdparty/libprocess  -DBUILD_DIR=\"/mesos/mesos-0.29.0/_build/3rdparty/libprocess\"
-I../../../3rdparty/libprocess/include -I../../../3rdparty/libprocess/3rdparty/stout/include
-isystem 3rdparty/boost-1.53.0 -I3rdparty/libev-4.15 -I3rdparty/picojson-1.3.0 -DPICOJSON_USE_INT64
-D__STDC_FORMAT_MACROS  -I3rdparty/glog-0.3.3/src -I3rdparty/http-parser-2.6.1  -I/usr/include/subversion-1
-I/usr/include/apr-1 -I/usr/include/apr-1.0   -g1 -O0 -Wno-unused-local-typedefs -std=c++11
-MT libprocess_la-utilities.lo -MD -MP -MF .deps/libprocess_la-utilities.Tpo -c -o libprocess_la-utilities.lo
`test -f 'src/ssl/utilities.cpp' || echo '../../../3rdparty/libprocess/'`src/ssl/utilities.cpp
libtool: compile:  g++ -DPACKAGE_NAME=\"libprocess\" -DPACKAGE_TARNAME=\"libprocess\" -DPACKAGE_VERSION=\"0.0.1\"
"-DPACKAGE_STRING=\"libprocess 0.0.1\"" -DPACKAGE_BUGREPORT=\"\" -DPACKAGE_URL=\"\" -DPACKAGE=\"libprocess\"
-DVERSION=\"0.0.1\" -DSTDC_HEADERS=1 -DHAVE_SYS_TYPES_H=1 -DHAVE_SYS_STAT_H=1 -DHAVE_STDLIB_H=1
-DHAVE_STRING_H=1 -DHAVE_MEMORY_H=1 -DHAVE_STRINGS_H=1 -DHAVE_INTTYPES_H=1 -DHAVE_STDINT_H=1
-DHAVE_UNISTD_H=1 -DHAVE_DLFCN_H=1 -DLT_OBJDIR=\".libs/\" -DHAVE_APR_POOLS_H=1 -DHAVE_LIBAPR_1=1
-DHAVE_SVN_VERSION_H=1 -DHAVE_LIBSVN_SUBR_1=1 -DHAVE_SVN_DELTA_H=1 -DHAVE_LIBSVN_DELTA_1=1
-DHAVE_LIBCURL=1 -DHAVE_EVENT2_EVENT_H=1 -DHAVE_LIBEVENT=1 -DHAVE_EVENT2_THREAD_H=1 -DHAVE_LIBEVENT_PTHREADS=1
-DHAVE_OPENSSL_SSL_H=1 -DHAVE_LIBSSL=1 -DHAVE_LIBCRYPTO=1 -DHAVE_EVENT2_BUFFEREVENT_SSL_H=1
-DHAVE_LIBEVENT_OPENSSL=1 -DUSE_SSL_SOCKET=1 -DHAVE_CXX11=1 -DHAVE_PTHREAD_PRIO_INHERIT=1
-DHAVE_PTHREAD=1 -DHAVE_LIBZ=1 -DHAVE_LIBDL=1 -I. -I../../../3rdparty/libprocess -DBUILD_DIR=\"/mesos/mesos-0.29.0/_build/3rdparty/libprocess\"
-I../../../3rdparty/libprocess/include -I../../../3rdparty/libprocess/3rdparty/stout/include
-isystem 3rdparty/boost-1.53.0 -I3rdparty/libev-4.15 -I3rdparty/picojson-1.3.0 -DPICOJSON_USE_INT64
-D__STDC_FORMAT_MACROS -I3rdparty/glog-0.3.3/src -I3rdparty/http-parser-2.6.1 -I/usr/include/subversion-1
-I/usr/include/apr-1 -I/usr/include/apr-1.0 -g1 -O0 -Wno-unused-local-typedefs -std=c++11
-MT libprocess_la-openssl.lo -MD -MP -MF .deps/libprocess_la-openssl.Tpo -c ../../../3rdparty/libprocess/src/openssl.cpp
 -fPIC -DPIC -o libprocess_la-openssl.o
libtool: compile:  g++ -DPACKAGE_NAME=\"libprocess\" -DPACKAGE_TARNAME=\"libprocess\" -DPACKAGE_VERSION=\"0.0.1\"
"-DPACKAGE_STRING=\"libprocess 0.0.1\"" -DPACKAGE_BUGREPORT=\"\" -DPACKAGE_URL=\"\" -DPACKAGE=\"libprocess\"
-DVERSION=\"0.0.1\" -DSTDC_HEADERS=1 -DHAVE_SYS_TYPES_H=1 -DHAVE_SYS_STAT_H=1 -DHAVE_STDLIB_H=1
-DHAVE_STRING_H=1 -DHAVE_MEMORY_H=1 -DHAVE_STRINGS_H=1 -DHAVE_INTTYPES_H=1 -DHAVE_STDINT_H=1
-DHAVE_UNISTD_H=1 -DHAVE_DLFCN_H=1 -DLT_OBJDIR=\".libs/\" -DHAVE_APR_POOLS_H=1 -DHAVE_LIBAPR_1=1
-DHAVE_SVN_VERSION_H=1 -DHAVE_LIBSVN_SUBR_1=1 -DHAVE_SVN_DELTA_H=1 -DHAVE_LIBSVN_DELTA_1=1
-DHAVE_LIBCURL=1 -DHAVE_EVENT2_EVENT_H=1 -DHAVE_LIBEVENT=1 -DHAVE_EVENT2_THREAD_H=1 -DHAVE_LIBEVENT_PTHREADS=1
-DHAVE_OPENSSL_SSL_H=1 -DHAVE_LIBSSL=1 -DHAVE_LIBCRYPTO=1 -DHAVE_EVENT2_BUFFEREVENT_SSL_H=1
-DHAVE_LIBEVENT_OPENSSL=1 -DUSE_SSL_SOCKET=1 -DHAVE_CXX11=1 -DHAVE_PTHREAD_PRIO_INHERIT=1
-DHAVE_PTHREAD=1 -DHAVE_LIBZ=1 -DHAVE_LIBDL=1 -I. -I../../../3rdparty/libprocess -DBUILD_DIR=\"/mesos/mesos-0.29.0/_build/3rdparty/libprocess\"
-I../../../3rdparty/libprocess/include -I../../../3rdparty/libprocess/3rdparty/stout/include
-isystem 3rdparty/boost-1.53.0 -I3rdparty/libev-4.15 -I3rdparty/picojson-1.3.0 -DPICOJSON_USE_INT64
-D__STDC_FORMAT_MACROS -I3rdparty/glog-0.3.3/src -I3rdparty/http-parser-2.6.1 -I/usr/include/subversion-1
-I/usr/include/apr-1 -I/usr/include/apr-1.0 -g1 -O0 -Wno-unused-local-typedefs -std=c++11
-MT libprocess_la-utilities.lo -MD -MP -MF .deps/libprocess_la-utilities.Tpo -c ../../../3rdparty/libprocess/src/ssl/utilities.cpp
 -fPIC -DPIC -o libprocess_la-utilities.o
mv -f .deps/libprocess_la-reap.Tpo .deps/libprocess_la-reap.Plo
/bin/sh ./libtool  --tag=CXX   --mode=compile g++ -DPACKAGE_NAME=\"libprocess\" -DPACKAGE_TARNAME=\"libprocess\"
-DPACKAGE_VERSION=\"0.0.1\" -DPACKAGE_STRING=\"libprocess\ 0.0.1\" -DPACKAGE_BUGREPORT=\"\"
-DPACKAGE_URL=\"\" -DPACKAGE=\"libprocess\" -DVERSION=\"0.0.1\" -DSTDC_HEADERS=1 -DHAVE_SYS_TYPES_H=1
-DHAVE_SYS_STAT_H=1 -DHAVE_STDLIB_H=1 -DHAVE_STRING_H=1 -DHAVE_MEMORY_H=1 -DHAVE_STRINGS_H=1
-DHAVE_INTTYPES_H=1 -DHAVE_STDINT_H=1 -DHAVE_UNISTD_H=1 -DHAVE_DLFCN_H=1 -DLT_OBJDIR=\".libs/\"
-DHAVE_APR_POOLS_H=1 -DHAVE_LIBAPR_1=1 -DHAVE_SVN_VERSION_H=1 -DHAVE_LIBSVN_SUBR_1=1 -DHAVE_SVN_DELTA_H=1
-DHAVE_LIBSVN_DELTA_1=1 -DHAVE_LIBCURL=1 -DHAVE_EVENT2_EVENT_H=1 -DHAVE_LIBEVENT=1 -DHAVE_EVENT2_THREAD_H=1
-DHAVE_LIBEVENT_PTHREADS=1 -DHAVE_OPENSSL_SSL_H=1 -DHAVE_LIBSSL=1 -DHAVE_LIBCRYPTO=1 -DHAVE_EVENT2_BUFFEREVENT_SSL_H=1
-DHAVE_LIBEVENT_OPENSSL=1 -DUSE_SSL_SOCKET=1 -DHAVE_CXX11=1 -DHAVE_PTHREAD_PRIO_INHERIT=1
-DHAVE_PTHREAD=1 -DHAVE_LIBZ=1 -DHAVE_LIBDL=1 -I. -I../../../3rdparty/libprocess  -DBUILD_DIR=\"/mesos/mesos-0.29.0/_build/3rdparty/libprocess\"
-I../../../3rdparty/libprocess/include -I../../../3rdparty/libprocess/3rdparty/stout/include
-isystem 3rdparty/boost-1.53.0 -I3rdparty/libev-4.15 -I3rdparty/picojson-1.3.0 -DPICOJSON_USE_INT64
-D__STDC_FORMAT_MACROS  -I3rdparty/glog-0.3.3/src -I3rdparty/http-parser-2.6.1  -I/usr/include/subversion-1
-I/usr/include/apr-1 -I/usr/include/apr-1.0   -g1 -O0 -Wno-unused-local-typedefs -std=c++11
-MT libprocess_la-libevent.lo -MD -MP -MF .deps/libprocess_la-libevent.Tpo -c -o libprocess_la-libevent.lo
`test -f 'src/libevent.cpp' || echo '../../../3rdparty/libprocess/'`src/libevent.cpp
libtool: compile:  g++ -DPACKAGE_NAME=\"libprocess\" -DPACKAGE_TARNAME=\"libprocess\" -DPACKAGE_VERSION=\"0.0.1\"
"-DPACKAGE_STRING=\"libprocess 0.0.1\"" -DPACKAGE_BUGREPORT=\"\" -DPACKAGE_URL=\"\" -DPACKAGE=\"libprocess\"
-DVERSION=\"0.0.1\" -DSTDC_HEADERS=1 -DHAVE_SYS_TYPES_H=1 -DHAVE_SYS_STAT_H=1 -DHAVE_STDLIB_H=1
-DHAVE_STRING_H=1 -DHAVE_MEMORY_H=1 -DHAVE_STRINGS_H=1 -DHAVE_INTTYPES_H=1 -DHAVE_STDINT_H=1
-DHAVE_UNISTD_H=1 -DHAVE_DLFCN_H=1 -DLT_OBJDIR=\".libs/\" -DHAVE_APR_POOLS_H=1 -DHAVE_LIBAPR_1=1
-DHAVE_SVN_VERSION_H=1 -DHAVE_LIBSVN_SUBR_1=1 -DHAVE_SVN_DELTA_H=1 -DHAVE_LIBSVN_DELTA_1=1
-DHAVE_LIBCURL=1 -DHAVE_EVENT2_EVENT_H=1 -DHAVE_LIBEVENT=1 -DHAVE_EVENT2_THREAD_H=1 -DHAVE_LIBEVENT_PTHREADS=1
-DHAVE_OPENSSL_SSL_H=1 -DHAVE_LIBSSL=1 -DHAVE_LIBCRYPTO=1 -DHAVE_EVENT2_BUFFEREVENT_SSL_H=1
-DHAVE_LIBEVENT_OPENSSL=1 -DUSE_SSL_SOCKET=1 -DHAVE_CXX11=1 -DHAVE_PTHREAD_PRIO_INHERIT=1
-DHAVE_PTHREAD=1 -DHAVE_LIBZ=1 -DHAVE_LIBDL=1 -I. -I../../../3rdparty/libprocess -DBUILD_DIR=\"/mesos/mesos-0.29.0/_build/3rdparty/libprocess\"
-I../../../3rdparty/libprocess/include -I../../../3rdparty/libprocess/3rdparty/stout/include
-isystem 3rdparty/boost-1.53.0 -I3rdparty/libev-4.15 -I3rdparty/picojson-1.3.0 -DPICOJSON_USE_INT64
-D__STDC_FORMAT_MACROS -I3rdparty/glog-0.3.3/src -I3rdparty/http-parser-2.6.1 -I/usr/include/subversion-1
-I/usr/include/apr-1 -I/usr/include/apr-1.0 -g1 -O0 -Wno-unused-local-typedefs -std=c++11
-MT libprocess_la-libevent.lo -MD -MP -MF .deps/libprocess_la-libevent.Tpo -c ../../../3rdparty/libprocess/src/libevent.cpp
 -fPIC -DPIC -o libprocess_la-libevent.o
mv -f .deps/libprocess_la-utilities.Tpo .deps/libprocess_la-utilities.Plo
/bin/sh ./libtool  --tag=CXX   --mode=compile g++ -DPACKAGE_NAME=\"libprocess\" -DPACKAGE_TARNAME=\"libprocess\"
-DPACKAGE_VERSION=\"0.0.1\" -DPACKAGE_STRING=\"libprocess\ 0.0.1\" -DPACKAGE_BUGREPORT=\"\"
-DPACKAGE_URL=\"\" -DPACKAGE=\"libprocess\" -DVERSION=\"0.0.1\" -DSTDC_HEADERS=1 -DHAVE_SYS_TYPES_H=1
-DHAVE_SYS_STAT_H=1 -DHAVE_STDLIB_H=1 -DHAVE_STRING_H=1 -DHAVE_MEMORY_H=1 -DHAVE_STRINGS_H=1
-DHAVE_INTTYPES_H=1 -DHAVE_STDINT_H=1 -DHAVE_UNISTD_H=1 -DHAVE_DLFCN_H=1 -DLT_OBJDIR=\".libs/\"
-DHAVE_APR_POOLS_H=1 -DHAVE_LIBAPR_1=1 -DHAVE_SVN_VERSION_H=1 -DHAVE_LIBSVN_SUBR_1=1 -DHAVE_SVN_DELTA_H=1
-DHAVE_LIBSVN_DELTA_1=1 -DHAVE_LIBCURL=1 -DHAVE_EVENT2_EVENT_H=1 -DHAVE_LIBEVENT=1 -DHAVE_EVENT2_THREAD_H=1
-DHAVE_LIBEVENT_PTHREADS=1 -DHAVE_OPENSSL_SSL_H=1 -DHAVE_LIBSSL=1 -DHAVE_LIBCRYPTO=1 -DHAVE_EVENT2_BUFFEREVENT_SSL_H=1
-DHAVE_LIBEVENT_OPENSSL=1 -DUSE_SSL_SOCKET=1 -DHAVE_CXX11=1 -DHAVE_PTHREAD_PRIO_INHERIT=1
-DHAVE_PTHREAD=1 -DHAVE_LIBZ=1 -DHAVE_LIBDL=1 -I. -I../../../3rdparty/libprocess  -DBUILD_DIR=\"/mesos/mesos-0.29.0/_build/3rdparty/libprocess\"
-I../../../3rdparty/libprocess/include -I../../../3rdparty/libprocess/3rdparty/stout/include
-isystem 3rdparty/boost-1.53.0 -I3rdparty/libev-4.15 -I3rdparty/picojson-1.3.0 -DPICOJSON_USE_INT64
-D__STDC_FORMAT_MACROS  -I3rdparty/glog-0.3.3/src -I3rdparty/http-parser-2.6.1  -I/usr/include/subversion-1
-I/usr/include/apr-1 -I/usr/include/apr-1.0   -g1 -O0 -Wno-unused-local-typedefs -std=c++11
-MT libprocess_la-libevent_poll.lo -MD -MP -MF .deps/libprocess_la-libevent_poll.Tpo -c -o
libprocess_la-libevent_poll.lo `test -f 'src/libevent_poll.cpp' || echo '../../../3rdparty/libprocess/'`src/libevent_poll.cpp
mv -f .deps/libprocess_la-subprocess.Tpo .deps/libprocess_la-subprocess.Plo
libtool: compile:  g++ -DPACKAGE_NAME=\"libprocess\" -DPACKAGE_TARNAME=\"libprocess\" -DPACKAGE_VERSION=\"0.0.1\"
"-DPACKAGE_STRING=\"libprocess 0.0.1\"" -DPACKAGE_BUGREPORT=\"\" -DPACKAGE_URL=\"\" -DPACKAGE=\"libprocess\"
-DVERSION=\"0.0.1\" -DSTDC_HEADERS=1 -DHAVE_SYS_TYPES_H=1 -DHAVE_SYS_STAT_H=1 -DHAVE_STDLIB_H=1
-DHAVE_STRING_H=1 -DHAVE_MEMORY_H=1 -DHAVE_STRINGS_H=1 -DHAVE_INTTYPES_H=1 -DHAVE_STDINT_H=1
-DHAVE_UNISTD_H=1 -DHAVE_DLFCN_H=1 -DLT_OBJDIR=\".libs/\" -DHAVE_APR_POOLS_H=1 -DHAVE_LIBAPR_1=1
-DHAVE_SVN_VERSION_H=1 -DHAVE_LIBSVN_SUBR_1=1 -DHAVE_SVN_DELTA_H=1 -DHAVE_LIBSVN_DELTA_1=1
-DHAVE_LIBCURL=1 -DHAVE_EVENT2_EVENT_H=1 -DHAVE_LIBEVENT=1 -DHAVE_EVENT2_THREAD_H=1 -DHAVE_LIBEVENT_PTHREADS=1
-DHAVE_OPENSSL_SSL_H=1 -DHAVE_LIBSSL=1 -DHAVE_LIBCRYPTO=1 -DHAVE_EVENT2_BUFFEREVENT_SSL_H=1
-DHAVE_LIBEVENT_OPENSSL=1 -DUSE_SSL_SOCKET=1 -DHAVE_CXX11=1 -DHAVE_PTHREAD_PRIO_INHERIT=1
-DHAVE_PTHREAD=1 -DHAVE_LIBZ=1 -DHAVE_LIBDL=1 -I. -I../../../3rdparty/libprocess -DBUILD_DIR=\"/mesos/mesos-0.29.0/_build/3rdparty/libprocess\"
-I../../../3rdparty/libprocess/include -I../../../3rdparty/libprocess/3rdparty/stout/include
-isystem 3rdparty/boost-1.53.0 -I3rdparty/libev-4.15 -I3rdparty/picojson-1.3.0 -DPICOJSON_USE_INT64
-D__STDC_FORMAT_MACROS -I3rdparty/glog-0.3.3/src -I3rdparty/http-parser-2.6.1 -I/usr/include/subversion-1
-I/usr/include/apr-1 -I/usr/include/apr-1.0 -g1 -O0 -Wno-unused-local-typedefs -std=c++11
-MT libprocess_la-libevent_poll.lo -MD -MP -MF .deps/libprocess_la-libevent_poll.Tpo -c ../../../3rdparty/libprocess/src/libevent_poll.cpp
 -fPIC -DPIC -o libprocess_la-libevent_poll.o
mv -f .deps/libprocess_la-metrics.Tpo .deps/libprocess_la-metrics.Plo
make[5]: *** [libprocess_la-process.lo] Error 1
make[5]: *** Waiting for unfinished jobs....
mv -f .deps/libprocess_la-socket.Tpo .deps/libprocess_la-socket.Plo
mv -f .deps/libprocess_la-libevent.Tpo .deps/libprocess_la-libevent.Plo
mv -f .deps/libprocess_la-openssl.Tpo .deps/libprocess_la-openssl.Plo
mv -f .deps/libprocess_la-libevent_ssl_socket.Tpo .deps/libprocess_la-libevent_ssl_socket.Plo
mv -f .deps/libprocess_la-libevent_poll.Tpo .deps/libprocess_la-libevent_poll.Plo
make[5]: Leaving directory `/mesos/mesos-0.29.0/_build/3rdparty/libprocess'
make[4]: *** [all-recursive] Error 1
make[4]: Leaving directory `/mesos/mesos-0.29.0/_build/3rdparty/libprocess'
make[3]: *** [all-recursive] Error 1
make[3]: Leaving directory `/mesos/mesos-0.29.0/_build/3rdparty'
make[2]: *** [all] Error 2
make[2]: Leaving directory `/mesos/mesos-0.29.0/_build/3rdparty'
make[1]: *** [all-recursive] Error 1
make[1]: Leaving directory `/mesos/mesos-0.29.0/_build'
make: *** [distcheck] Error 1
+ docker rmi mesos-1459217174-30383
Untagged: mesos-1459217174-30383:latest
Deleted: d24463b784bbee236fe456d64c3e99c2c903a41d41341ce864d68981296b1875
Deleted: cff82bc065ef770c29f382dc7fea1acc89a52865641d4596d5111ad9ac13d299
Deleted: e663bb2ff92ddd111b5ee67164b96051e3a340f528b3541020a16d5f64cdaedd
Deleted: 76e0d2657686efd1e980682128882f65f921ce6b0522b5fad8729f13a0bc4903
Deleted: f2a52c6343840d9d291ddec66fc7941c67192b168d5b9b0ab88b2ceda7973ebc
Deleted: 21eb045aff635221bc394401e1bfa7ec4c401548c6a476cf999f44431393ab48
Deleted: 0fa475104e70202cae2b4d39138778d9cee3672e4e79e2a21b40b118e4e1e684
Deleted: b130e11faad29e6f8d015121482bf2c5a976ce2550f5389a7046a38e364d033e
Deleted: eed3860ea222537e0ddd125e46a282d78283f6047b76b9c38459aa0bee937895
Deleted: c368963599e8f367517d8df27ea24f1f487875a45730e2a512753875ca182b91
Deleted: 6e5fe5f557ba04b96cd565536540f8e85bc90663622497185ee340d82d14921e
Deleted: 9aac567d915b080b8807cc3004c3c2fc7ed914538c0272edbe02f1087de3e308
Deleted: bc433c0f46ebbf233c77f3377b809dd5ba9e427f8a20e61e2439ede5d4e685f2
Deleted: cdd8975f1f81fd64f7637ba55ccddbf21deca9b10df32e9ad6e47b65dd71ecfd
Deleted: 15d6519091be288542a1a4d663676e37d4d0231226319d53a45620c2ec908bed
Deleted: f2bd1a74153628f6f04b89e94fda9318b979bc01d71e3ca049ab4813f4660673
Build step 'Execute shell' marked build as failure

Mime
View raw message