mesos-builds mailing list archives

Site index · List index
Message view « Date » · « Thread »
Top « Date » · « Thread »
From Apache Jenkins Server <jenk...@builds.apache.org>
Subject Build failed in Jenkins: Mesos » gcc,--verbose,GLOG_v=1 MESOS_VERBOSE=1,centos:7,(docker||Hadoop)&&(!ubuntu-us1) #1833
Date Fri, 18 Mar 2016 21:14:27 GMT
See <https://builds.apache.org/job/Mesos/COMPILER=gcc,CONFIGURATION=--verbose,ENVIRONMENT=GLOG_v=1%20MESOS_VERBOSE=1,OS=centos%3A7,label_exp=(docker%7C%7CHadoop)&&(!ubuntu-us1)/1833/changes>

Changes:

[mpark] Fixed formatting issues in `shell.hpp`.

------------------------------------------
[...truncated 174408 lines...]
I0318 21:14:17.258709  2551 master.cpp:378] Flags at startup: --acls="" --allocation_interval="1secs"
--allocator="HierarchicalDRF" --authenticate="false" --authenticate_http="true" --authenticate_slaves="true"
--authenticators="crammd5" --authorizers="local" --credentials="/tmp/cTLLdU/credentials" --framework_sorter="drf"
--help="false" --hostname_lookup="true" --http_authenticators="basic" --initialize_driver_logging="true"
--log_auto_initialize="true" --logbufsecs="0" --logging_level="INFO" --max_completed_frameworks="50"
--max_completed_tasks_per_framework="1000" --max_slave_ping_timeouts="5" --quiet="false" --recovery_slave_removal_limit="100%"
--registry="replicated_log" --registry_fetch_timeout="1mins" --registry_store_timeout="100secs"
--registry_strict="true" --root_submissions="true" --slave_ping_timeout="15secs" --slave_reregister_timeout="10mins"
--user_sorter="drf" --version="false" --webui_dir="/mesos/mesos-0.29.0/_inst/share/mesos/webui"
--work_dir="/tmp/cTLLdU/master" --zk_session_timeout="10secs"
I0318 21:14:17.259085  2551 master.cpp:425] Master allowing unauthenticated frameworks to
register
I0318 21:14:17.259098  2551 master.cpp:428] Master only allowing authenticated slaves to register
I0318 21:14:17.259107  2551 credentials.hpp:35] Loading credentials for authentication from
'/tmp/cTLLdU/credentials'
I0318 21:14:17.259490  2551 master.cpp:468] Using default 'crammd5' authenticator
I0318 21:14:17.259677  2551 master.cpp:537] Using default 'basic' HTTP authenticator
I0318 21:14:17.259831  2551 master.cpp:571] Authorization enabled
I0318 21:14:17.260017  2550 whitelist_watcher.cpp:77] No whitelist given
I0318 21:14:17.260074  2548 hierarchical.cpp:144] Initialized hierarchical allocator process
I0318 21:14:17.263520  2549 master.cpp:1806] The newly elected leader is master@172.17.0.1:54435
with id cafa429e-abe4-4105-a592-1405d6252349
I0318 21:14:17.263583  2549 master.cpp:1819] Elected as the leading master!
I0318 21:14:17.263615  2549 master.cpp:1508] Recovering from registrar
I0318 21:14:17.263929  2549 registrar.cpp:307] Recovering registrar
I0318 21:14:17.292816  2543 leveldb.cpp:304] Persisting metadata (8 bytes) to leveldb took
35.433581ms
I0318 21:14:17.292901  2543 replica.cpp:320] Persisted replica status to STARTING
I0318 21:14:17.293314  2549 recover.cpp:473] Replica is in STARTING status
I0318 21:14:17.294845  2543 replica.cpp:673] Replica in STARTING status received a broadcasted
recover request from (15558)@172.17.0.1:54435
I0318 21:14:17.295339  2549 recover.cpp:193] Received a recover response from a replica in
STARTING status
I0318 21:14:17.295827  2543 recover.cpp:564] Updating replica status to VOTING
I0318 21:14:17.332636  2545 leveldb.cpp:304] Persisting metadata (8 bytes) to leveldb took
36.551617ms
I0318 21:14:17.332739  2545 replica.cpp:320] Persisted replica status to VOTING
I0318 21:14:17.333056  2545 recover.cpp:578] Successfully joined the Paxos group
I0318 21:14:17.333287  2545 recover.cpp:462] Recover process terminated
I0318 21:14:17.334234  2545 log.cpp:659] Attempting to start the writer
I0318 21:14:17.336205  2545 replica.cpp:493] Replica received implicit promise request from
(15559)@172.17.0.1:54435 with proposal 1
I0318 21:14:17.368175  2545 leveldb.cpp:304] Persisting metadata (8 bytes) to leveldb took
31.888305ms
I0318 21:14:17.368278  2545 replica.cpp:342] Persisted promised to 1
I0318 21:14:17.369936  2545 coordinator.cpp:238] Coordinator attempting to fill missing positions
I0318 21:14:17.371868  2546 replica.cpp:388] Replica received explicit promise request from
(15560)@172.17.0.1:54435 for position 0 with proposal 2
I0318 21:14:17.410030  2546 leveldb.cpp:341] Persisting action (8 bytes) to leveldb took 38.074238ms
I0318 21:14:17.410135  2546 replica.cpp:712] Persisted action at 0
I0318 21:14:17.412230  2546 replica.cpp:537] Replica received write request for position 0
from (15561)@172.17.0.1:54435
I0318 21:14:17.412343  2546 leveldb.cpp:436] Reading position from leveldb took 56075ns
I0318 21:14:17.449744  2546 leveldb.cpp:341] Persisting action (14 bytes) to leveldb took
37.325274ms
I0318 21:14:17.449851  2546 replica.cpp:712] Persisted action at 0
I0318 21:14:17.451167  2546 replica.cpp:691] Replica received learned notice for position
0 from @0.0.0.0:0
I0318 21:14:17.491619  2546 leveldb.cpp:341] Persisting action (16 bytes) to leveldb took
40.375416ms
I0318 21:14:17.491724  2546 replica.cpp:712] Persisted action at 0
I0318 21:14:17.491766  2546 replica.cpp:697] Replica learned NOP action at position 0
I0318 21:14:17.493201  2546 log.cpp:675] Writer started with ending position 0
I0318 21:14:17.494940  2546 leveldb.cpp:436] Reading position from leveldb took 76198ns
I0318 21:14:17.496783  2546 registrar.cpp:340] Successfully fetched the registry (0B) in 232.648192ms
I0318 21:14:17.497014  2546 registrar.cpp:439] Applied 1 operations in 46434ns; attempting
to update the 'registry'
I0318 21:14:17.498481  2543 log.cpp:683] Attempting to append 170 bytes to the log
I0318 21:14:17.498689  2548 coordinator.cpp:348] Coordinator attempting to write APPEND action
at position 1
I0318 21:14:17.499707  2548 replica.cpp:537] Replica received write request for position 1
from (15562)@172.17.0.1:54435
I0318 21:14:17.527292  2548 leveldb.cpp:341] Persisting action (189 bytes) to leveldb took
27.508207ms
I0318 21:14:17.527401  2548 replica.cpp:712] Persisted action at 1
I0318 21:14:17.528441  2539 replica.cpp:691] Replica received learned notice for position
1 from @0.0.0.0:0
I0318 21:14:17.550693  2539 leveldb.cpp:341] Persisting action (191 bytes) to leveldb took
22.174644ms
I0318 21:14:17.550782  2539 replica.cpp:712] Persisted action at 1
I0318 21:14:17.550817  2539 replica.cpp:697] Replica learned APPEND action at position 1
I0318 21:14:17.552278  2550 registrar.cpp:484] Successfully updated the 'registry' in 55.130112ms
I0318 21:14:17.552431  2550 registrar.cpp:370] Successfully recovered registrar
I0318 21:14:17.552517  2539 log.cpp:702] Attempting to truncate the log to 1
I0318 21:14:17.552723  2550 coordinator.cpp:348] Coordinator attempting to write TRUNCATE
action at position 2
I0318 21:14:17.553365  2539 master.cpp:1616] Recovered 0 slaves from the Registry (131B) ;
allowing 10mins for slaves to re-register
I0318 21:14:17.553442  2547 hierarchical.cpp:171] Skipping recovery of hierarchical allocator:
nothing to recover
I0318 21:14:17.554272  2550 replica.cpp:537] Replica received write request for position 2
from (15563)@172.17.0.1:54435
I0318 21:14:17.594673  2550 leveldb.cpp:341] Persisting action (16 bytes) to leveldb took
40.323819ms
I0318 21:14:17.594784  2550 replica.cpp:712] Persisted action at 2
I0318 21:14:17.596386  2540 replica.cpp:691] Replica received learned notice for position
2 from @0.0.0.0:0
I0318 21:14:17.647389  2540 leveldb.cpp:341] Persisting action (18 bytes) to leveldb took
50.922943ms
I0318 21:14:17.647549  2540 leveldb.cpp:399] Deleting ~1 keys from leveldb took 75717ns
I0318 21:14:17.647578  2540 replica.cpp:712] Persisted action at 2
I0318 21:14:17.647625  2540 replica.cpp:697] Replica learned TRUNCATE action at position 2
I0318 21:14:17.656744  2519 scheduler.cpp:172] Version: 0.29.0
I0318 21:14:17.657670  2550 scheduler.cpp:437] New master detected at master@172.17.0.1:54435
I0318 21:14:17.660348  2544 scheduler.cpp:337] Connected with the master at http://172.17.0.1:54435/master/api/v1/scheduler
I0318 21:14:17.661876  2544 scheduler.cpp:230] Sending SUBSCRIBE call to http://172.17.0.1:54435/master/api/v1/scheduler
I0318 21:14:17.663523  2538 process.cpp:3136] Handling HTTP event for process 'master' with
path: '/master/api/v1/scheduler'
I0318 21:14:17.664082  2538 http.cpp:312] HTTP POST for /master/api/v1/scheduler from 172.17.0.1:59928
I0318 21:14:17.664319  2538 master.cpp:2068] Received subscription request for HTTP framework
'default'
I0318 21:14:17.664394  2538 master.cpp:1845] Authorizing framework principal 'test-principal'
to receive offers for role '*'
I0318 21:14:17.666378  2538 master.cpp:2159] Subscribing framework 'default' with checkpointing
disabled and capabilities [  ]
I0318 21:14:17.667122  2538 hierarchical.cpp:265] Added framework cafa429e-abe4-4105-a592-1405d6252349-0000
I0318 21:14:17.667387  2547 master.hpp:1715] Sending heartbeat to cafa429e-abe4-4105-a592-1405d6252349-0000
I0318 21:14:17.668210  2548 scheduler.cpp:612] Enqueuing event SUBSCRIBED received from http://172.17.0.1:54435/master/api/v1/scheduler
I0318 21:14:17.670852  2542 scheduler.cpp:612] Enqueuing event HEARTBEAT received from http://172.17.0.1:54435/master/api/v1/scheduler
I0318 21:14:17.671440  2538 hierarchical.cpp:1453] No resources available to allocate!
I0318 21:14:17.671700  2538 hierarchical.cpp:1548] No inverse offers to send out!
I0318 21:14:17.671823  2538 hierarchical.cpp:1130] Performed allocation for 0 slaves in 458915ns
I0318 21:14:17.674933  2542 scheduler.cpp:230] Sending REQUEST call to http://172.17.0.1:54435/master/api/v1/scheduler
I0318 21:14:17.677661  2543 process.cpp:3136] Handling HTTP event for process 'master' with
path: '/master/api/v1/scheduler'
I0318 21:14:17.678207  2552 http.cpp:312] HTTP POST for /master/api/v1/scheduler from 172.17.0.1:59929
I0318 21:14:17.678408  2552 master.cpp:2765] Processing REQUEST call for framework cafa429e-abe4-4105-a592-1405d6252349-0000
(default)
I0318 21:14:17.678690  2552 hierarchical.cpp:589] Received resource request from framework
cafa429e-abe4-4105-a592-1405d6252349-0000
I0318 21:14:17.682570  2545 master.cpp:1251] Framework cafa429e-abe4-4105-a592-1405d6252349-0000
(default) disconnected
I0318 21:14:17.682704  2545 master.cpp:2622] Disconnecting framework cafa429e-abe4-4105-a592-1405d6252349-0000
(default)
I0318 21:14:17.682734  2545 master.cpp:2646] Deactivating framework cafa429e-abe4-4105-a592-1405d6252349-0000
(default)
I0318 21:14:17.682849  2545 master.cpp:1275] Giving framework cafa429e-abe4-4105-a592-1405d6252349-0000
(default) 0ns to failover
I0318 21:14:17.683111  2545 hierarchical.cpp:375] Deactivated framework cafa429e-abe4-4105-a592-1405d6252349-0000
I0318 21:14:17.684675  2545 master.cpp:5340] Framework failover timeout, removing framework
cafa429e-abe4-4105-a592-1405d6252349-0000 (default)
I0318 21:14:17.684721  2545 master.cpp:6073] Removing framework cafa429e-abe4-4105-a592-1405d6252349-0000
(default)
I0318 21:14:17.684994  2545 hierarchical.cpp:326] Removed framework cafa429e-abe4-4105-a592-1405d6252349-0000
I0318 21:14:17.691319  2519 master.cpp:1065] Master terminating
[       OK ] ContentType/SchedulerTest.Request/0 (581 ms)
[ RUN      ] ContentType/SchedulerTest.Request/1
I0318 21:14:17.707183  2519 cluster.cpp:139] Creating default 'local' authorizer
I0318 21:14:17.827340  2519 leveldb.cpp:174] Opened db in 119.85524ms
I0318 21:14:17.863462  2519 leveldb.cpp:181] Compacted db in 36.040861ms
I0318 21:14:17.863569  2519 leveldb.cpp:196] Created db iterator in 27208ns
I0318 21:14:17.863590  2519 leveldb.cpp:202] Seeked to beginning of db in 3170ns
I0318 21:14:17.863611  2519 leveldb.cpp:271] Iterated through 0 keys in the db in 247ns
I0318 21:14:17.863667  2519 replica.cpp:779] Replica recovered with log positions 0 ->
0 with 1 holes and 0 unlearned
I0318 21:14:17.864514  2548 recover.cpp:447] Starting replica recovery
I0318 21:14:17.865090  2548 recover.cpp:473] Replica is in EMPTY status
I0318 21:14:17.867398  2552 master.cpp:376] Master 0cc85e08-c7d3-4e24-af02-2caedef7d7fd (440e35194374)
started on 172.17.0.1:54435
I0318 21:14:17.867429  2552 master.cpp:378] Flags at startup: --acls="" --allocation_interval="1secs"
--allocator="HierarchicalDRF" --authenticate="false" --authenticate_http="true" --authenticate_slaves="true"
--authenticators="crammd5" --authorizers="local" --credentials="/tmp/hOoQZV/credentials" --framework_sorter="drf"
--help="false" --hostname_lookup="true" --http_authenticators="basic" --initialize_driver_logging="true"
--log_auto_initialize="true" --logbufsecs="0" --logging_level="INFO" --max_completed_frameworks="50"
--max_completed_tasks_per_framework="1000" --max_slave_ping_timeouts="5" --quiet="false" --recovery_slave_removal_limit="100%"
--registry="replicated_log" --registry_fetch_timeout="1mins" --registry_store_timeout="100secs"
--registry_strict="true" --root_submissions="true" --slave_ping_timeout="15secs" --slave_reregister_timeout="10mins"
--user_sorter="drf" --version="false" --webui_dir="/mesos/mesos-0.29.0/_inst/share/mesos/webui"
--work_dir="/tmp/hOoQZV/master" --zk_session_timeout="10secs"
I0318 21:14:17.867820  2552 master.cpp:425] Master allowing unauthenticated frameworks to
register
I0318 21:14:17.867832  2552 master.cpp:428] Master only allowing authenticated slaves to register
I0318 21:14:17.867842  2552 credentials.hpp:35] Loading credentials for authentication from
'/tmp/hOoQZV/credentials'
I0318 21:14:17.868201  2552 master.cpp:468] Using default 'crammd5' authenticator
I0318 21:14:17.868335  2552 master.cpp:537] Using default 'basic' HTTP authenticator
I0318 21:14:17.868445  2552 master.cpp:571] Authorization enabled
I0318 21:14:17.870396  2549 whitelist_watcher.cpp:77] No whitelist given
I0318 21:14:17.871018  2544 master.cpp:1806] The newly elected leader is master@172.17.0.1:54435
with id 0cc85e08-c7d3-4e24-af02-2caedef7d7fd
I0318 21:14:17.871057  2544 master.cpp:1819] Elected as the leading master!
I0318 21:14:17.871080  2544 master.cpp:1508] Recovering from registrar
I0318 21:14:17.871332  2544 registrar.cpp:307] Recovering registrar
I0318 21:14:17.873054  2550 hierarchical.cpp:144] Initialized hierarchical allocator process
I0318 21:14:17.874665  2549 replica.cpp:673] Replica in EMPTY status received a broadcasted
recover request from (15572)@172.17.0.1:54435
I0318 21:14:17.875319  2548 recover.cpp:193] Received a recover response from a replica in
EMPTY status
I0318 21:14:17.876117  2548 recover.cpp:564] Updating replica status to STARTING
I0318 21:14:17.950319  2548 leveldb.cpp:304] Persisting metadata (8 bytes) to leveldb took
73.800818ms
I0318 21:14:17.950402  2548 replica.cpp:320] Persisted replica status to STARTING
I0318 21:14:17.950757  2548 recover.cpp:473] Replica is in STARTING status
I0318 21:14:17.952654  2548 replica.cpp:673] Replica in STARTING status received a broadcasted
recover request from (15573)@172.17.0.1:54435
I0318 21:14:17.953048  2548 recover.cpp:193] Received a recover response from a replica in
STARTING status
I0318 21:14:17.953812  2547 recover.cpp:564] Updating replica status to VOTING
I0318 21:14:17.988059  2547 leveldb.cpp:304] Persisting metadata (8 bytes) to leveldb took
33.971003ms
I0318 21:14:17.988142  2547 replica.cpp:320] Persisted replica status to VOTING
I0318 21:14:17.988370  2547 recover.cpp:578] Successfully joined the Paxos group
I0318 21:14:17.988559  2547 recover.cpp:462] Recover process terminated
I0318 21:14:17.989281  2547 log.cpp:659] Attempting to start the writer
I0318 21:14:17.990859  2547 replica.cpp:493] Replica received implicit promise request from
(15574)@172.17.0.1:54435 with proposal 1
I0318 21:14:18.025707  2547 leveldb.cpp:304] Persisting metadata (8 bytes) to leveldb took
34.794224ms
I0318 21:14:18.025790  2547 replica.cpp:342] Persisted promised to 1
I0318 21:14:18.027078  2547 coordinator.cpp:238] Coordinator attempting to fill missing positions
I0318 21:14:18.028750  2547 replica.cpp:388] Replica received explicit promise request from
(15575)@172.17.0.1:54435 for position 0 with proposal 2
I0318 21:14:18.067816  2547 leveldb.cpp:341] Persisting action (8 bytes) to leveldb took 38.997627ms
I0318 21:14:18.067901  2547 replica.cpp:712] Persisted action at 0
I0318 21:14:18.069335  2551 replica.cpp:537] Replica received write request for position 0
from (15576)@172.17.0.1:54435
I0318 21:14:18.069422  2551 leveldb.cpp:436] Reading position from leveldb took 42151ns
I0318 21:14:18.105465  2551 leveldb.cpp:341] Persisting action (14 bytes) to leveldb took
35.970633ms
I0318 21:14:18.105551  2551 replica.cpp:712] Persisted action at 0
I0318 21:14:18.106564  2548 replica.cpp:691] Replica received learned notice for position
0 from @0.0.0.0:0
I0318 21:14:18.143182  2548 leveldb.cpp:341] Persisting action (16 bytes) to leveldb took
36.546181ms
I0318 21:14:18.143265  2548 replica.cpp:712] Persisted action at 0
I0318 21:14:18.143296  2548 replica.cpp:697] Replica learned NOP action at position 0
I0318 21:14:18.149359  2539 log.cpp:675] Writer started with ending position 0
I0318 21:14:18.150637  2540 leveldb.cpp:436] Reading position from leveldb took 67733ns
I0318 21:14:18.151881  2540 registrar.cpp:340] Successfully fetched the registry (0B) in 280.50304ms
I0318 21:14:18.152024  2540 registrar.cpp:439] Applied 1 operations in 37732ns; attempting
to update the 'registry'
I0318 21:14:18.153290  2540 log.cpp:683] Attempting to append 170 bytes to the log
I0318 21:14:18.153522  2540 coordinator.cpp:348] Coordinator attempting to write APPEND action
at position 1
I0318 21:14:18.154661  2540 replica.cpp:537] Replica received write request for position 1
from (15577)@172.17.0.1:54435
I0318 21:14:18.196665  2540 leveldb.cpp:341] Persisting action (189 bytes) to leveldb took
41.938948ms
I0318 21:14:18.196756  2540 replica.cpp:712] Persisted action at 1
I0318 21:14:18.197717  2546 replica.cpp:691] Replica received learned notice for position
1 from @0.0.0.0:0
I0318 21:14:18.230155  2546 leveldb.cpp:341] Persisting action (191 bytes) to leveldb took
32.382417ms
I0318 21:14:18.230247  2546 replica.cpp:712] Persisted action at 1
I0318 21:14:18.230281  2546 replica.cpp:697] Replica learned APPEND action at position 1
I0318 21:14:18.231676  2541 registrar.cpp:484] Successfully updated the 'registry' in 79.581184ms
I0318 21:14:18.231822  2541 registrar.cpp:370] Successfully recovered registrar
I0318 21:14:18.231923  2546 log.cpp:702] Attempting to truncate the log to 1
I0318 21:14:18.232098  2541 coordinator.cpp:348] Coordinator attempting to write TRUNCATE
action at position 2
I0318 21:14:18.232278  2546 master.cpp:1616] Recovered 0 slaves from the Registry (131B) ;
allowing 10mins for slaves to re-register
I0318 21:14:18.232560  2546 hierarchical.cpp:171] Skipping recovery of hierarchical allocator:
nothing to recover
I0318 21:14:18.233311  2538 replica.cpp:537] Replica received write request for position 2
from (15578)@172.17.0.1:54435
I0318 21:14:18.264325  2538 leveldb.cpp:341] Persisting action (16 bytes) to leveldb took
30.946255ms
I0318 21:14:18.264415  2538 replica.cpp:712] Persisted action at 2
I0318 21:14:18.265429  2538 replica.cpp:691] Replica received learned notice for position
2 from @0.0.0.0:0
I0318 21:14:18.297912  2538 leveldb.cpp:341] Persisting action (18 bytes) to leveldb took
32.42958ms
I0318 21:14:18.298055  2538 leveldb.cpp:399] Deleting ~1 keys from leveldb took 65382ns
I0318 21:14:18.298082  2538 replica.cpp:712] Persisted action at 2
I0318 21:14:18.298115  2538 replica.cpp:697] Replica learned TRUNCATE action at position 2
I0318 21:14:18.304673  2519 scheduler.cpp:172] Version: 0.29.0
I0318 21:14:18.305853  2543 scheduler.cpp:437] New master detected at master@172.17.0.1:54435
I0318 21:14:18.308359  2548 scheduler.cpp:337] Connected with the master at http://172.17.0.1:54435/master/api/v1/scheduler
I0318 21:14:18.310720  2548 scheduler.cpp:230] Sending SUBSCRIBE call to http://172.17.0.1:54435/master/api/v1/scheduler
I0318 21:14:18.312451  2547 process.cpp:3136] Handling HTTP event for process 'master' with
path: '/master/api/v1/scheduler'
I0318 21:14:18.313025  2539 http.cpp:312] HTTP POST for /master/api/v1/scheduler from 172.17.0.1:59934
I0318 21:14:18.313452  2539 master.cpp:2068] Received subscription request for HTTP framework
'default'
I0318 21:14:18.313522  2539 master.cpp:1845] Authorizing framework principal 'test-principal'
to receive offers for role '*'
I0318 21:14:18.313814  2539 master.cpp:2159] Subscribing framework 'default' with checkpointing
disabled and capabilities [  ]
I0318 21:14:18.314443  2539 hierarchical.cpp:265] Added framework 0cc85e08-c7d3-4e24-af02-2caedef7d7fd-0000
I0318 21:14:18.314527  2539 hierarchical.cpp:1453] No resources available to allocate!
I0318 21:14:18.314560  2539 hierarchical.cpp:1548] No inverse offers to send out!
I0318 21:14:18.314586  2539 hierarchical.cpp:1130] Performed allocation for 0 slaves in 120744ns
I0318 21:14:18.314661  2553 master.hpp:1715] Sending heartbeat to 0cc85e08-c7d3-4e24-af02-2caedef7d7fd-0000
I0318 21:14:18.315945  2553 scheduler.cpp:612] Enqueuing event SUBSCRIBED received from http://172.17.0.1:54435/master/api/v1/scheduler
I0318 21:14:18.317277  2543 scheduler.cpp:612] Enqueuing event HEARTBEAT received from http://172.17.0.1:54435/master/api/v1/scheduler
I0318 21:14:18.318136  2552 scheduler.cpp:230] Sending REQUEST call to http://172.17.0.1:54435/master/api/v1/scheduler
I0318 21:14:18.320875  2551 process.cpp:3136] Handling HTTP event for process 'master' with
path: '/master/api/v1/scheduler'
I0318 21:14:18.321440  2551 http.cpp:312] HTTP POST for /master/api/v1/scheduler from 172.17.0.1:59935
I0318 21:14:18.321828  2551 master.cpp:2765] Processing REQUEST call for framework 0cc85e08-c7d3-4e24-af02-2caedef7d7fd-0000
(default)
I0318 21:14:18.322080  2551 hierarchical.cpp:589] Received resource request from framework
0cc85e08-c7d3-4e24-af02-2caedef7d7fd-0000
I0318 21:14:18.327951  2549 master.cpp:1251] Framework 0cc85e08-c7d3-4e24-af02-2caedef7d7fd-0000
(default) disconnected
I0318 21:14:18.328004  2549 master.cpp:2622] Disconnecting framework 0cc85e08-c7d3-4e24-af02-2caedef7d7fd-0000
(default)
I0318 21:14:18.328028  2549 master.cpp:2646] Deactivating framework 0cc85e08-c7d3-4e24-af02-2caedef7d7fd-0000
(default)
I0318 21:14:18.328119  2549 master.cpp:1275] Giving framework 0cc85e08-c7d3-4e24-af02-2caedef7d7fd-0000
(default) 0ns to failover
I0318 21:14:18.328189  2544 hierarchical.cpp:375] Deactivated framework 0cc85e08-c7d3-4e24-af02-2caedef7d7fd-0000
I0318 21:14:18.331722  2544 master.cpp:5340] Framework failover timeout, removing framework
0cc85e08-c7d3-4e24-af02-2caedef7d7fd-0000 (default)
I0318 21:14:18.331784  2544 master.cpp:6073] Removing framework 0cc85e08-c7d3-4e24-af02-2caedef7d7fd-0000
(default)
I0318 21:14:18.332101  2544 hierarchical.cpp:326] Removed framework 0cc85e08-c7d3-4e24-af02-2caedef7d7fd-0000
I0318 21:14:18.338984  2519 master.cpp:1065] Master terminating
[       OK ] ContentType/SchedulerTest.Request/1 (662 ms)
[----------] 26 tests from ContentType/SchedulerTest (22173 ms total)

[----------] Global test environment tear-down
E0318 21:14:18.697394  2519 environment.cpp:752] Failed to remove '/tmp/LogZooKeeperTest_WriteRead_9kEZK7':
No such file or directory
E0318 21:14:18.697481  2519 environment.cpp:752] Failed to remove '/tmp/LogZooKeeperTest_LostZooKeeper_HCrDWK':
No such file or directory
[==========] 1028 tests from 131 test cases ran. (876051 ms total)
[  PASSED  ] 1027 tests.
[  FAILED  ] 1 test, listed below:
[  FAILED  ] HealthCheckTest.HealthStatusChange

 1 FAILED TEST
  YOU HAVE 6 DISABLED TESTS

make[4]: *** [check-local] Error 1
make[4]: Leaving directory `/mesos/mesos-0.29.0/_build/src'
make[3]: *** [check-am] Error 2
make[3]: Leaving directory `/mesos/mesos-0.29.0/_build/src'
make[2]: *** [check] Error 2
make[2]: Leaving directory `/mesos/mesos-0.29.0/_build/src'
make[1]: Leaving directory `/mesos/mesos-0.29.0/_build'
make[1]: *** [check-recursive] Error 1
make: *** [distcheck] Error 1
+ docker rmi mesos-1458332457-16501
Untagged: mesos-1458332457-16501:latest
Deleted: b6567126a48b3ea7e842176a61964e8d463cf1183c98b6f5c1be971accd669f6
Deleted: f39b8a629c1e56e6940abee54393018632c028b7d44306dad077a9846a15c3da
Deleted: 530c1d912f295499ee5420bed8f97709c0ce3c521efe544073e4d3c77825c48a
Deleted: dc4f4ef7cc2dde11ee3fd57c917520dd2e1968b0f40dbf32705d57f903dcb7ef
Deleted: d746adda77cbd13dd5b6343341a134d661db155d5e8b66684ea34bbd78f7311e
Deleted: 848715f6540b5bf5ca474835cb01ea5ac54a5cc93b5403dcab1bbf78879803f4
Deleted: 83a0a35bbfbb6fb3a8225cec4ff4f70796201e9fb13c74bb492de4685da0142e
Deleted: 6700d0cf9d3a63f18fba1cabe6144b171ddfae10abe6d0ec5d1756686765df61
Deleted: 50a8ac3c7a81c4316a20d2873a0caec456102808707959995923ccade2c07f67
Deleted: 286712229fd436f013e7f7eaf6a171680cfe8c3dacfcd8fa48711cdce01815d8
Deleted: 5d0cdc05adef3023855e32ad4656df5904940c05fe30590bc0aa611b35bff46d
Deleted: 58f73bb0204bbf8d1d04cb63c65004746630aedd337ac1d84f49398fce9201fe
Deleted: 08ef389e6baf32df299f85efd51873a6aefe27147c5a30612f7bb8e3b65a81fc
Deleted: b9996df9ddcd41ebfcb404b9c72ca0a3ea6ae2447c17410fa49b2dc3e13a49b7
Deleted: 32dbbb0f1facf995ffffb9ce2c688166b39b7e50345fe83b90e62c68cd790f8d
Deleted: 96c3f06b26801339e96d57320a67abb64992151b83e2fb47c7909a6821c4b9dd
Build step 'Execute shell' marked build as failure

Mime
View raw message