mesos-builds mailing list archives

Site index · List index
Message view « Date » · « Thread »
Top « Date » · « Thread »
From Apache Jenkins Server <jenk...@builds.apache.org>
Subject Build failed in Jenkins: Mesos » gcc,--verbose --enable-libevent --enable-ssl,GLOG_v=1 MESOS_VERBOSE=1,centos:7,(docker||Hadoop)&&(!ubuntu-us1) #1895
Date Tue, 29 Mar 2016 20:18:28 GMT
See <https://builds.apache.org/job/Mesos/COMPILER=gcc,CONFIGURATION=--verbose%20--enable-libevent%20--enable-ssl,ENVIRONMENT=GLOG_v=1%20MESOS_VERBOSE=1,OS=centos%3A7,label_exp=(docker%7C%7CHadoop)&&(!ubuntu-us1)/1895/changes>

Changes:

[bmahler] Added a script to install the Nvidia GDK on a host.

------------------------------------------
[...truncated 18042 lines...]
[       OK ] ProcessTest.FirewallUninstall (8 ms)
[----------] 30 tests from ProcessTest (88 ms total)

[----------] 3 tests from QueueTest
[ RUN      ] QueueTest.Block
[       OK ] QueueTest.Block (0 ms)
[ RUN      ] QueueTest.Noblock
[       OK ] QueueTest.Noblock (0 ms)
[ RUN      ] QueueTest.Queue
[       OK ] QueueTest.Queue (0 ms)
[----------] 3 tests from QueueTest (0 ms total)

[----------] 3 tests from ReapTest
[ RUN      ] ReapTest.NonChildProcess
[       OK ] ReapTest.NonChildProcess (43 ms)
[ RUN      ] ReapTest.ChildProcess
[       OK ] ReapTest.ChildProcess (32 ms)
[ RUN      ] ReapTest.TerminatedChildProcess
[       OK ] ReapTest.TerminatedChildProcess (24 ms)
[----------] 3 tests from ReapTest (99 ms total)

[----------] 4 tests from SequenceTest
[ RUN      ] SequenceTest.Serialize
[       OK ] SequenceTest.Serialize (11 ms)
[ RUN      ] SequenceTest.DiscardOne
[       OK ] SequenceTest.DiscardOne (11 ms)
[ RUN      ] SequenceTest.DiscardAll
[       OK ] SequenceTest.DiscardAll (11 ms)
[ RUN      ] SequenceTest.Random
[       OK ] SequenceTest.Random (12 ms)
[----------] 4 tests from SequenceTest (45 ms total)

[----------] 4 tests from SharedTest
[ RUN      ] SharedTest.ConstAccess
[       OK ] SharedTest.ConstAccess (0 ms)
[ RUN      ] SharedTest.Null
[       OK ] SharedTest.Null (0 ms)
[ RUN      ] SharedTest.Reset
[       OK ] SharedTest.Reset (0 ms)
[ RUN      ] SharedTest.Own
[       OK ] SharedTest.Own (0 ms)
[----------] 4 tests from SharedTest (0 ms total)

[----------] 3 tests from StatisticsTest
[ RUN      ] StatisticsTest.Empty
[       OK ] StatisticsTest.Empty (0 ms)
[ RUN      ] StatisticsTest.Single
[       OK ] StatisticsTest.Single (0 ms)
[ RUN      ] StatisticsTest.Statistics
[       OK ] StatisticsTest.Statistics (0 ms)
[----------] 3 tests from StatisticsTest (0 ms total)

[----------] 14 tests from SubprocessTest
[ RUN      ] SubprocessTest.Status
[       OK ] SubprocessTest.Status (67 ms)
[ RUN      ] SubprocessTest.PipeOutput
[       OK ] SubprocessTest.PipeOutput (29 ms)
[ RUN      ] SubprocessTest.PipeInput
[       OK ] SubprocessTest.PipeInput (14 ms)
[ RUN      ] SubprocessTest.PipeRedirect
[       OK ] SubprocessTest.PipeRedirect (15 ms)
[ RUN      ] SubprocessTest.PathOutput
[       OK ] SubprocessTest.PathOutput (43 ms)
[ RUN      ] SubprocessTest.PathInput
[       OK ] SubprocessTest.PathInput (14 ms)
[ RUN      ] SubprocessTest.FdOutput
[       OK ] SubprocessTest.FdOutput (43 ms)
[ RUN      ] SubprocessTest.FdInput
[       OK ] SubprocessTest.FdInput (15 ms)
[ RUN      ] SubprocessTest.Default
hello world
[       OK ] SubprocessTest.Default (21 ms)
[ RUN      ] SubprocessTest.Flags
[       OK ] SubprocessTest.Flags (22 ms)
[ RUN      ] SubprocessTest.Environment
[       OK ] SubprocessTest.Environment (28 ms)
[ RUN      ] SubprocessTest.EnvironmentWithSpaces
[       OK ] SubprocessTest.EnvironmentWithSpaces (14 ms)
[ RUN      ] SubprocessTest.EnvironmentWithSpacesAndQuotes
[       OK ] SubprocessTest.EnvironmentWithSpacesAndQuotes (13 ms)
[ RUN      ] SubprocessTest.EnvironmentOverride
[       OK ] SubprocessTest.EnvironmentOverride (14 ms)
[----------] 14 tests from SubprocessTest (352 ms total)

[----------] 3 tests from TimeSeriesTest
[ RUN      ] TimeSeriesTest.Set
[       OK ] TimeSeriesTest.Set (0 ms)
[ RUN      ] TimeSeriesTest.Sparsify
[       OK ] TimeSeriesTest.Sparsify (1 ms)
[ RUN      ] TimeSeriesTest.Truncate
[       OK ] TimeSeriesTest.Truncate (0 ms)
[----------] 3 tests from TimeSeriesTest (1 ms total)

[----------] 5 tests from TimeTest
[ RUN      ] TimeTest.Arithmetic
[       OK ] TimeTest.Arithmetic (0 ms)
[ RUN      ] TimeTest.Now
[       OK ] TimeTest.Now (0 ms)
[ RUN      ] TimeTest.RFC1123Output
[       OK ] TimeTest.RFC1123Output (0 ms)
[ RUN      ] TimeTest.RFC3339Output
[       OK ] TimeTest.RFC3339Output (0 ms)
[ RUN      ] TimeTest.Output
[       OK ] TimeTest.Output (0 ms)
[----------] 5 tests from TimeTest (0 ms total)

[----------] 1 test from SSL
[ RUN      ] SSL.Disabled
[       OK ] SSL.Disabled (0 ms)
[----------] 1 test from SSL (1 ms total)

[----------] 16 tests from SSLTest
[ RUN      ] SSLTest.BasicSameProcess
[       OK ] SSLTest.BasicSameProcess (402 ms)
[ RUN      ] SSLTest.SSLSocket
[       OK ] SSLTest.SSLSocket (201 ms)
[ RUN      ] SSLTest.NonSSLSocket
I0329 20:18:04.437559 32437 libevent_ssl_socket.cpp:1066] Socket error: error:140760FC:SSL
routines:SSL23_GET_CLIENT_HELLO:unknown protocol
[       OK ] SSLTest.NonSSLSocket (817 ms)
[ RUN      ] SSLTest.NoVerifyBadCA
[       OK ] SSLTest.NoVerifyBadCA (703 ms)
[ RUN      ] SSLTest.RequireBadCA
W0329 20:18:05.648025 32437 openssl.cpp:250] Error with certificate at depth: 0
Issuer: /C=US/O=Test/CN=9378daa0ec3c
Subject: /C=US/O=Test/CN=9378daa0ec3c
Error (18): self signed certificate
I0329 20:18:05.648154 32437 libevent_ssl_socket.cpp:1066] Socket error: error:140890B2:SSL
routines:SSL3_GET_CLIENT_CERTIFICATE:no certificate returned
[       OK ] SSLTest.RequireBadCA (503 ms)
[ RUN      ] SSLTest.VerifyBadCA
W0329 20:18:06.038900 32437 openssl.cpp:250] Error with certificate at depth: 0
Issuer: /C=US/O=Test/CN=9378daa0ec3c
Subject: /C=US/O=Test/CN=9378daa0ec3c
Error (18): self signed certificate
I0329 20:18:06.038995 32437 libevent_ssl_socket.cpp:1066] Socket error: error:140890B2:SSL
routines:SSL3_GET_CLIENT_CERTIFICATE:no certificate returned
[       OK ] SSLTest.VerifyBadCA (302 ms)
[ RUN      ] SSLTest.VerifyCertificate
[       OK ] SSLTest.VerifyCertificate (302 ms)
[ RUN      ] SSLTest.RequireCertificate
[       OK ] SSLTest.RequireCertificate (703 ms)
[ RUN      ] SSLTest.ProtocolMismatch
I0329 20:18:07.737012 32420 ssl_tests.cpp:390] Testing server protocol 'SSL_ENABLE_SSL_V3'
with client protocol 'SSL_ENABLE_SSL_V3'
I0329 20:18:07.861223 32420 ssl_tests.cpp:390] Testing server protocol 'SSL_ENABLE_SSL_V3'
with client protocol 'SSL_ENABLE_TLS_V1_0'
I0329 20:18:07.882096 32437 libevent_ssl_socket.cpp:1066] Socket error: Connection reset by
peer
I0329 20:18:07.961874 32420 ssl_tests.cpp:390] Testing server protocol 'SSL_ENABLE_SSL_V3'
with client protocol 'SSL_ENABLE_TLS_V1_1'
I0329 20:18:07.982216 32437 libevent_ssl_socket.cpp:1066] Socket error: Connection reset by
peer
I0329 20:18:08.063007 32420 ssl_tests.cpp:390] Testing server protocol 'SSL_ENABLE_SSL_V3'
with client protocol 'SSL_ENABLE_TLS_V1_2'
I0329 20:18:08.082640 32437 libevent_ssl_socket.cpp:1066] Socket error: Connection reset by
peer
I0329 20:18:08.163414 32420 ssl_tests.cpp:390] Testing server protocol 'SSL_ENABLE_TLS_V1_0'
with client protocol 'SSL_ENABLE_SSL_V3'
I0329 20:18:08.179426 32437 libevent_ssl_socket.cpp:1066] Socket error: error:1408A10B:SSL
routines:SSL3_GET_CLIENT_HELLO:wrong version number
I0329 20:18:08.264494 32420 ssl_tests.cpp:390] Testing server protocol 'SSL_ENABLE_TLS_V1_0'
with client protocol 'SSL_ENABLE_TLS_V1_0'
I0329 20:18:08.365545 32420 ssl_tests.cpp:390] Testing server protocol 'SSL_ENABLE_TLS_V1_0'
with client protocol 'SSL_ENABLE_TLS_V1_1'
I0329 20:18:08.385327 32437 libevent_ssl_socket.cpp:1066] Socket error: Connection reset by
peer
I0329 20:18:08.466058 32420 ssl_tests.cpp:390] Testing server protocol 'SSL_ENABLE_TLS_V1_0'
with client protocol 'SSL_ENABLE_TLS_V1_2'
I0329 20:18:08.482403 32437 libevent_ssl_socket.cpp:1066] Socket error: Connection reset by
peer
I0329 20:18:08.567212 32420 ssl_tests.cpp:390] Testing server protocol 'SSL_ENABLE_TLS_V1_1'
with client protocol 'SSL_ENABLE_SSL_V3'
I0329 20:18:08.583525 32437 libevent_ssl_socket.cpp:1066] Socket error: error:140760FC:SSL
routines:SSL23_GET_CLIENT_HELLO:unknown protocol
I0329 20:18:08.668112 32420 ssl_tests.cpp:390] Testing server protocol 'SSL_ENABLE_TLS_V1_1'
with client protocol 'SSL_ENABLE_TLS_V1_0'
I0329 20:18:08.683826 32437 libevent_ssl_socket.cpp:1066] Socket error: error:140760FC:SSL
routines:SSL23_GET_CLIENT_HELLO:unknown protocol
I0329 20:18:08.768622 32420 ssl_tests.cpp:390] Testing server protocol 'SSL_ENABLE_TLS_V1_1'
with client protocol 'SSL_ENABLE_TLS_V1_1'
I0329 20:18:08.869632 32420 ssl_tests.cpp:390] Testing server protocol 'SSL_ENABLE_TLS_V1_1'
with client protocol 'SSL_ENABLE_TLS_V1_2'
I0329 20:18:08.886778 32437 libevent_ssl_socket.cpp:1066] Socket error: Connection reset by
peer
I0329 20:18:08.970582 32420 ssl_tests.cpp:390] Testing server protocol 'SSL_ENABLE_TLS_V1_2'
with client protocol 'SSL_ENABLE_SSL_V3'
I0329 20:18:08.989058 32437 libevent_ssl_socket.cpp:1066] Socket error: error:140760FC:SSL
routines:SSL23_GET_CLIENT_HELLO:unknown protocol
I0329 20:18:09.071944 32420 ssl_tests.cpp:390] Testing server protocol 'SSL_ENABLE_TLS_V1_2'
with client protocol 'SSL_ENABLE_TLS_V1_0'
I0329 20:18:09.089679 32437 libevent_ssl_socket.cpp:1066] Socket error: error:140760FC:SSL
routines:SSL23_GET_CLIENT_HELLO:unknown protocol
I0329 20:18:09.172616 32420 ssl_tests.cpp:390] Testing server protocol 'SSL_ENABLE_TLS_V1_2'
with client protocol 'SSL_ENABLE_TLS_V1_1'
I0329 20:18:09.190191 32437 libevent_ssl_socket.cpp:1066] Socket error: error:140760FC:SSL
routines:SSL23_GET_CLIENT_HELLO:unknown protocol
I0329 20:18:09.274196 32420 ssl_tests.cpp:390] Testing server protocol 'SSL_ENABLE_TLS_V1_2'
with client protocol 'SSL_ENABLE_TLS_V1_2'
[       OK ] SSLTest.ProtocolMismatch (2322 ms)
[ RUN      ] SSLTest.ValidDowngrade
W0329 20:18:09.829375 32420 openssl.cpp:363] Failed SSL connections will be downgraded to
a non-SSL socket
[       OK ] SSLTest.ValidDowngrade (503 ms)
[ RUN      ] SSLTest.NoValidDowngrade
I0329 20:18:10.247660 32437 libevent_ssl_socket.cpp:1066] Socket error: error:140760FC:SSL
routines:SSL23_GET_CLIENT_HELLO:unknown protocol
[       OK ] SSLTest.NoValidDowngrade (401 ms)
[ RUN      ] SSLTest.ValidDowngradeEachProtocol
I0329 20:18:10.718142 32420 ssl_tests.cpp:509] Testing server protocol 'SSL_ENABLE_SSL_V3'
W0329 20:18:10.718536 32420 openssl.cpp:363] Failed SSL connections will be downgraded to
a non-SSL socket
I0329 20:18:10.782253 32420 ssl_tests.cpp:509] Testing server protocol 'SSL_ENABLE_TLS_V1_0'
W0329 20:18:10.782760 32420 openssl.cpp:363] Failed SSL connections will be downgraded to
a non-SSL socket
I0329 20:18:10.883672 32420 ssl_tests.cpp:509] Testing server protocol 'SSL_ENABLE_TLS_V1_1'
W0329 20:18:10.884366 32420 openssl.cpp:363] Failed SSL connections will be downgraded to
a non-SSL socket
I0329 20:18:10.984666 32420 ssl_tests.cpp:509] Testing server protocol 'SSL_ENABLE_TLS_V1_2'
W0329 20:18:10.985266 32420 openssl.cpp:363] Failed SSL connections will be downgraded to
a non-SSL socket
[       OK ] SSLTest.ValidDowngradeEachProtocol (807 ms)
[ RUN      ] SSLTest.NoValidDowngradeEachProtocol
I0329 20:18:11.471987 32420 ssl_tests.cpp:556] Testing server protocol 'SSL_ENABLE_SSL_V3'
I0329 20:18:11.484964 32437 libevent_ssl_socket.cpp:1066] Socket error: error:140760FC:SSL
routines:SSL23_GET_CLIENT_HELLO:unknown protocol
I0329 20:18:11.487494 32420 ssl_tests.cpp:556] Testing server protocol 'SSL_ENABLE_TLS_V1_0'
I0329 20:18:11.502943 32437 libevent_ssl_socket.cpp:1066] Socket error: error:140760FC:SSL
routines:SSL23_GET_CLIENT_HELLO:unknown protocol
I0329 20:18:11.588966 32420 ssl_tests.cpp:556] Testing server protocol 'SSL_ENABLE_TLS_V1_1'
I0329 20:18:11.601616 32437 libevent_ssl_socket.cpp:1066] Socket error: error:140760FC:SSL
routines:SSL23_GET_CLIENT_HELLO:unknown protocol
I0329 20:18:11.689329 32420 ssl_tests.cpp:556] Testing server protocol 'SSL_ENABLE_TLS_V1_2'
I0329 20:18:11.701874 32437 libevent_ssl_socket.cpp:1066] Socket error: error:140760FC:SSL
routines:SSL23_GET_CLIENT_HELLO:unknown protocol
[       OK ] SSLTest.NoValidDowngradeEachProtocol (705 ms)
[ RUN      ] SSLTest.PeerAddress
[       OK ] SSLTest.PeerAddress (505 ms)
[ RUN      ] SSLTest.HTTPSGet
../../../3rdparty/libprocess/src/tests/ssl_tests.cpp:663: Failure
(response).failure(): Failed to decode response
[  FAILED  ] SSLTest.HTTPSGet (106 ms)
[ RUN      ] SSLTest.HTTPSPost
../../../3rdparty/libprocess/src/tests/ssl_tests.cpp:704: Failure
(response).failure(): Failed to decode response
[  FAILED  ] SSLTest.HTTPSPost (556 ms)
[----------] 16 tests from SSLTest (9839 ms total)

[----------] Global test environment tear-down
[==========] 172 tests from 25 test cases ran. (11017 ms total)
[  PASSED  ] 170 tests.
[  FAILED  ] 2 tests, listed below:
[  FAILED  ] SSLTest.HTTPSGet
[  FAILED  ] SSLTest.HTTPSPost

 2 FAILED TESTS
  YOU HAVE 2 DISABLED TESTS

make[6]: *** [check-local] Error 1
make[6]: Leaving directory `/mesos/mesos-0.29.0/_build/3rdparty/libprocess'
make[5]: *** [check-am] Error 2
make[5]: Leaving directory `/mesos/mesos-0.29.0/_build/3rdparty/libprocess'
make[4]: *** [check-recursive] Error 1
make[4]: Leaving directory `/mesos/mesos-0.29.0/_build/3rdparty/libprocess'
make[3]: *** [check-recursive] Error 1
make[3]: Leaving directory `/mesos/mesos-0.29.0/_build/3rdparty'
make[2]: *** [check] Error 2
make[2]: Leaving directory `/mesos/mesos-0.29.0/_build/3rdparty'
make[1]: *** [check-recursive] Error 1
make[1]: Leaving directory `/mesos/mesos-0.29.0/_build'
make: *** [distcheck] Error 1
+ docker rmi mesos-1459281647-7353
Untagged: mesos-1459281647-7353:latest
Deleted: d990cbc3c90d241948e4a75cefb81dd2cee0771ac46205cfb5011cee51960455
Deleted: b48713eae91bc86a33ae245ad8d71fa11468837394b264191d033cc1c4f03da7
Deleted: 76d18b8daea3c590b589ce2fc15f294263cbf74cae3bb8606728da174a185d7b
Deleted: ab68828ed746337ecc8b754afa71377f13bef800a97cba662a53f240f33e9606
Deleted: 137610888b874e7d849a5a97a7606c1247b46203197f747f7ad30d2dd7be6b05
Deleted: e13fd5201097fb63d16caef16efde28910f48e166b0fad7b55a42bedefd53e1c
Deleted: 0df09e106f13d01caeb2dcd9d5ee54268b035059ee5efb858a5a40b4c3ccdc28
Deleted: afd99d52eb3cc02fd2fe4741e2679b7d254b181c9e14a1623609e8969ed7d0c4
Deleted: 1ed1958705e6b2f862181d46051bd32eeeb6f6b5f8a3381c3ba7887b7e1d3256
Deleted: c036f24c680741572226559dbeffdd4c10b45ba6f0f8062885731c9c8997fff7
Deleted: 70648a5edd8ff1762f9d8a9d99f3a52a95082766bbf7860c85ff293e4c39b5f2
Deleted: 5ce6c4813d0a9e74548ec06cd02351d424d72440d54111861d07ec848b2314f7
Deleted: 5d7c782ef4c42b3691c69487c1831d62f538d381712d5af1b0bb29f54e6bf48a
Deleted: 77ae33fec2978d8c1a0d3d8290cbb5a41b590821a0939b969b7cd2afba3f25c0
Deleted: 7e22773574252b7dcae7643117a0edf4006f92e8b4f183612ad04a2fa3935fd4
Deleted: e0eae209d840f0d9a28137cc8aea8000158e0c86fd39b93aa300e455e023a639
Build step 'Execute shell' marked build as failure

Mime
View raw message