mesos-builds mailing list archives

Site index · List index
Message view « Date » · « Thread »
Top « Date » · « Thread »
From Apache Jenkins Server <jenk...@builds.apache.org>
Subject Build failed in Jenkins: mesos-reviewbot #12183
Date Mon, 28 Mar 2016 21:38:13 GMT
See <https://builds.apache.org/job/mesos-reviewbot/12183/>

------------------------------------------
[...truncated 6135 lines...]
removing 'build/bdist.linux-x86_64/egg' (and everything under it)
running bdist_wheel
running build
installing to build/bdist.linux-x86_64/wheel
running install
running install_lib
Skipping installation of build/bdist.linux-x86_64/wheel/mesos/__init__.py (namespace package)
copying mesos/scheduler/__init__.py -> build/bdist.linux-x86_64/wheel/mesos/scheduler
copying mesos/scheduler/_scheduler.so -> build/bdist.linux-x86_64/wheel/mesos/scheduler
running install_egg_info
Copying src/mesos.scheduler.egg-info to build/bdist.linux-x86_64/wheel/mesos.scheduler-0.29.0.egg-info
Installing build/bdist.linux-x86_64/wheel/mesos.scheduler-0.29.0-nspkg.pth
running install_scripts
creating build/bdist.linux-x86_64/wheel/mesos.scheduler-0.29.0.dist-info/WHEEL
make  test-http-framework test-framework test-executor test-http-executor long-lived-framework long-lived-executor no-executor-framework docker-no-executor-framework balloon-framework balloon-executor load-generator-framework persistent-volume-framework setns-test-helper memory-test-helper active-user-test-helper mesos-tests examples/java/test-executor examples/java/test-exception-framework examples/java/test-framework examples/java/test-log examples/java/test-multiple-executors-framework examples/python/test_containerizer.py examples/python/test-containerizer examples/python/test_executor.py examples/python/test-executor examples/python/test_framework.py examples/python/test-framework \
	  tests/balloon_framework_test.sh tests/test_http_framework_test.sh tests/java_exception_test.sh tests/java_framework_test.sh tests/java_log_test.sh tests/no_executor_framework_test.sh tests/persistent_volume_framework_test.sh tests/python_framework_test.sh tests/test_framework_test.sh
make[4]: Entering directory `<https://builds.apache.org/job/mesos-reviewbot/ws/mesos-0.29.0/_build/src'>
g++ -DPACKAGE_NAME=\"mesos\" -DPACKAGE_TARNAME=\"mesos\" -DPACKAGE_VERSION=\"0.29.0\" -DPACKAGE_STRING=\"mesos\ 0.29.0\" -DPACKAGE_BUGREPORT=\"\" -DPACKAGE_URL=\"\" -DPACKAGE=\"mesos\" -DVERSION=\"0.29.0\" -DSTDC_HEADERS=1 -DHAVE_SYS_TYPES_H=1 -DHAVE_SYS_STAT_H=1 -DHAVE_STDLIB_H=1 -DHAVE_STRING_H=1 -DHAVE_MEMORY_H=1 -DHAVE_STRINGS_H=1 -DHAVE_INTTYPES_H=1 -DHAVE_STDINT_H=1 -DHAVE_UNISTD_H=1 -DHAVE_DLFCN_H=1 -DLT_OBJDIR=\".libs/\" -DHAVE_CXX11=1 -DHAVE_PTHREAD_PRIO_INHERIT=1 -DHAVE_PTHREAD=1 -DHAVE_LIBZ=1 -DHAVE_LIBCURL=1 -DHAVE_APR_POOLS_H=1 -DHAVE_LIBAPR_1=1 -DHAVE_SVN_VERSION_H=1 -DHAVE_LIBSVN_SUBR_1=1 -DHAVE_SVN_DELTA_H=1 -DHAVE_LIBSVN_DELTA_1=1 -DHAVE_LIBSASL2=1 -DMESOS_HAS_JAVA=1 -DHAVE_PYTHON=\"2.7\" -DMESOS_HAS_PYTHON=1 -I. -I../../src   -Wall -Werror -DLIBDIR=\"<https://builds.apache.org/job/mesos-reviewbot/ws/mesos-0.29.0/_inst/lib\"> -DPKGLIBEXECDIR=\"<https://builds.apache.org/job/mesos-reviewbot/ws/mesos-0.29.0/_inst/libexec/mesos\"> -DPKGDATADIR=\"<https://builds.apache.org/job/mesos-reviewbot/ws/mesos-0.29.0/_inst/share/mesos\"> -DPKGMODULEDIR=\"<https://builds.apache.org/job/mesos-reviewbot/ws/mesos-0.29.0/_inst/lib/mesos/modules\"> -I../../include -I../../3rdparty/libprocess/include -I../../3rdparty/libprocess/3rdparty/stout/include -I../include -I../include/mesos -isystem ../3rdparty/libprocess/3rdparty/boost-1.53.0 -I../3rdparty/libprocess/3rdparty/picojson-1.3.0 -DPICOJSON_USE_INT64 -D__STDC_FORMAT_MACROS -I../3rdparty/libprocess/3rdparty/protobuf-2.5.0/src -I../3rdparty/libprocess/3rdparty/glog-0.3.3/src -I../3rdparty/libprocess/3rdparty/glog-0.3.3/src -I../3rdparty/leveldb-1.4/include -I../3rdparty/zookeeper-3.4.5/src/c/include -I../3rdparty/zookeeper-3.4.5/src/c/generated -I../3rdparty/libprocess/3rdparty/protobuf-2.5.0/src -I/usr/include/subversion-1 -I/usr/include/apr-1 -I/usr/include/apr-1.0  -pthread -g1 -O0 -Wno-unused-local-typedefs -std=c++11 -MT examples/test_http_framework-test_http_framework.o -MD -MP -MF examples/.deps/test_http_framework-test_http_framework.Tpo -c -o examples/test_http_framework-test_http_framework.o `test -f 'examples/test_http_framework.cpp' || echo '../../src/'`examples/test_http_framework.cpp
g++ -DPACKAGE_NAME=\"mesos\" -DPACKAGE_TARNAME=\"mesos\" -DPACKAGE_VERSION=\"0.29.0\" -DPACKAGE_STRING=\"mesos\ 0.29.0\" -DPACKAGE_BUGREPORT=\"\" -DPACKAGE_URL=\"\" -DPACKAGE=\"mesos\" -DVERSION=\"0.29.0\" -DSTDC_HEADERS=1 -DHAVE_SYS_TYPES_H=1 -DHAVE_SYS_STAT_H=1 -DHAVE_STDLIB_H=1 -DHAVE_STRING_H=1 -DHAVE_MEMORY_H=1 -DHAVE_STRINGS_H=1 -DHAVE_INTTYPES_H=1 -DHAVE_STDINT_H=1 -DHAVE_UNISTD_H=1 -DHAVE_DLFCN_H=1 -DLT_OBJDIR=\".libs/\" -DHAVE_CXX11=1 -DHAVE_PTHREAD_PRIO_INHERIT=1 -DHAVE_PTHREAD=1 -DHAVE_LIBZ=1 -DHAVE_LIBCURL=1 -DHAVE_APR_POOLS_H=1 -DHAVE_LIBAPR_1=1 -DHAVE_SVN_VERSION_H=1 -DHAVE_LIBSVN_SUBR_1=1 -DHAVE_SVN_DELTA_H=1 -DHAVE_LIBSVN_DELTA_1=1 -DHAVE_LIBSASL2=1 -DMESOS_HAS_JAVA=1 -DHAVE_PYTHON=\"2.7\" -DMESOS_HAS_PYTHON=1 -I. -I../../src   -Wall -Werror -DLIBDIR=\"<https://builds.apache.org/job/mesos-reviewbot/ws/mesos-0.29.0/_inst/lib\"> -DPKGLIBEXECDIR=\"<https://builds.apache.org/job/mesos-reviewbot/ws/mesos-0.29.0/_inst/libexec/mesos\"> -DPKGDATADIR=\"<https://builds.apache.org/job/mesos-reviewbot/ws/mesos-0.29.0/_inst/share/mesos\"> -DPKGMODULEDIR=\"<https://builds.apache.org/job/mesos-reviewbot/ws/mesos-0.29.0/_inst/lib/mesos/modules\"> -I../../include -I../../3rdparty/libprocess/include -I../../3rdparty/libprocess/3rdparty/stout/include -I../include -I../include/mesos -isystem ../3rdparty/libprocess/3rdparty/boost-1.53.0 -I../3rdparty/libprocess/3rdparty/picojson-1.3.0 -DPICOJSON_USE_INT64 -D__STDC_FORMAT_MACROS -I../3rdparty/libprocess/3rdparty/protobuf-2.5.0/src -I../3rdparty/libprocess/3rdparty/glog-0.3.3/src -I../3rdparty/libprocess/3rdparty/glog-0.3.3/src -I../3rdparty/leveldb-1.4/include -I../3rdparty/zookeeper-3.4.5/src/c/include -I../3rdparty/zookeeper-3.4.5/src/c/generated -I../3rdparty/libprocess/3rdparty/protobuf-2.5.0/src -I/usr/include/subversion-1 -I/usr/include/apr-1 -I/usr/include/apr-1.0  -pthread -g1 -O0 -Wno-unused-local-typedefs -std=c++11 -MT examples/test_framework-test_framework.o -MD -MP -MF examples/.deps/test_framework-test_framework.Tpo -c -o examples/test_framework-test_framework.o `test -f 'examples/test_framework.cpp' || echo '../../src/'`examples/test_framework.cpp
g++ -DPACKAGE_NAME=\"mesos\" -DPACKAGE_TARNAME=\"mesos\" -DPACKAGE_VERSION=\"0.29.0\" -DPACKAGE_STRING=\"mesos\ 0.29.0\" -DPACKAGE_BUGREPORT=\"\" -DPACKAGE_URL=\"\" -DPACKAGE=\"mesos\" -DVERSION=\"0.29.0\" -DSTDC_HEADERS=1 -DHAVE_SYS_TYPES_H=1 -DHAVE_SYS_STAT_H=1 -DHAVE_STDLIB_H=1 -DHAVE_STRING_H=1 -DHAVE_MEMORY_H=1 -DHAVE_STRINGS_H=1 -DHAVE_INTTYPES_H=1 -DHAVE_STDINT_H=1 -DHAVE_UNISTD_H=1 -DHAVE_DLFCN_H=1 -DLT_OBJDIR=\".libs/\" -DHAVE_CXX11=1 -DHAVE_PTHREAD_PRIO_INHERIT=1 -DHAVE_PTHREAD=1 -DHAVE_LIBZ=1 -DHAVE_LIBCURL=1 -DHAVE_APR_POOLS_H=1 -DHAVE_LIBAPR_1=1 -DHAVE_SVN_VERSION_H=1 -DHAVE_LIBSVN_SUBR_1=1 -DHAVE_SVN_DELTA_H=1 -DHAVE_LIBSVN_DELTA_1=1 -DHAVE_LIBSASL2=1 -DMESOS_HAS_JAVA=1 -DHAVE_PYTHON=\"2.7\" -DMESOS_HAS_PYTHON=1 -I. -I../../src   -Wall -Werror -DLIBDIR=\"<https://builds.apache.org/job/mesos-reviewbot/ws/mesos-0.29.0/_inst/lib\"> -DPKGLIBEXECDIR=\"<https://builds.apache.org/job/mesos-reviewbot/ws/mesos-0.29.0/_inst/libexec/mesos\"> -DPKGDATADIR=\"<https://builds.apache.org/job/mesos-reviewbot/ws/mesos-0.29.0/_inst/share/mesos\"> -DPKGMODULEDIR=\"<https://builds.apache.org/job/mesos-reviewbot/ws/mesos-0.29.0/_inst/lib/mesos/modules\"> -I../../include -I../../3rdparty/libprocess/include -I../../3rdparty/libprocess/3rdparty/stout/include -I../include -I../include/mesos -isystem ../3rdparty/libprocess/3rdparty/boost-1.53.0 -I../3rdparty/libprocess/3rdparty/picojson-1.3.0 -DPICOJSON_USE_INT64 -D__STDC_FORMAT_MACROS -I../3rdparty/libprocess/3rdparty/protobuf-2.5.0/src -I../3rdparty/libprocess/3rdparty/glog-0.3.3/src -I../3rdparty/libprocess/3rdparty/glog-0.3.3/src -I../3rdparty/leveldb-1.4/include -I../3rdparty/zookeeper-3.4.5/src/c/include -I../3rdparty/zookeeper-3.4.5/src/c/generated -I../3rdparty/libprocess/3rdparty/protobuf-2.5.0/src -I/usr/include/subversion-1 -I/usr/include/apr-1 -I/usr/include/apr-1.0  -pthread -g1 -O0 -Wno-unused-local-typedefs -std=c++11 -MT examples/test_executor-test_executor.o -MD -MP -MF examples/.deps/test_executor-test_executor.Tpo -c -o examples/test_executor-test_executor.o `test -f 'examples/test_executor.cpp' || echo '../../src/'`examples/test_executor.cpp
g++ -DPACKAGE_NAME=\"mesos\" -DPACKAGE_TARNAME=\"mesos\" -DPACKAGE_VERSION=\"0.29.0\" -DPACKAGE_STRING=\"mesos\ 0.29.0\" -DPACKAGE_BUGREPORT=\"\" -DPACKAGE_URL=\"\" -DPACKAGE=\"mesos\" -DVERSION=\"0.29.0\" -DSTDC_HEADERS=1 -DHAVE_SYS_TYPES_H=1 -DHAVE_SYS_STAT_H=1 -DHAVE_STDLIB_H=1 -DHAVE_STRING_H=1 -DHAVE_MEMORY_H=1 -DHAVE_STRINGS_H=1 -DHAVE_INTTYPES_H=1 -DHAVE_STDINT_H=1 -DHAVE_UNISTD_H=1 -DHAVE_DLFCN_H=1 -DLT_OBJDIR=\".libs/\" -DHAVE_CXX11=1 -DHAVE_PTHREAD_PRIO_INHERIT=1 -DHAVE_PTHREAD=1 -DHAVE_LIBZ=1 -DHAVE_LIBCURL=1 -DHAVE_APR_POOLS_H=1 -DHAVE_LIBAPR_1=1 -DHAVE_SVN_VERSION_H=1 -DHAVE_LIBSVN_SUBR_1=1 -DHAVE_SVN_DELTA_H=1 -DHAVE_LIBSVN_DELTA_1=1 -DHAVE_LIBSASL2=1 -DMESOS_HAS_JAVA=1 -DHAVE_PYTHON=\"2.7\" -DMESOS_HAS_PYTHON=1 -I. -I../../src   -Wall -Werror -DLIBDIR=\"<https://builds.apache.org/job/mesos-reviewbot/ws/mesos-0.29.0/_inst/lib\"> -DPKGLIBEXECDIR=\"<https://builds.apache.org/job/mesos-reviewbot/ws/mesos-0.29.0/_inst/libexec/mesos\"> -DPKGDATADIR=\"<https://builds.apache.org/job/mesos-reviewbot/ws/mesos-0.29.0/_inst/share/mesos\"> -DPKGMODULEDIR=\"<https://builds.apache.org/job/mesos-reviewbot/ws/mesos-0.29.0/_inst/lib/mesos/modules\"> -I../../include -I../../3rdparty/libprocess/include -I../../3rdparty/libprocess/3rdparty/stout/include -I../include -I../include/mesos -isystem ../3rdparty/libprocess/3rdparty/boost-1.53.0 -I../3rdparty/libprocess/3rdparty/picojson-1.3.0 -DPICOJSON_USE_INT64 -D__STDC_FORMAT_MACROS -I../3rdparty/libprocess/3rdparty/protobuf-2.5.0/src -I../3rdparty/libprocess/3rdparty/glog-0.3.3/src -I../3rdparty/libprocess/3rdparty/glog-0.3.3/src -I../3rdparty/leveldb-1.4/include -I../3rdparty/zookeeper-3.4.5/src/c/include -I../3rdparty/zookeeper-3.4.5/src/c/generated -I../3rdparty/libprocess/3rdparty/protobuf-2.5.0/src -I/usr/include/subversion-1 -I/usr/include/apr-1 -I/usr/include/apr-1.0  -pthread -g1 -O0 -Wno-unused-local-typedefs -std=c++11 -MT examples/test_http_executor-test_http_executor.o -MD -MP -MF examples/.deps/test_http_executor-test_http_executor.Tpo -c -o examples/test_http_executor-test_http_executor.o `test -f 'examples/test_http_executor.cpp' || echo '../../src/'`examples/test_http_executor.cpp
g++ -DPACKAGE_NAME=\"mesos\" -DPACKAGE_TARNAME=\"mesos\" -DPACKAGE_VERSION=\"0.29.0\" -DPACKAGE_STRING=\"mesos\ 0.29.0\" -DPACKAGE_BUGREPORT=\"\" -DPACKAGE_URL=\"\" -DPACKAGE=\"mesos\" -DVERSION=\"0.29.0\" -DSTDC_HEADERS=1 -DHAVE_SYS_TYPES_H=1 -DHAVE_SYS_STAT_H=1 -DHAVE_STDLIB_H=1 -DHAVE_STRING_H=1 -DHAVE_MEMORY_H=1 -DHAVE_STRINGS_H=1 -DHAVE_INTTYPES_H=1 -DHAVE_STDINT_H=1 -DHAVE_UNISTD_H=1 -DHAVE_DLFCN_H=1 -DLT_OBJDIR=\".libs/\" -DHAVE_CXX11=1 -DHAVE_PTHREAD_PRIO_INHERIT=1 -DHAVE_PTHREAD=1 -DHAVE_LIBZ=1 -DHAVE_LIBCURL=1 -DHAVE_APR_POOLS_H=1 -DHAVE_LIBAPR_1=1 -DHAVE_SVN_VERSION_H=1 -DHAVE_LIBSVN_SUBR_1=1 -DHAVE_SVN_DELTA_H=1 -DHAVE_LIBSVN_DELTA_1=1 -DHAVE_LIBSASL2=1 -DMESOS_HAS_JAVA=1 -DHAVE_PYTHON=\"2.7\" -DMESOS_HAS_PYTHON=1 -I. -I../../src   -Wall -Werror -DLIBDIR=\"<https://builds.apache.org/job/mesos-reviewbot/ws/mesos-0.29.0/_inst/lib\"> -DPKGLIBEXECDIR=\"<https://builds.apache.org/job/mesos-reviewbot/ws/mesos-0.29.0/_inst/libexec/mesos\"> -DPKGDATADIR=\"<https://builds.apache.org/job/mesos-reviewbot/ws/mesos-0.29.0/_inst/share/mesos\"> -DPKGMODULEDIR=\"<https://builds.apache.org/job/mesos-reviewbot/ws/mesos-0.29.0/_inst/lib/mesos/modules\"> -I../../include -I../../3rdparty/libprocess/include -I../../3rdparty/libprocess/3rdparty/stout/include -I../include -I../include/mesos -isystem ../3rdparty/libprocess/3rdparty/boost-1.53.0 -I../3rdparty/libprocess/3rdparty/picojson-1.3.0 -DPICOJSON_USE_INT64 -D__STDC_FORMAT_MACROS -I../3rdparty/libprocess/3rdparty/protobuf-2.5.0/src -I../3rdparty/libprocess/3rdparty/glog-0.3.3/src -I../3rdparty/libprocess/3rdparty/glog-0.3.3/src -I../3rdparty/leveldb-1.4/include -I../3rdparty/zookeeper-3.4.5/src/c/include -I../3rdparty/zookeeper-3.4.5/src/c/generated -I../3rdparty/libprocess/3rdparty/protobuf-2.5.0/src -I/usr/include/subversion-1 -I/usr/include/apr-1 -I/usr/include/apr-1.0  -pthread -g1 -O0 -Wno-unused-local-typedefs -std=c++11 -MT examples/long_lived_framework-long_lived_framework.o -MD -MP -MF examples/.deps/long_lived_framework-long_lived_framework.Tpo -c -o examples/long_lived_framework-long_lived_framework.o `test -f 'examples/long_lived_framework.cpp' || echo '../../src/'`examples/long_lived_framework.cpp
g++ -DPACKAGE_NAME=\"mesos\" -DPACKAGE_TARNAME=\"mesos\" -DPACKAGE_VERSION=\"0.29.0\" -DPACKAGE_STRING=\"mesos\ 0.29.0\" -DPACKAGE_BUGREPORT=\"\" -DPACKAGE_URL=\"\" -DPACKAGE=\"mesos\" -DVERSION=\"0.29.0\" -DSTDC_HEADERS=1 -DHAVE_SYS_TYPES_H=1 -DHAVE_SYS_STAT_H=1 -DHAVE_STDLIB_H=1 -DHAVE_STRING_H=1 -DHAVE_MEMORY_H=1 -DHAVE_STRINGS_H=1 -DHAVE_INTTYPES_H=1 -DHAVE_STDINT_H=1 -DHAVE_UNISTD_H=1 -DHAVE_DLFCN_H=1 -DLT_OBJDIR=\".libs/\" -DHAVE_CXX11=1 -DHAVE_PTHREAD_PRIO_INHERIT=1 -DHAVE_PTHREAD=1 -DHAVE_LIBZ=1 -DHAVE_LIBCURL=1 -DHAVE_APR_POOLS_H=1 -DHAVE_LIBAPR_1=1 -DHAVE_SVN_VERSION_H=1 -DHAVE_LIBSVN_SUBR_1=1 -DHAVE_SVN_DELTA_H=1 -DHAVE_LIBSVN_DELTA_1=1 -DHAVE_LIBSASL2=1 -DMESOS_HAS_JAVA=1 -DHAVE_PYTHON=\"2.7\" -DMESOS_HAS_PYTHON=1 -I. -I../../src   -Wall -Werror -DLIBDIR=\"<https://builds.apache.org/job/mesos-reviewbot/ws/mesos-0.29.0/_inst/lib\"> -DPKGLIBEXECDIR=\"<https://builds.apache.org/job/mesos-reviewbot/ws/mesos-0.29.0/_inst/libexec/mesos\"> -DPKGDATADIR=\"<https://builds.apache.org/job/mesos-reviewbot/ws/mesos-0.29.0/_inst/share/mesos\"> -DPKGMODULEDIR=\"<https://builds.apache.org/job/mesos-reviewbot/ws/mesos-0.29.0/_inst/lib/mesos/modules\"> -I../../include -I../../3rdparty/libprocess/include -I../../3rdparty/libprocess/3rdparty/stout/include -I../include -I../include/mesos -isystem ../3rdparty/libprocess/3rdparty/boost-1.53.0 -I../3rdparty/libprocess/3rdparty/picojson-1.3.0 -DPICOJSON_USE_INT64 -D__STDC_FORMAT_MACROS -I../3rdparty/libprocess/3rdparty/protobuf-2.5.0/src -I../3rdparty/libprocess/3rdparty/glog-0.3.3/src -I../3rdparty/libprocess/3rdparty/glog-0.3.3/src -I../3rdparty/leveldb-1.4/include -I../3rdparty/zookeeper-3.4.5/src/c/include -I../3rdparty/zookeeper-3.4.5/src/c/generated -I../3rdparty/libprocess/3rdparty/protobuf-2.5.0/src -I/usr/include/subversion-1 -I/usr/include/apr-1 -I/usr/include/apr-1.0  -pthread -g1 -O0 -Wno-unused-local-typedefs -std=c++11 -MT examples/long_lived_executor-long_lived_executor.o -MD -MP -MF examples/.deps/long_lived_executor-long_lived_executor.Tpo -c -o examples/long_lived_executor-long_lived_executor.o `test -f 'examples/long_lived_executor.cpp' || echo '../../src/'`examples/long_lived_executor.cpp
g++ -DPACKAGE_NAME=\"mesos\" -DPACKAGE_TARNAME=\"mesos\" -DPACKAGE_VERSION=\"0.29.0\" -DPACKAGE_STRING=\"mesos\ 0.29.0\" -DPACKAGE_BUGREPORT=\"\" -DPACKAGE_URL=\"\" -DPACKAGE=\"mesos\" -DVERSION=\"0.29.0\" -DSTDC_HEADERS=1 -DHAVE_SYS_TYPES_H=1 -DHAVE_SYS_STAT_H=1 -DHAVE_STDLIB_H=1 -DHAVE_STRING_H=1 -DHAVE_MEMORY_H=1 -DHAVE_STRINGS_H=1 -DHAVE_INTTYPES_H=1 -DHAVE_STDINT_H=1 -DHAVE_UNISTD_H=1 -DHAVE_DLFCN_H=1 -DLT_OBJDIR=\".libs/\" -DHAVE_CXX11=1 -DHAVE_PTHREAD_PRIO_INHERIT=1 -DHAVE_PTHREAD=1 -DHAVE_LIBZ=1 -DHAVE_LIBCURL=1 -DHAVE_APR_POOLS_H=1 -DHAVE_LIBAPR_1=1 -DHAVE_SVN_VERSION_H=1 -DHAVE_LIBSVN_SUBR_1=1 -DHAVE_SVN_DELTA_H=1 -DHAVE_LIBSVN_DELTA_1=1 -DHAVE_LIBSASL2=1 -DMESOS_HAS_JAVA=1 -DHAVE_PYTHON=\"2.7\" -DMESOS_HAS_PYTHON=1 -I. -I../../src   -Wall -Werror -DLIBDIR=\"<https://builds.apache.org/job/mesos-reviewbot/ws/mesos-0.29.0/_inst/lib\"> -DPKGLIBEXECDIR=\"<https://builds.apache.org/job/mesos-reviewbot/ws/mesos-0.29.0/_inst/libexec/mesos\"> -DPKGDATADIR=\"<https://builds.apache.org/job/mesos-reviewbot/ws/mesos-0.29.0/_inst/share/mesos\"> -DPKGMODULEDIR=\"<https://builds.apache.org/job/mesos-reviewbot/ws/mesos-0.29.0/_inst/lib/mesos/modules\"> -I../../include -I../../3rdparty/libprocess/include -I../../3rdparty/libprocess/3rdparty/stout/include -I../include -I../include/mesos -isystem ../3rdparty/libprocess/3rdparty/boost-1.53.0 -I../3rdparty/libprocess/3rdparty/picojson-1.3.0 -DPICOJSON_USE_INT64 -D__STDC_FORMAT_MACROS -I../3rdparty/libprocess/3rdparty/protobuf-2.5.0/src -I../3rdparty/libprocess/3rdparty/glog-0.3.3/src -I../3rdparty/libprocess/3rdparty/glog-0.3.3/src -I../3rdparty/leveldb-1.4/include -I../3rdparty/zookeeper-3.4.5/src/c/include -I../3rdparty/zookeeper-3.4.5/src/c/generated -I../3rdparty/libprocess/3rdparty/protobuf-2.5.0/src -I/usr/include/subversion-1 -I/usr/include/apr-1 -I/usr/include/apr-1.0  -pthread -g1 -O0 -Wno-unused-local-typedefs -std=c++11 -MT examples/no_executor_framework-no_executor_framework.o -MD -MP -MF examples/.deps/no_executor_framework-no_executor_framework.Tpo -c -o examples/no_executor_framework-no_executor_framework.o `test -f 'examples/no_executor_framework.cpp' || echo '../../src/'`examples/no_executor_framework.cpp
g++ -DPACKAGE_NAME=\"mesos\" -DPACKAGE_TARNAME=\"mesos\" -DPACKAGE_VERSION=\"0.29.0\" -DPACKAGE_STRING=\"mesos\ 0.29.0\" -DPACKAGE_BUGREPORT=\"\" -DPACKAGE_URL=\"\" -DPACKAGE=\"mesos\" -DVERSION=\"0.29.0\" -DSTDC_HEADERS=1 -DHAVE_SYS_TYPES_H=1 -DHAVE_SYS_STAT_H=1 -DHAVE_STDLIB_H=1 -DHAVE_STRING_H=1 -DHAVE_MEMORY_H=1 -DHAVE_STRINGS_H=1 -DHAVE_INTTYPES_H=1 -DHAVE_STDINT_H=1 -DHAVE_UNISTD_H=1 -DHAVE_DLFCN_H=1 -DLT_OBJDIR=\".libs/\" -DHAVE_CXX11=1 -DHAVE_PTHREAD_PRIO_INHERIT=1 -DHAVE_PTHREAD=1 -DHAVE_LIBZ=1 -DHAVE_LIBCURL=1 -DHAVE_APR_POOLS_H=1 -DHAVE_LIBAPR_1=1 -DHAVE_SVN_VERSION_H=1 -DHAVE_LIBSVN_SUBR_1=1 -DHAVE_SVN_DELTA_H=1 -DHAVE_LIBSVN_DELTA_1=1 -DHAVE_LIBSASL2=1 -DMESOS_HAS_JAVA=1 -DHAVE_PYTHON=\"2.7\" -DMESOS_HAS_PYTHON=1 -I. -I../../src   -Wall -Werror -DLIBDIR=\"<https://builds.apache.org/job/mesos-reviewbot/ws/mesos-0.29.0/_inst/lib\"> -DPKGLIBEXECDIR=\"<https://builds.apache.org/job/mesos-reviewbot/ws/mesos-0.29.0/_inst/libexec/mesos\"> -DPKGDATADIR=\"<https://builds.apache.org/job/mesos-reviewbot/ws/mesos-0.29.0/_inst/share/mesos\"> -DPKGMODULEDIR=\"<https://builds.apache.org/job/mesos-reviewbot/ws/mesos-0.29.0/_inst/lib/mesos/modules\"> -I../../include -I../../3rdparty/libprocess/include -I../../3rdparty/libprocess/3rdparty/stout/include -I../include -I../include/mesos -isystem ../3rdparty/libprocess/3rdparty/boost-1.53.0 -I../3rdparty/libprocess/3rdparty/picojson-1.3.0 -DPICOJSON_USE_INT64 -D__STDC_FORMAT_MACROS -I../3rdparty/libprocess/3rdparty/protobuf-2.5.0/src -I../3rdparty/libprocess/3rdparty/glog-0.3.3/src -I../3rdparty/libprocess/3rdparty/glog-0.3.3/src -I../3rdparty/leveldb-1.4/include -I../3rdparty/zookeeper-3.4.5/src/c/include -I../3rdparty/zookeeper-3.4.5/src/c/generated -I../3rdparty/libprocess/3rdparty/protobuf-2.5.0/src -I/usr/include/subversion-1 -I/usr/include/apr-1 -I/usr/include/apr-1.0  -pthread -g1 -O0 -Wno-unused-local-typedefs -std=c++11 -MT examples/docker_no_executor_framework-docker_no_executor_framework.o -MD -MP -MF examples/.deps/docker_no_executor_framework-docker_no_executor_framework.Tpo -c -o examples/docker_no_executor_framework-docker_no_executor_framework.o `test -f 'examples/docker_no_executor_framework.cpp' || echo '../../src/'`examples/docker_no_executor_framework.cpp
g++ -DPACKAGE_NAME=\"mesos\" -DPACKAGE_TARNAME=\"mesos\" -DPACKAGE_VERSION=\"0.29.0\" -DPACKAGE_STRING=\"mesos\ 0.29.0\" -DPACKAGE_BUGREPORT=\"\" -DPACKAGE_URL=\"\" -DPACKAGE=\"mesos\" -DVERSION=\"0.29.0\" -DSTDC_HEADERS=1 -DHAVE_SYS_TYPES_H=1 -DHAVE_SYS_STAT_H=1 -DHAVE_STDLIB_H=1 -DHAVE_STRING_H=1 -DHAVE_MEMORY_H=1 -DHAVE_STRINGS_H=1 -DHAVE_INTTYPES_H=1 -DHAVE_STDINT_H=1 -DHAVE_UNISTD_H=1 -DHAVE_DLFCN_H=1 -DLT_OBJDIR=\".libs/\" -DHAVE_CXX11=1 -DHAVE_PTHREAD_PRIO_INHERIT=1 -DHAVE_PTHREAD=1 -DHAVE_LIBZ=1 -DHAVE_LIBCURL=1 -DHAVE_APR_POOLS_H=1 -DHAVE_LIBAPR_1=1 -DHAVE_SVN_VERSION_H=1 -DHAVE_LIBSVN_SUBR_1=1 -DHAVE_SVN_DELTA_H=1 -DHAVE_LIBSVN_DELTA_1=1 -DHAVE_LIBSASL2=1 -DMESOS_HAS_JAVA=1 -DHAVE_PYTHON=\"2.7\" -DMESOS_HAS_PYTHON=1 -I. -I../../src   -Wall -Werror -DLIBDIR=\"<https://builds.apache.org/job/mesos-reviewbot/ws/mesos-0.29.0/_inst/lib\"> -DPKGLIBEXECDIR=\"<https://builds.apache.org/job/mesos-reviewbot/ws/mesos-0.29.0/_inst/libexec/mesos\"> -DPKGDATADIR=\"<https://builds.apache.org/job/mesos-reviewbot/ws/mesos-0.29.0/_inst/share/mesos\"> -DPKGMODULEDIR=\"<https://builds.apache.org/job/mesos-reviewbot/ws/mesos-0.29.0/_inst/lib/mesos/modules\"> -I../../include -I../../3rdparty/libprocess/include -I../../3rdparty/libprocess/3rdparty/stout/include -I../include -I../include/mesos -isystem ../3rdparty/libprocess/3rdparty/boost-1.53.0 -I../3rdparty/libprocess/3rdparty/picojson-1.3.0 -DPICOJSON_USE_INT64 -D__STDC_FORMAT_MACROS -I../3rdparty/libprocess/3rdparty/protobuf-2.5.0/src -I../3rdparty/libprocess/3rdparty/glog-0.3.3/src -I../3rdparty/libprocess/3rdparty/glog-0.3.3/src -I../3rdparty/leveldb-1.4/include -I../3rdparty/zookeeper-3.4.5/src/c/include -I../3rdparty/zookeeper-3.4.5/src/c/generated -I../3rdparty/libprocess/3rdparty/protobuf-2.5.0/src -I/usr/include/subversion-1 -I/usr/include/apr-1 -I/usr/include/apr-1.0  -pthread -g1 -O0 -Wno-unused-local-typedefs -std=c++11 -MT examples/balloon_framework-balloon_framework.o -MD -MP -MF examples/.deps/balloon_framework-balloon_framework.Tpo -c -o examples/balloon_framework-balloon_framework.o `test -f 'examples/balloon_framework.cpp' || echo '../../src/'`examples/balloon_framework.cpp
g++ -DPACKAGE_NAME=\"mesos\" -DPACKAGE_TARNAME=\"mesos\" -DPACKAGE_VERSION=\"0.29.0\" -DPACKAGE_STRING=\"mesos\ 0.29.0\" -DPACKAGE_BUGREPORT=\"\" -DPACKAGE_URL=\"\" -DPACKAGE=\"mesos\" -DVERSION=\"0.29.0\" -DSTDC_HEADERS=1 -DHAVE_SYS_TYPES_H=1 -DHAVE_SYS_STAT_H=1 -DHAVE_STDLIB_H=1 -DHAVE_STRING_H=1 -DHAVE_MEMORY_H=1 -DHAVE_STRINGS_H=1 -DHAVE_INTTYPES_H=1 -DHAVE_STDINT_H=1 -DHAVE_UNISTD_H=1 -DHAVE_DLFCN_H=1 -DLT_OBJDIR=\".libs/\" -DHAVE_CXX11=1 -DHAVE_PTHREAD_PRIO_INHERIT=1 -DHAVE_PTHREAD=1 -DHAVE_LIBZ=1 -DHAVE_LIBCURL=1 -DHAVE_APR_POOLS_H=1 -DHAVE_LIBAPR_1=1 -DHAVE_SVN_VERSION_H=1 -DHAVE_LIBSVN_SUBR_1=1 -DHAVE_SVN_DELTA_H=1 -DHAVE_LIBSVN_DELTA_1=1 -DHAVE_LIBSASL2=1 -DMESOS_HAS_JAVA=1 -DHAVE_PYTHON=\"2.7\" -DMESOS_HAS_PYTHON=1 -I. -I../../src   -Wall -Werror -DLIBDIR=\"<https://builds.apache.org/job/mesos-reviewbot/ws/mesos-0.29.0/_inst/lib\"> -DPKGLIBEXECDIR=\"<https://builds.apache.org/job/mesos-reviewbot/ws/mesos-0.29.0/_inst/libexec/mesos\"> -DPKGDATADIR=\"<https://builds.apache.org/job/mesos-reviewbot/ws/mesos-0.29.0/_inst/share/mesos\"> -DPKGMODULEDIR=\"<https://builds.apache.org/job/mesos-reviewbot/ws/mesos-0.29.0/_inst/lib/mesos/modules\"> -I../../include -I../../3rdparty/libprocess/include -I../../3rdparty/libprocess/3rdparty/stout/include -I../include -I../include/mesos -isystem ../3rdparty/libprocess/3rdparty/boost-1.53.0 -I../3rdparty/libprocess/3rdparty/picojson-1.3.0 -DPICOJSON_USE_INT64 -D__STDC_FORMAT_MACROS -I../3rdparty/libprocess/3rdparty/protobuf-2.5.0/src -I../3rdparty/libprocess/3rdparty/glog-0.3.3/src -I../3rdparty/libprocess/3rdparty/glog-0.3.3/src -I../3rdparty/leveldb-1.4/include -I../3rdparty/zookeeper-3.4.5/src/c/include -I../3rdparty/zookeeper-3.4.5/src/c/generated -I../3rdparty/libprocess/3rdparty/protobuf-2.5.0/src -I/usr/include/subversion-1 -I/usr/include/apr-1 -I/usr/include/apr-1.0  -pthread -g1 -O0 -Wno-unused-local-typedefs -std=c++11 -MT examples/balloon_executor-balloon_executor.o -MD -MP -MF examples/.deps/balloon_executor-balloon_executor.Tpo -c -o examples/balloon_executor-balloon_executor.o `test -f 'examples/balloon_executor.cpp' || echo '../../src/'`examples/balloon_executor.cpp
mv -f examples/.deps/balloon_executor-balloon_executor.Tpo examples/.deps/balloon_executor-balloon_executor.Po
g++ -DPACKAGE_NAME=\"mesos\" -DPACKAGE_TARNAME=\"mesos\" -DPACKAGE_VERSION=\"0.29.0\" -DPACKAGE_STRING=\"mesos\ 0.29.0\" -DPACKAGE_BUGREPORT=\"\" -DPACKAGE_URL=\"\" -DPACKAGE=\"mesos\" -DVERSION=\"0.29.0\" -DSTDC_HEADERS=1 -DHAVE_SYS_TYPES_H=1 -DHAVE_SYS_STAT_H=1 -DHAVE_STDLIB_H=1 -DHAVE_STRING_H=1 -DHAVE_MEMORY_H=1 -DHAVE_STRINGS_H=1 -DHAVE_INTTYPES_H=1 -DHAVE_STDINT_H=1 -DHAVE_UNISTD_H=1 -DHAVE_DLFCN_H=1 -DLT_OBJDIR=\".libs/\" -DHAVE_CXX11=1 -DHAVE_PTHREAD_PRIO_INHERIT=1 -DHAVE_PTHREAD=1 -DHAVE_LIBZ=1 -DHAVE_LIBCURL=1 -DHAVE_APR_POOLS_H=1 -DHAVE_LIBAPR_1=1 -DHAVE_SVN_VERSION_H=1 -DHAVE_LIBSVN_SUBR_1=1 -DHAVE_SVN_DELTA_H=1 -DHAVE_LIBSVN_DELTA_1=1 -DHAVE_LIBSASL2=1 -DMESOS_HAS_JAVA=1 -DHAVE_PYTHON=\"2.7\" -DMESOS_HAS_PYTHON=1 -I. -I../../src   -Wall -Werror -DLIBDIR=\"<https://builds.apache.org/job/mesos-reviewbot/ws/mesos-0.29.0/_inst/lib\"> -DPKGLIBEXECDIR=\"<https://builds.apache.org/job/mesos-reviewbot/ws/mesos-0.29.0/_inst/libexec/mesos\"> -DPKGDATADIR=\"<https://builds.apache.org/job/mesos-reviewbot/ws/mesos-0.29.0/_inst/share/mesos\"> -DPKGMODULEDIR=\"<https://builds.apache.org/job/mesos-reviewbot/ws/mesos-0.29.0/_inst/lib/mesos/modules\"> -I../../include -I../../3rdparty/libprocess/include -I../../3rdparty/libprocess/3rdparty/stout/include -I../include -I../include/mesos -isystem ../3rdparty/libprocess/3rdparty/boost-1.53.0 -I../3rdparty/libprocess/3rdparty/picojson-1.3.0 -DPICOJSON_USE_INT64 -D__STDC_FORMAT_MACROS -I../3rdparty/libprocess/3rdparty/protobuf-2.5.0/src -I../3rdparty/libprocess/3rdparty/glog-0.3.3/src -I../3rdparty/libprocess/3rdparty/glog-0.3.3/src -I../3rdparty/leveldb-1.4/include -I../3rdparty/zookeeper-3.4.5/src/c/include -I../3rdparty/zookeeper-3.4.5/src/c/generated -I../3rdparty/libprocess/3rdparty/protobuf-2.5.0/src -I/usr/include/subversion-1 -I/usr/include/apr-1 -I/usr/include/apr-1.0  -pthread -g1 -O0 -Wno-unused-local-typedefs -std=c++11 -MT examples/load_generator_framework-load_generator_framework.o -MD -MP -MF examples/.deps/load_generator_framework-load_generator_framework.Tpo -c -o examples/load_generator_framework-load_generator_framework.o `test -f 'examples/load_generator_framework.cpp' || echo '../../src/'`examples/load_generator_framework.cpp
mv -f examples/.deps/docker_no_executor_framework-docker_no_executor_framework.Tpo examples/.deps/docker_no_executor_framework-docker_no_executor_framework.Po
g++ -DPACKAGE_NAME=\"mesos\" -DPACKAGE_TARNAME=\"mesos\" -DPACKAGE_VERSION=\"0.29.0\" -DPACKAGE_STRING=\"mesos\ 0.29.0\" -DPACKAGE_BUGREPORT=\"\" -DPACKAGE_URL=\"\" -DPACKAGE=\"mesos\" -DVERSION=\"0.29.0\" -DSTDC_HEADERS=1 -DHAVE_SYS_TYPES_H=1 -DHAVE_SYS_STAT_H=1 -DHAVE_STDLIB_H=1 -DHAVE_STRING_H=1 -DHAVE_MEMORY_H=1 -DHAVE_STRINGS_H=1 -DHAVE_INTTYPES_H=1 -DHAVE_STDINT_H=1 -DHAVE_UNISTD_H=1 -DHAVE_DLFCN_H=1 -DLT_OBJDIR=\".libs/\" -DHAVE_CXX11=1 -DHAVE_PTHREAD_PRIO_INHERIT=1 -DHAVE_PTHREAD=1 -DHAVE_LIBZ=1 -DHAVE_LIBCURL=1 -DHAVE_APR_POOLS_H=1 -DHAVE_LIBAPR_1=1 -DHAVE_SVN_VERSION_H=1 -DHAVE_LIBSVN_SUBR_1=1 -DHAVE_SVN_DELTA_H=1 -DHAVE_LIBSVN_DELTA_1=1 -DHAVE_LIBSASL2=1 -DMESOS_HAS_JAVA=1 -DHAVE_PYTHON=\"2.7\" -DMESOS_HAS_PYTHON=1 -I. -I../../src   -Wall -Werror -DLIBDIR=\"<https://builds.apache.org/job/mesos-reviewbot/ws/mesos-0.29.0/_inst/lib\"> -DPKGLIBEXECDIR=\"<https://builds.apache.org/job/mesos-reviewbot/ws/mesos-0.29.0/_inst/libexec/mesos\"> -DPKGDATADIR=\"<https://builds.apache.org/job/mesos-reviewbot/ws/mesos-0.29.0/_inst/share/mesos\"> -DPKGMODULEDIR=\"<https://builds.apache.org/job/mesos-reviewbot/ws/mesos-0.29.0/_inst/lib/mesos/modules\"> -I../../include -I../../3rdparty/libprocess/include -I../../3rdparty/libprocess/3rdparty/stout/include -I../include -I../include/mesos -isystem ../3rdparty/libprocess/3rdparty/boost-1.53.0 -I../3rdparty/libprocess/3rdparty/picojson-1.3.0 -DPICOJSON_USE_INT64 -D__STDC_FORMAT_MACROS -I../3rdparty/libprocess/3rdparty/protobuf-2.5.0/src -I../3rdparty/libprocess/3rdparty/glog-0.3.3/src -I../3rdparty/libprocess/3rdparty/glog-0.3.3/src -I../3rdparty/leveldb-1.4/include -I../3rdparty/zookeeper-3.4.5/src/c/include -I../3rdparty/zookeeper-3.4.5/src/c/generated -I../3rdparty/libprocess/3rdparty/protobuf-2.5.0/src -I/usr/include/subversion-1 -I/usr/include/apr-1 -I/usr/include/apr-1.0  -pthread -g1 -O0 -Wno-unused-local-typedefs -std=c++11 -MT examples/persistent_volume_framework-persistent_volume_framework.o -MD -MP -MF examples/.deps/persistent_volume_framework-persistent_volume_framework.Tpo -c -o examples/persistent_volume_framework-persistent_volume_framework.o `test -f 'examples/persistent_volume_framework.cpp' || echo '../../src/'`examples/persistent_volume_framework.cpp
mv -f examples/.deps/test_executor-test_executor.Tpo examples/.deps/test_executor-test_executor.Po
g++ -DPACKAGE_NAME=\"mesos\" -DPACKAGE_TARNAME=\"mesos\" -DPACKAGE_VERSION=\"0.29.0\" -DPACKAGE_STRING=\"mesos\ 0.29.0\" -DPACKAGE_BUGREPORT=\"\" -DPACKAGE_URL=\"\" -DPACKAGE=\"mesos\" -DVERSION=\"0.29.0\" -DSTDC_HEADERS=1 -DHAVE_SYS_TYPES_H=1 -DHAVE_SYS_STAT_H=1 -DHAVE_STDLIB_H=1 -DHAVE_STRING_H=1 -DHAVE_MEMORY_H=1 -DHAVE_STRINGS_H=1 -DHAVE_INTTYPES_H=1 -DHAVE_STDINT_H=1 -DHAVE_UNISTD_H=1 -DHAVE_DLFCN_H=1 -DLT_OBJDIR=\".libs/\" -DHAVE_CXX11=1 -DHAVE_PTHREAD_PRIO_INHERIT=1 -DHAVE_PTHREAD=1 -DHAVE_LIBZ=1 -DHAVE_LIBCURL=1 -DHAVE_APR_POOLS_H=1 -DHAVE_LIBAPR_1=1 -DHAVE_SVN_VERSION_H=1 -DHAVE_LIBSVN_SUBR_1=1 -DHAVE_SVN_DELTA_H=1 -DHAVE_LIBSVN_DELTA_1=1 -DHAVE_LIBSASL2=1 -DMESOS_HAS_JAVA=1 -DHAVE_PYTHON=\"2.7\" -DMESOS_HAS_PYTHON=1 -I. -I../../src   -Wall -Werror -DLIBDIR=\"<https://builds.apache.org/job/mesos-reviewbot/ws/mesos-0.29.0/_inst/lib\"> -DPKGLIBEXECDIR=\"<https://builds.apache.org/job/mesos-reviewbot/ws/mesos-0.29.0/_inst/libexec/mesos\"> -DPKGDATADIR=\"<https://builds.apache.org/job/mesos-reviewbot/ws/mesos-0.29.0/_inst/share/mesos\"> -DPKGMODULEDIR=\"<https://builds.apache.org/job/mesos-reviewbot/ws/mesos-0.29.0/_inst/lib/mesos/modules\"> -I../../include -I../../3rdparty/libprocess/include -I../../3rdparty/libprocess/3rdparty/stout/include -I../include -I../include/mesos -isystem ../3rdparty/libprocess/3rdparty/boost-1.53.0 -I../3rdparty/libprocess/3rdparty/picojson-1.3.0 -DPICOJSON_USE_INT64 -D__STDC_FORMAT_MACROS -I../3rdparty/libprocess/3rdparty/protobuf-2.5.0/src -I../3rdparty/libprocess/3rdparty/glog-0.3.3/src -I../3rdparty/libprocess/3rdparty/glog-0.3.3/src -I../3rdparty/leveldb-1.4/include -I../3rdparty/zookeeper-3.4.5/src/c/include -I../3rdparty/zookeeper-3.4.5/src/c/generated -I../3rdparty/libprocess/3rdparty/protobuf-2.5.0/src -DSOURCE_DIR=\"<https://builds.apache.org/job/mesos-reviewbot/ws/mesos-0.29.0/_build/..\"> -DBUILD_DIR=\"<https://builds.apache.org/job/mesos-reviewbot/ws/mesos-0.29.0/_build\"> -I../3rdparty/libprocess/3rdparty/gmock-1.7.0/gtest/include -I../3rdparty/libprocess/3rdparty/gmock-1.7.0/include -DTESTLIBEXECDIR=\"<https://builds.apache.org/job/mesos-reviewbot/ws/mesos-0.29.0/_inst/libexec/mesos/tests\"> -DSBINDIR=\"<https://builds.apache.org/job/mesos-reviewbot/ws/mesos-0.29.0/_inst/sbin\"> -I/home/jenkins/tools/java/jdk1.6.0_20-64/include -I/home/jenkins/tools/java/jdk1.6.0_20-64/include/linux -DZOOKEEPER_VERSION=\"3.4.5\" -I/usr/include/subversion-1 -I/usr/include/apr-1 -I/usr/include/apr-1.0  -pthread -g1 -O0 -Wno-unused-local-typedefs -std=c++11 -MT tests/containerizer/memory_test_helper-memory_test_helper_main.o -MD -MP -MF tests/containerizer/.deps/memory_test_helper-memory_test_helper_main.Tpo -c -o tests/containerizer/memory_test_helper-memory_test_helper_main.o `test -f 'tests/containerizer/memory_test_helper_main.cpp' || echo '../../src/'`tests/containerizer/memory_test_helper_main.cpp
mv -f examples/.deps/long_lived_executor-long_lived_executor.Tpo examples/.deps/long_lived_executor-long_lived_executor.Po
g++ -DPACKAGE_NAME=\"mesos\" -DPACKAGE_TARNAME=\"mesos\" -DPACKAGE_VERSION=\"0.29.0\" -DPACKAGE_STRING=\"mesos\ 0.29.0\" -DPACKAGE_BUGREPORT=\"\" -DPACKAGE_URL=\"\" -DPACKAGE=\"mesos\" -DVERSION=\"0.29.0\" -DSTDC_HEADERS=1 -DHAVE_SYS_TYPES_H=1 -DHAVE_SYS_STAT_H=1 -DHAVE_STDLIB_H=1 -DHAVE_STRING_H=1 -DHAVE_MEMORY_H=1 -DHAVE_STRINGS_H=1 -DHAVE_INTTYPES_H=1 -DHAVE_STDINT_H=1 -DHAVE_UNISTD_H=1 -DHAVE_DLFCN_H=1 -DLT_OBJDIR=\".libs/\" -DHAVE_CXX11=1 -DHAVE_PTHREAD_PRIO_INHERIT=1 -DHAVE_PTHREAD=1 -DHAVE_LIBZ=1 -DHAVE_LIBCURL=1 -DHAVE_APR_POOLS_H=1 -DHAVE_LIBAPR_1=1 -DHAVE_SVN_VERSION_H=1 -DHAVE_LIBSVN_SUBR_1=1 -DHAVE_SVN_DELTA_H=1 -DHAVE_LIBSVN_DELTA_1=1 -DHAVE_LIBSASL2=1 -DMESOS_HAS_JAVA=1 -DHAVE_PYTHON=\"2.7\" -DMESOS_HAS_PYTHON=1 -I. -I../../src   -Wall -Werror -DLIBDIR=\"<https://builds.apache.org/job/mesos-reviewbot/ws/mesos-0.29.0/_inst/lib\"> -DPKGLIBEXECDIR=\"<https://builds.apache.org/job/mesos-reviewbot/ws/mesos-0.29.0/_inst/libexec/mesos\"> -DPKGDATADIR=\"<https://builds.apache.org/job/mesos-reviewbot/ws/mesos-0.29.0/_inst/share/mesos\"> -DPKGMODULEDIR=\"<https://builds.apache.org/job/mesos-reviewbot/ws/mesos-0.29.0/_inst/lib/mesos/modules\"> -I../../include -I../../3rdparty/libprocess/include -I../../3rdparty/libprocess/3rdparty/stout/include -I../include -I../include/mesos -isystem ../3rdparty/libprocess/3rdparty/boost-1.53.0 -I../3rdparty/libprocess/3rdparty/picojson-1.3.0 -DPICOJSON_USE_INT64 -D__STDC_FORMAT_MACROS -I../3rdparty/libprocess/3rdparty/protobuf-2.5.0/src -I../3rdparty/libprocess/3rdparty/glog-0.3.3/src -I../3rdparty/libprocess/3rdparty/glog-0.3.3/src -I../3rdparty/leveldb-1.4/include -I../3rdparty/zookeeper-3.4.5/src/c/include -I../3rdparty/zookeeper-3.4.5/src/c/generated -I../3rdparty/libprocess/3rdparty/protobuf-2.5.0/src -DSOURCE_DIR=\"<https://builds.apache.org/job/mesos-reviewbot/ws/mesos-0.29.0/_build/..\"> -DBUILD_DIR=\"<https://builds.apache.org/job/mesos-reviewbot/ws/mesos-0.29.0/_build\"> -I../3rdparty/libprocess/3rdparty/gmock-1.7.0/gtest/include -I../3rdparty/libprocess/3rdparty/gmock-1.7.0/include -DTESTLIBEXECDIR=\"<https://builds.apache.org/job/mesos-reviewbot/ws/mesos-0.29.0/_inst/libexec/mesos/tests\"> -DSBINDIR=\"<https://builds.apache.org/job/mesos-reviewbot/ws/mesos-0.29.0/_inst/sbin\"> -I/home/jenkins/tools/java/jdk1.6.0_20-64/include -I/home/jenkins/tools/java/jdk1.6.0_20-64/include/linux -DZOOKEEPER_VERSION=\"3.4.5\" -I/usr/include/subversion-1 -I/usr/include/apr-1 -I/usr/include/apr-1.0  -pthread -g1 -O0 -Wno-unused-local-typedefs -std=c++11 -MT tests/containerizer/memory_test_helper-memory_test_helper.o -MD -MP -MF tests/containerizer/.deps/memory_test_helper-memory_test_helper.Tpo -c -o tests/containerizer/memory_test_helper-memory_test_helper.o `test -f 'tests/containerizer/memory_test_helper.cpp' || echo '../../src/'`tests/containerizer/memory_test_helper.cpp
mv -f examples/.deps/long_lived_framework-long_lived_framework.Tpo examples/.deps/long_lived_framework-long_lived_framework.Po
g++ -DPACKAGE_NAME=\"mesos\" -DPACKAGE_TARNAME=\"mesos\" -DPACKAGE_VERSION=\"0.29.0\" -DPACKAGE_STRING=\"mesos\ 0.29.0\" -DPACKAGE_BUGREPORT=\"\" -DPACKAGE_URL=\"\" -DPACKAGE=\"mesos\" -DVERSION=\"0.29.0\" -DSTDC_HEADERS=1 -DHAVE_SYS_TYPES_H=1 -DHAVE_SYS_STAT_H=1 -DHAVE_STDLIB_H=1 -DHAVE_STRING_H=1 -DHAVE_MEMORY_H=1 -DHAVE_STRINGS_H=1 -DHAVE_INTTYPES_H=1 -DHAVE_STDINT_H=1 -DHAVE_UNISTD_H=1 -DHAVE_DLFCN_H=1 -DLT_OBJDIR=\".libs/\" -DHAVE_CXX11=1 -DHAVE_PTHREAD_PRIO_INHERIT=1 -DHAVE_PTHREAD=1 -DHAVE_LIBZ=1 -DHAVE_LIBCURL=1 -DHAVE_APR_POOLS_H=1 -DHAVE_LIBAPR_1=1 -DHAVE_SVN_VERSION_H=1 -DHAVE_LIBSVN_SUBR_1=1 -DHAVE_SVN_DELTA_H=1 -DHAVE_LIBSVN_DELTA_1=1 -DHAVE_LIBSASL2=1 -DMESOS_HAS_JAVA=1 -DHAVE_PYTHON=\"2.7\" -DMESOS_HAS_PYTHON=1 -I. -I../../src   -Wall -Werror -DLIBDIR=\"<https://builds.apache.org/job/mesos-reviewbot/ws/mesos-0.29.0/_inst/lib\"> -DPKGLIBEXECDIR=\"<https://builds.apache.org/job/mesos-reviewbot/ws/mesos-0.29.0/_inst/libexec/mesos\"> -DPKGDATADIR=\"<https://builds.apache.org/job/mesos-reviewbot/ws/mesos-0.29.0/_inst/share/mesos\"> -DPKGMODULEDIR=\"<https://builds.apache.org/job/mesos-reviewbot/ws/mesos-0.29.0/_inst/lib/mesos/modules\"> -I../../include -I../../3rdparty/libprocess/include -I../../3rdparty/libprocess/3rdparty/stout/include -I../include -I../include/mesos -isystem ../3rdparty/libprocess/3rdparty/boost-1.53.0 -I../3rdparty/libprocess/3rdparty/picojson-1.3.0 -DPICOJSON_USE_INT64 -D__STDC_FORMAT_MACROS -I../3rdparty/libprocess/3rdparty/protobuf-2.5.0/src -I../3rdparty/libprocess/3rdparty/glog-0.3.3/src -I../3rdparty/libprocess/3rdparty/glog-0.3.3/src -I../3rdparty/leveldb-1.4/include -I../3rdparty/zookeeper-3.4.5/src/c/include -I../3rdparty/zookeeper-3.4.5/src/c/generated -I../3rdparty/libprocess/3rdparty/protobuf-2.5.0/src -I/usr/include/subversion-1 -I/usr/include/apr-1 -I/usr/include/apr-1.0  -pthread -g1 -O0 -Wno-unused-local-typedefs -std=c++11 -MT tests/active_user_test_helper-active_user_test_helper.o -MD -MP -MF tests/.deps/active_user_test_helper-active_user_test_helper.Tpo -c -o tests/active_user_test_helper-active_user_test_helper.o `test -f 'tests/active_user_test_helper.cpp' || echo '../../src/'`tests/active_user_test_helper.cpp
mv -f examples/.deps/test_framework-test_framework.Tpo examples/.deps/test_framework-test_framework.Po
g++ -DPACKAGE_NAME=\"mesos\" -DPACKAGE_TARNAME=\"mesos\" -DPACKAGE_VERSION=\"0.29.0\" -DPACKAGE_STRING=\"mesos\ 0.29.0\" -DPACKAGE_BUGREPORT=\"\" -DPACKAGE_URL=\"\" -DPACKAGE=\"mesos\" -DVERSION=\"0.29.0\" -DSTDC_HEADERS=1 -DHAVE_SYS_TYPES_H=1 -DHAVE_SYS_STAT_H=1 -DHAVE_STDLIB_H=1 -DHAVE_STRING_H=1 -DHAVE_MEMORY_H=1 -DHAVE_STRINGS_H=1 -DHAVE_INTTYPES_H=1 -DHAVE_STDINT_H=1 -DHAVE_UNISTD_H=1 -DHAVE_DLFCN_H=1 -DLT_OBJDIR=\".libs/\" -DHAVE_CXX11=1 -DHAVE_PTHREAD_PRIO_INHERIT=1 -DHAVE_PTHREAD=1 -DHAVE_LIBZ=1 -DHAVE_LIBCURL=1 -DHAVE_APR_POOLS_H=1 -DHAVE_LIBAPR_1=1 -DHAVE_SVN_VERSION_H=1 -DHAVE_LIBSVN_SUBR_1=1 -DHAVE_SVN_DELTA_H=1 -DHAVE_LIBSVN_DELTA_1=1 -DHAVE_LIBSASL2=1 -DMESOS_HAS_JAVA=1 -DHAVE_PYTHON=\"2.7\" -DMESOS_HAS_PYTHON=1 -I. -I../../src   -Wall -Werror -DLIBDIR=\"<https://builds.apache.org/job/mesos-reviewbot/ws/mesos-0.29.0/_inst/lib\"> -DPKGLIBEXECDIR=\"<https://builds.apache.org/job/mesos-reviewbot/ws/mesos-0.29.0/_inst/libexec/mesos\"> -DPKGDATADIR=\"<https://builds.apache.org/job/mesos-reviewbot/ws/mesos-0.29.0/_inst/share/mesos\"> -DPKGMODULEDIR=\"<https://builds.apache.org/job/mesos-reviewbot/ws/mesos-0.29.0/_inst/lib/mesos/modules\"> -I../../include -I../../3rdparty/libprocess/include -I../../3rdparty/libprocess/3rdparty/stout/include -I../include -I../include/mesos -isystem ../3rdparty/libprocess/3rdparty/boost-1.53.0 -I../3rdparty/libprocess/3rdparty/picojson-1.3.0 -DPICOJSON_USE_INT64 -D__STDC_FORMAT_MACROS -I../3rdparty/libprocess/3rdparty/protobuf-2.5.0/src -I../3rdparty/libprocess/3rdparty/glog-0.3.3/src -I../3rdparty/libprocess/3rdparty/glog-0.3.3/src -I../3rdparty/leveldb-1.4/include -I../3rdparty/zookeeper-3.4.5/src/c/include -I../3rdparty/zookeeper-3.4.5/src/c/generated -I../3rdparty/libprocess/3rdparty/protobuf-2.5.0/src -DSOURCE_DIR=\"<https://builds.apache.org/job/mesos-reviewbot/ws/mesos-0.29.0/_build/..\"> -DBUILD_DIR=\"<https://builds.apache.org/job/mesos-reviewbot/ws/mesos-0.29.0/_build\"> -I../3rdparty/libprocess/3rdparty/gmock-1.7.0/gtest/include -I../3rdparty/libprocess/3rdparty/gmock-1.7.0/include -DTESTLIBEXECDIR=\"<https://builds.apache.org/job/mesos-reviewbot/ws/mesos-0.29.0/_inst/libexec/mesos/tests\"> -DSBINDIR=\"<https://builds.apache.org/job/mesos-reviewbot/ws/mesos-0.29.0/_inst/sbin\"> -I/home/jenkins/tools/java/jdk1.6.0_20-64/include -I/home/jenkins/tools/java/jdk1.6.0_20-64/include/linux -DZOOKEEPER_VERSION=\"3.4.5\" -I/usr/include/subversion-1 -I/usr/include/apr-1 -I/usr/include/apr-1.0  -pthread -g1 -O0 -Wno-unused-local-typedefs -std=c++11 -MT slave/qos_controllers/mesos_tests-load.o -MD -MP -MF slave/qos_controllers/.deps/mesos_tests-load.Tpo -c -o slave/qos_controllers/mesos_tests-load.o `test -f 'slave/qos_controllers/load.cpp' || echo '../../src/'`slave/qos_controllers/load.cpp
mv -f tests/.deps/active_user_test_helper-active_user_test_helper.Tpo tests/.deps/active_user_test_helper-active_user_test_helper.Po
g++ -DPACKAGE_NAME=\"mesos\" -DPACKAGE_TARNAME=\"mesos\" -DPACKAGE_VERSION=\"0.29.0\" -DPACKAGE_STRING=\"mesos\ 0.29.0\" -DPACKAGE_BUGREPORT=\"\" -DPACKAGE_URL=\"\" -DPACKAGE=\"mesos\" -DVERSION=\"0.29.0\" -DSTDC_HEADERS=1 -DHAVE_SYS_TYPES_H=1 -DHAVE_SYS_STAT_H=1 -DHAVE_STDLIB_H=1 -DHAVE_STRING_H=1 -DHAVE_MEMORY_H=1 -DHAVE_STRINGS_H=1 -DHAVE_INTTYPES_H=1 -DHAVE_STDINT_H=1 -DHAVE_UNISTD_H=1 -DHAVE_DLFCN_H=1 -DLT_OBJDIR=\".libs/\" -DHAVE_CXX11=1 -DHAVE_PTHREAD_PRIO_INHERIT=1 -DHAVE_PTHREAD=1 -DHAVE_LIBZ=1 -DHAVE_LIBCURL=1 -DHAVE_APR_POOLS_H=1 -DHAVE_LIBAPR_1=1 -DHAVE_SVN_VERSION_H=1 -DHAVE_LIBSVN_SUBR_1=1 -DHAVE_SVN_DELTA_H=1 -DHAVE_LIBSVN_DELTA_1=1 -DHAVE_LIBSASL2=1 -DMESOS_HAS_JAVA=1 -DHAVE_PYTHON=\"2.7\" -DMESOS_HAS_PYTHON=1 -I. -I../../src   -Wall -Werror -DLIBDIR=\"<https://builds.apache.org/job/mesos-reviewbot/ws/mesos-0.29.0/_inst/lib\"> -DPKGLIBEXECDIR=\"<https://builds.apache.org/job/mesos-reviewbot/ws/mesos-0.29.0/_inst/libexec/mesos\"> -DPKGDATADIR=\"<https://builds.apache.org/job/mesos-reviewbot/ws/mesos-0.29.0/_inst/share/mesos\"> -DPKGMODULEDIR=\"<https://builds.apache.org/job/mesos-reviewbot/ws/mesos-0.29.0/_inst/lib/mesos/modules\"> -I../../include -I../../3rdparty/libprocess/include -I../../3rdparty/libprocess/3rdparty/stout/include -I../include -I../include/mesos -isystem ../3rdparty/libprocess/3rdparty/boost-1.53.0 -I../3rdparty/libprocess/3rdparty/picojson-1.3.0 -DPICOJSON_USE_INT64 -D__STDC_FORMAT_MACROS -I../3rdparty/libprocess/3rdparty/protobuf-2.5.0/src -I../3rdparty/libprocess/3rdparty/glog-0.3.3/src -I../3rdparty/libprocess/3rdparty/glog-0.3.3/src -I../3rdparty/leveldb-1.4/include -I../3rdparty/zookeeper-3.4.5/src/c/include -I../3rdparty/zookeeper-3.4.5/src/c/generated -I../3rdparty/libprocess/3rdparty/protobuf-2.5.0/src -DSOURCE_DIR=\"<https://builds.apache.org/job/mesos-reviewbot/ws/mesos-0.29.0/_build/..\"> -DBUILD_DIR=\"<https://builds.apache.org/job/mesos-reviewbot/ws/mesos-0.29.0/_build\"> -I../3rdparty/libprocess/3rdparty/gmock-1.7.0/gtest/include -I../3rdparty/libprocess/3rdparty/gmock-1.7.0/include -DTESTLIBEXECDIR=\"<https://builds.apache.org/job/mesos-reviewbot/ws/mesos-0.29.0/_inst/libexec/mesos/tests\"> -DSBINDIR=\"<https://builds.apache.org/job/mesos-reviewbot/ws/mesos-0.29.0/_inst/sbin\"> -I/home/jenkins/tools/java/jdk1.6.0_20-64/include -I/home/jenkins/tools/java/jdk1.6.0_20-64/include/linux -DZOOKEEPER_VERSION=\"3.4.5\" -I/usr/include/subversion-1 -I/usr/include/apr-1 -I/usr/include/apr-1.0  -pthread -g1 -O0 -Wno-unused-local-typedefs -std=c++11 -MT tests/mesos_tests-anonymous_tests.o -MD -MP -MF tests/.deps/mesos_tests-anonymous_tests.Tpo -c -o tests/mesos_tests-anonymous_tests.o `test -f 'tests/anonymous_tests.cpp' || echo '../../src/'`tests/anonymous_tests.cpp
mv -f examples/.deps/balloon_framework-balloon_framework.Tpo examples/.deps/balloon_framework-balloon_framework.Po
g++ -DPACKAGE_NAME=\"mesos\" -DPACKAGE_TARNAME=\"mesos\" -DPACKAGE_VERSION=\"0.29.0\" -DPACKAGE_STRING=\"mesos\ 0.29.0\" -DPACKAGE_BUGREPORT=\"\" -DPACKAGE_URL=\"\" -DPACKAGE=\"mesos\" -DVERSION=\"0.29.0\" -DSTDC_HEADERS=1 -DHAVE_SYS_TYPES_H=1 -DHAVE_SYS_STAT_H=1 -DHAVE_STDLIB_H=1 -DHAVE_STRING_H=1 -DHAVE_MEMORY_H=1 -DHAVE_STRINGS_H=1 -DHAVE_INTTYPES_H=1 -DHAVE_STDINT_H=1 -DHAVE_UNISTD_H=1 -DHAVE_DLFCN_H=1 -DLT_OBJDIR=\".libs/\" -DHAVE_CXX11=1 -DHAVE_PTHREAD_PRIO_INHERIT=1 -DHAVE_PTHREAD=1 -DHAVE_LIBZ=1 -DHAVE_LIBCURL=1 -DHAVE_APR_POOLS_H=1 -DHAVE_LIBAPR_1=1 -DHAVE_SVN_VERSION_H=1 -DHAVE_LIBSVN_SUBR_1=1 -DHAVE_SVN_DELTA_H=1 -DHAVE_LIBSVN_DELTA_1=1 -DHAVE_LIBSASL2=1 -DMESOS_HAS_JAVA=1 -DHAVE_PYTHON=\"2.7\" -DMESOS_HAS_PYTHON=1 -I. -I../../src   -Wall -Werror -DLIBDIR=\"<https://builds.apache.org/job/mesos-reviewbot/ws/mesos-0.29.0/_inst/lib\"> -DPKGLIBEXECDIR=\"<https://builds.apache.org/job/mesos-reviewbot/ws/mesos-0.29.0/_inst/libexec/mesos\"> -DPKGDATADIR=\"<https://builds.apache.org/job/mesos-reviewbot/ws/mesos-0.29.0/_inst/share/mesos\"> -DPKGMODULEDIR=\"<https://builds.apache.org/job/mesos-reviewbot/ws/mesos-0.29.0/_inst/lib/mesos/modules\"> -I../../include -I../../3rdparty/libprocess/include -I../../3rdparty/libprocess/3rdparty/stout/include -I../include -I../include/mesos -isystem ../3rdparty/libprocess/3rdparty/boost-1.53.0 -I../3rdparty/libprocess/3rdparty/picojson-1.3.0 -DPICOJSON_USE_INT64 -D__STDC_FORMAT_MACROS -I../3rdparty/libprocess/3rdparty/protobuf-2.5.0/src -I../3rdparty/libprocess/3rdparty/glog-0.3.3/src -I../3rdparty/libprocess/3rdparty/glog-0.3.3/src -I../3rdparty/leveldb-1.4/include -I../3rdparty/zookeeper-3.4.5/src/c/include -I../3rdparty/zookeeper-3.4.5/src/c/generated -I../3rdparty/libprocess/3rdparty/protobuf-2.5.0/src -DSOURCE_DIR=\"<https://builds.apache.org/job/mesos-reviewbot/ws/mesos-0.29.0/_build/..\"> -DBUILD_DIR=\"<https://builds.apache.org/job/mesos-reviewbot/ws/mesos-0.29.0/_build\"> -I../3rdparty/libprocess/3rdparty/gmock-1.7.0/gtest/include -I../3rdparty/libprocess/3rdparty/gmock-1.7.0/include -DTESTLIBEXECDIR=\"<https://builds.apache.org/job/mesos-reviewbot/ws/mesos-0.29.0/_inst/libexec/mesos/tests\"> -DSBINDIR=\"<https://builds.apache.org/job/mesos-reviewbot/ws/mesos-0.29.0/_inst/sbin\"> -I/home/jenkins/tools/java/jdk1.6.0_20-64/include -I/home/jenkins/tools/java/jdk1.6.0_20-64/include/linux -DZOOKEEPER_VERSION=\"3.4.5\" -I/usr/include/subversion-1 -I/usr/include/apr-1 -I/usr/include/apr-1.0  -pthread -g1 -O0 -Wno-unused-local-typedefs -std=c++11 -MT tests/mesos_tests-attributes_tests.o -MD -MP -MF tests/.deps/mesos_tests-attributes_tests.Tpo -c -o tests/mesos_tests-attributes_tests.o `test -f 'tests/attributes_tests.cpp' || echo '../../src/'`tests/attributes_tests.cpp
mv -f examples/.deps/no_executor_framework-no_executor_framework.Tpo examples/.deps/no_executor_framework-no_executor_framework.Po
g++ -DPACKAGE_NAME=\"mesos\" -DPACKAGE_TARNAME=\"mesos\" -DPACKAGE_VERSION=\"0.29.0\" -DPACKAGE_STRING=\"mesos\ 0.29.0\" -DPACKAGE_BUGREPORT=\"\" -DPACKAGE_URL=\"\" -DPACKAGE=\"mesos\" -DVERSION=\"0.29.0\" -DSTDC_HEADERS=1 -DHAVE_SYS_TYPES_H=1 -DHAVE_SYS_STAT_H=1 -DHAVE_STDLIB_H=1 -DHAVE_STRING_H=1 -DHAVE_MEMORY_H=1 -DHAVE_STRINGS_H=1 -DHAVE_INTTYPES_H=1 -DHAVE_STDINT_H=1 -DHAVE_UNISTD_H=1 -DHAVE_DLFCN_H=1 -DLT_OBJDIR=\".libs/\" -DHAVE_CXX11=1 -DHAVE_PTHREAD_PRIO_INHERIT=1 -DHAVE_PTHREAD=1 -DHAVE_LIBZ=1 -DHAVE_LIBCURL=1 -DHAVE_APR_POOLS_H=1 -DHAVE_LIBAPR_1=1 -DHAVE_SVN_VERSION_H=1 -DHAVE_LIBSVN_SUBR_1=1 -DHAVE_SVN_DELTA_H=1 -DHAVE_LIBSVN_DELTA_1=1 -DHAVE_LIBSASL2=1 -DMESOS_HAS_JAVA=1 -DHAVE_PYTHON=\"2.7\" -DMESOS_HAS_PYTHON=1 -I. -I../../src   -Wall -Werror -DLIBDIR=\"<https://builds.apache.org/job/mesos-reviewbot/ws/mesos-0.29.0/_inst/lib\"> -DPKGLIBEXECDIR=\"<https://builds.apache.org/job/mesos-reviewbot/ws/mesos-0.29.0/_inst/libexec/mesos\"> -DPKGDATADIR=\"<https://builds.apache.org/job/mesos-reviewbot/ws/mesos-0.29.0/_inst/share/mesos\"> -DPKGMODULEDIR=\"<https://builds.apache.org/job/mesos-reviewbot/ws/mesos-0.29.0/_inst/lib/mesos/modules\"> -I../../include -I../../3rdparty/libprocess/include -I../../3rdparty/libprocess/3rdparty/stout/include -I../include -I../include/mesos -isystem ../3rdparty/libprocess/3rdparty/boost-1.53.0 -I../3rdparty/libprocess/3rdparty/picojson-1.3.0 -DPICOJSON_USE_INT64 -D__STDC_FORMAT_MACROS -I../3rdparty/libprocess/3rdparty/protobuf-2.5.0/src -I../3rdparty/libprocess/3rdparty/glog-0.3.3/src -I../3rdparty/libprocess/3rdparty/glog-0.3.3/src -I../3rdparty/leveldb-1.4/include -I../3rdparty/zookeeper-3.4.5/src/c/include -I../3rdparty/zookeeper-3.4.5/src/c/generated -I../3rdparty/libprocess/3rdparty/protobuf-2.5.0/src -DSOURCE_DIR=\"<https://builds.apache.org/job/mesos-reviewbot/ws/mesos-0.29.0/_build/..\"> -DBUILD_DIR=\"<https://builds.apache.org/job/mesos-reviewbot/ws/mesos-0.29.0/_build\"> -I../3rdparty/libprocess/3rdparty/gmock-1.7.0/gtest/include -I../3rdparty/libprocess/3rdparty/gmock-1.7.0/include -DTESTLIBEXECDIR=\"<https://builds.apache.org/job/mesos-reviewbot/ws/mesos-0.29.0/_inst/libexec/mesos/tests\"> -DSBINDIR=\"<https://builds.apache.org/job/mesos-reviewbot/ws/mesos-0.29.0/_inst/sbin\"> -I/home/jenkins/tools/java/jdk1.6.0_20-64/include -I/home/jenkins/tools/java/jdk1.6.0_20-64/include/linux -DZOOKEEPER_VERSION=\"3.4.5\" -I/usr/include/subversion-1 -I/usr/include/apr-1 -I/usr/include/apr-1.0  -pthread -g1 -O0 -Wno-unused-local-typedefs -std=c++11 -MT tests/mesos_tests-authentication_tests.o -MD -MP -MF tests/.deps/mesos_tests-authentication_tests.Tpo -c -o tests/mesos_tests-authentication_tests.o `test -f 'tests/authentication_tests.cpp' || echo '../../src/'`tests/authentication_tests.cpp
mv -f examples/.deps/test_http_executor-test_http_executor.Tpo examples/.deps/test_http_executor-test_http_executor.Po
g++ -DPACKAGE_NAME=\"mesos\" -DPACKAGE_TARNAME=\"mesos\" -DPACKAGE_VERSION=\"0.29.0\" -DPACKAGE_STRING=\"mesos\ 0.29.0\" -DPACKAGE_BUGREPORT=\"\" -DPACKAGE_URL=\"\" -DPACKAGE=\"mesos\" -DVERSION=\"0.29.0\" -DSTDC_HEADERS=1 -DHAVE_SYS_TYPES_H=1 -DHAVE_SYS_STAT_H=1 -DHAVE_STDLIB_H=1 -DHAVE_STRING_H=1 -DHAVE_MEMORY_H=1 -DHAVE_STRINGS_H=1 -DHAVE_INTTYPES_H=1 -DHAVE_STDINT_H=1 -DHAVE_UNISTD_H=1 -DHAVE_DLFCN_H=1 -DLT_OBJDIR=\".libs/\" -DHAVE_CXX11=1 -DHAVE_PTHREAD_PRIO_INHERIT=1 -DHAVE_PTHREAD=1 -DHAVE_LIBZ=1 -DHAVE_LIBCURL=1 -DHAVE_APR_POOLS_H=1 -DHAVE_LIBAPR_1=1 -DHAVE_SVN_VERSION_H=1 -DHAVE_LIBSVN_SUBR_1=1 -DHAVE_SVN_DELTA_H=1 -DHAVE_LIBSVN_DELTA_1=1 -DHAVE_LIBSASL2=1 -DMESOS_HAS_JAVA=1 -DHAVE_PYTHON=\"2.7\" -DMESOS_HAS_PYTHON=1 -I. -I../../src   -Wall -Werror -DLIBDIR=\"<https://builds.apache.org/job/mesos-reviewbot/ws/mesos-0.29.0/_inst/lib\"> -DPKGLIBEXECDIR=\"<https://builds.apache.org/job/mesos-reviewbot/ws/mesos-0.29.0/_inst/libexec/mesos\"> -DPKGDATADIR=\"<https://builds.apache.org/job/mesos-reviewbot/ws/mesos-0.29.0/_inst/share/mesos\"> -DPKGMODULEDIR=\"<https://builds.apache.org/job/mesos-reviewbot/ws/mesos-0.29.0/_inst/lib/mesos/modules\"> -I../../include -I../../3rdparty/libprocess/include -I../../3rdparty/libprocess/3rdparty/stout/include -I../include -I../include/mesos -isystem ../3rdparty/libprocess/3rdparty/boost-1.53.0 -I../3rdparty/libprocess/3rdparty/picojson-1.3.0 -DPICOJSON_USE_INT64 -D__STDC_FORMAT_MACROS -I../3rdparty/libprocess/3rdparty/protobuf-2.5.0/src -I../3rdparty/libprocess/3rdparty/glog-0.3.3/src -I../3rdparty/libprocess/3rdparty/glog-0.3.3/src -I../3rdparty/leveldb-1.4/include -I../3rdparty/zookeeper-3.4.5/src/c/include -I../3rdparty/zookeeper-3.4.5/src/c/generated -I../3rdparty/libprocess/3rdparty/protobuf-2.5.0/src -DSOURCE_DIR=\"<https://builds.apache.org/job/mesos-reviewbot/ws/mesos-0.29.0/_build/..\"> -DBUILD_DIR=\"<https://builds.apache.org/job/mesos-reviewbot/ws/mesos-0.29.0/_build\"> -I../3rdparty/libprocess/3rdparty/gmock-1.7.0/gtest/include -I../3rdparty/libprocess/3rdparty/gmock-1.7.0/include -DTESTLIBEXECDIR=\"<https://builds.apache.org/job/mesos-reviewbot/ws/mesos-0.29.0/_inst/libexec/mesos/tests\"> -DSBINDIR=\"<https://builds.apache.org/job/mesos-reviewbot/ws/mesos-0.29.0/_inst/sbin\"> -I/home/jenkins/tools/java/jdk1.6.0_20-64/include -I/home/jenkins/tools/java/jdk1.6.0_20-64/include/linux -DZOOKEEPER_VERSION=\"3.4.5\" -I/usr/include/subversion-1 -I/usr/include/apr-1 -I/usr/include/apr-1.0  -pthread -g1 -O0 -Wno-unused-local-typedefs -std=c++11 -MT tests/mesos_tests-authorization_tests.o -MD -MP -MF tests/.deps/mesos_tests-authorization_tests.Tpo -c -o tests/mesos_tests-authorization_tests.o `test -f 'tests/authorization_tests.cpp' || echo '../../src/'`tests/authorization_tests.cpp
mv -f examples/.deps/test_http_framework-test_http_framework.Tpo examples/.deps/test_http_framework-test_http_framework.Po
g++ -DPACKAGE_NAME=\"mesos\" -DPACKAGE_TARNAME=\"mesos\" -DPACKAGE_VERSION=\"0.29.0\" -DPACKAGE_STRING=\"mesos\ 0.29.0\" -DPACKAGE_BUGREPORT=\"\" -DPACKAGE_URL=\"\" -DPACKAGE=\"mesos\" -DVERSION=\"0.29.0\" -DSTDC_HEADERS=1 -DHAVE_SYS_TYPES_H=1 -DHAVE_SYS_STAT_H=1 -DHAVE_STDLIB_H=1 -DHAVE_STRING_H=1 -DHAVE_MEMORY_H=1 -DHAVE_STRINGS_H=1 -DHAVE_INTTYPES_H=1 -DHAVE_STDINT_H=1 -DHAVE_UNISTD_H=1 -DHAVE_DLFCN_H=1 -DLT_OBJDIR=\".libs/\" -DHAVE_CXX11=1 -DHAVE_PTHREAD_PRIO_INHERIT=1 -DHAVE_PTHREAD=1 -DHAVE_LIBZ=1 -DHAVE_LIBCURL=1 -DHAVE_APR_POOLS_H=1 -DHAVE_LIBAPR_1=1 -DHAVE_SVN_VERSION_H=1 -DHAVE_LIBSVN_SUBR_1=1 -DHAVE_SVN_DELTA_H=1 -DHAVE_LIBSVN_DELTA_1=1 -DHAVE_LIBSASL2=1 -DMESOS_HAS_JAVA=1 -DHAVE_PYTHON=\"2.7\" -DMESOS_HAS_PYTHON=1 -I. -I../../src   -Wall -Werror -DLIBDIR=\"<https://builds.apache.org/job/mesos-reviewbot/ws/mesos-0.29.0/_inst/lib\"> -DPKGLIBEXECDIR=\"<https://builds.apache.org/job/mesos-reviewbot/ws/mesos-0.29.0/_inst/libexec/mesos\"> -DPKGDATADIR=\"<https://builds.apache.org/job/mesos-reviewbot/ws/mesos-0.29.0/_inst/share/mesos\"> -DPKGMODULEDIR=\"<https://builds.apache.org/job/mesos-reviewbot/ws/mesos-0.29.0/_inst/lib/mesos/modules\"> -I../../include -I../../3rdparty/libprocess/include -I../../3rdparty/libprocess/3rdparty/stout/include -I../include -I../include/mesos -isystem ../3rdparty/libprocess/3rdparty/boost-1.53.0 -I../3rdparty/libprocess/3rdparty/picojson-1.3.0 -DPICOJSON_USE_INT64 -D__STDC_FORMAT_MACROS -I../3rdparty/libprocess/3rdparty/protobuf-2.5.0/src -I../3rdparty/libprocess/3rdparty/glog-0.3.3/src -I../3rdparty/libprocess/3rdparty/glog-0.3.3/src -I../3rdparty/leveldb-1.4/include -I../3rdparty/zookeeper-3.4.5/src/c/include -I../3rdparty/zookeeper-3.4.5/src/c/generated -I../3rdparty/libprocess/3rdparty/protobuf-2.5.0/src -DSOURCE_DIR=\"<https://builds.apache.org/job/mesos-reviewbot/ws/mesos-0.29.0/_build/..\"> -DBUILD_DIR=\"<https://builds.apache.org/job/mesos-reviewbot/ws/mesos-0.29.0/_build\"> -I../3rdparty/libprocess/3rdparty/gmock-1.7.0/gtest/include -I../3rdparty/libprocess/3rdparty/gmock-1.7.0/include -DTESTLIBEXECDIR=\"<https://builds.apache.org/job/mesos-reviewbot/ws/mesos-0.29.0/_inst/libexec/mesos/tests\"> -DSBINDIR=\"<https://builds.apache.org/job/mesos-reviewbot/ws/mesos-0.29.0/_inst/sbin\"> -I/home/jenkins/tools/java/jdk1.6.0_20-64/include -I/home/jenkins/tools/java/jdk1.6.0_20-64/include/linux -DZOOKEEPER_VERSION=\"3.4.5\" -I/usr/include/subversion-1 -I/usr/include/apr-1 -I/usr/include/apr-1.0  -pthread -g1 -O0 -Wno-unused-local-typedefs -std=c++11 -MT tests/mesos_tests-cluster.o -MD -MP -MF tests/.deps/mesos_tests-cluster.Tpo -c -o tests/mesos_tests-cluster.o `test -f 'tests/cluster.cpp' || echo '../../src/'`tests/cluster.cpp
mv -f tests/containerizer/.deps/memory_test_helper-memory_test_helper_main.Tpo tests/containerizer/.deps/memory_test_helper-memory_test_helper_main.Po
g++ -DPACKAGE_NAME=\"mesos\" -DPACKAGE_TARNAME=\"mesos\" -DPACKAGE_VERSION=\"0.29.0\" -DPACKAGE_STRING=\"mesos\ 0.29.0\" -DPACKAGE_BUGREPORT=\"\" -DPACKAGE_URL=\"\" -DPACKAGE=\"mesos\" -DVERSION=\"0.29.0\" -DSTDC_HEADERS=1 -DHAVE_SYS_TYPES_H=1 -DHAVE_SYS_STAT_H=1 -DHAVE_STDLIB_H=1 -DHAVE_STRING_H=1 -DHAVE_MEMORY_H=1 -DHAVE_STRINGS_H=1 -DHAVE_INTTYPES_H=1 -DHAVE_STDINT_H=1 -DHAVE_UNISTD_H=1 -DHAVE_DLFCN_H=1 -DLT_OBJDIR=\".libs/\" -DHAVE_CXX11=1 -DHAVE_PTHREAD_PRIO_INHERIT=1 -DHAVE_PTHREAD=1 -DHAVE_LIBZ=1 -DHAVE_LIBCURL=1 -DHAVE_APR_POOLS_H=1 -DHAVE_LIBAPR_1=1 -DHAVE_SVN_VERSION_H=1 -DHAVE_LIBSVN_SUBR_1=1 -DHAVE_SVN_DELTA_H=1 -DHAVE_LIBSVN_DELTA_1=1 -DHAVE_LIBSASL2=1 -DMESOS_HAS_JAVA=1 -DHAVE_PYTHON=\"2.7\" -DMESOS_HAS_PYTHON=1 -I. -I../../src   -Wall -Werror -DLIBDIR=\"<https://builds.apache.org/job/mesos-reviewbot/ws/mesos-0.29.0/_inst/lib\"> -DPKGLIBEXECDIR=\"<https://builds.apache.org/job/mesos-reviewbot/ws/mesos-0.29.0/_inst/libexec/mesos\"> -DPKGDATADIR=\"<https://builds.apache.org/job/mesos-reviewbot/ws/mesos-0.29.0/_inst/share/mesos\"> -DPKGMODULEDIR=\"<https://builds.apache.org/job/mesos-reviewbot/ws/mesos-0.29.0/_inst/lib/mesos/modules\"> -I../../include -I../../3rdparty/libprocess/include -I../../3rdparty/libprocess/3rdparty/stout/include -I../include -I../include/mesos -isystem ../3rdparty/libprocess/3rdparty/boost-1.53.0 -I../3rdparty/libprocess/3rdparty/picojson-1.3.0 -DPICOJSON_USE_INT64 -D__STDC_FORMAT_MACROS -I../3rdparty/libprocess/3rdparty/protobuf-2.5.0/src -I../3rdparty/libprocess/3rdparty/glog-0.3.3/src -I../3rdparty/libprocess/3rdparty/glog-0.3.3/src -I../3rdparty/leveldb-1.4/include -I../3rdparty/zookeeper-3.4.5/src/c/include -I../3rdparty/zookeeper-3.4.5/src/c/generated -I../3rdparty/libprocess/3rdparty/protobuf-2.5.0/src -DSOURCE_DIR=\"<https://builds.apache.org/job/mesos-reviewbot/ws/mesos-0.29.0/_build/..\"> -DBUILD_DIR=\"<https://builds.apache.org/job/mesos-reviewbot/ws/mesos-0.29.0/_build\"> -I../3rdparty/libprocess/3rdparty/gmock-1.7.0/gtest/include -I../3rdparty/libprocess/3rdparty/gmock-1.7.0/include -DTESTLIBEXECDIR=\"<https://builds.apache.org/job/mesos-reviewbot/ws/mesos-0.29.0/_inst/libexec/mesos/tests\"> -DSBINDIR=\"<https://builds.apache.org/job/mesos-reviewbot/ws/mesos-0.29.0/_inst/sbin\"> -I/home/jenkins/tools/java/jdk1.6.0_20-64/include -I/home/jenkins/tools/java/jdk1.6.0_20-64/include/linux -DZOOKEEPER_VERSION=\"3.4.5\" -I/usr/include/subversion-1 -I/usr/include/apr-1 -I/usr/include/apr-1.0  -pthread -g1 -O0 -Wno-unused-local-typedefs -std=c++11 -MT tests/mesos_tests-command_executor_tests.o -MD -MP -MF tests/.deps/mesos_tests-command_executor_tests.Tpo -c -o tests/mesos_tests-command_executor_tests.o `test -f 'tests/command_executor_tests.cpp' || echo '../../src/'`tests/command_executor_tests.cpp
mv -f tests/.deps/mesos_tests-attributes_tests.Tpo tests/.deps/mesos_tests-attributes_tests.Po
g++ -DPACKAGE_NAME=\"mesos\" -DPACKAGE_TARNAME=\"mesos\" -DPACKAGE_VERSION=\"0.29.0\" -DPACKAGE_STRING=\"mesos\ 0.29.0\" -DPACKAGE_BUGREPORT=\"\" -DPACKAGE_URL=\"\" -DPACKAGE=\"mesos\" -DVERSION=\"0.29.0\" -DSTDC_HEADERS=1 -DHAVE_SYS_TYPES_H=1 -DHAVE_SYS_STAT_H=1 -DHAVE_STDLIB_H=1 -DHAVE_STRING_H=1 -DHAVE_MEMORY_H=1 -DHAVE_STRINGS_H=1 -DHAVE_INTTYPES_H=1 -DHAVE_STDINT_H=1 -DHAVE_UNISTD_H=1 -DHAVE_DLFCN_H=1 -DLT_OBJDIR=\".libs/\" -DHAVE_CXX11=1 -DHAVE_PTHREAD_PRIO_INHERIT=1 -DHAVE_PTHREAD=1 -DHAVE_LIBZ=1 -DHAVE_LIBCURL=1 -DHAVE_APR_POOLS_H=1 -DHAVE_LIBAPR_1=1 -DHAVE_SVN_VERSION_H=1 -DHAVE_LIBSVN_SUBR_1=1 -DHAVE_SVN_DELTA_H=1 -DHAVE_LIBSVN_DELTA_1=1 -DHAVE_LIBSASL2=1 -DMESOS_HAS_JAVA=1 -DHAVE_PYTHON=\"2.7\" -DMESOS_HAS_PYTHON=1 -I. -I../../src   -Wall -Werror -DLIBDIR=\"<https://builds.apache.org/job/mesos-reviewbot/ws/mesos-0.29.0/_inst/lib\"> -DPKGLIBEXECDIR=\"<https://builds.apache.org/job/mesos-reviewbot/ws/mesos-0.29.0/_inst/libexec/mesos\"> -DPKGDATADIR=\"<https://builds.apache.org/job/mesos-reviewbot/ws/mesos-0.29.0/_inst/share/mesos\"> -DPKGMODULEDIR=\"<https://builds.apache.org/job/mesos-reviewbot/ws/mesos-0.29.0/_inst/lib/mesos/modules\"> -I../../include -I../../3rdparty/libprocess/include -I../../3rdparty/libprocess/3rdparty/stout/include -I../include -I../include/mesos -isystem ../3rdparty/libprocess/3rdparty/boost-1.53.0 -I../3rdparty/libprocess/3rdparty/picojson-1.3.0 -DPICOJSON_USE_INT64 -D__STDC_FORMAT_MACROS -I../3rdparty/libprocess/3rdparty/protobuf-2.5.0/src -I../3rdparty/libprocess/3rdparty/glog-0.3.3/src -I../3rdparty/libprocess/3rdparty/glog-0.3.3/src -I../3rdparty/leveldb-1.4/include -I../3rdparty/zookeeper-3.4.5/src/c/include -I../3rdparty/zookeeper-3.4.5/src/c/generated -I../3rdparty/libprocess/3rdparty/protobuf-2.5.0/src -DSOURCE_DIR=\"<https://builds.apache.org/job/mesos-reviewbot/ws/mesos-0.29.0/_build/..\"> -DBUILD_DIR=\"<https://builds.apache.org/job/mesos-reviewbot/ws/mesos-0.29.0/_build\"> -I../3rdparty/libprocess/3rdparty/gmock-1.7.0/gtest/include -I../3rdparty/libprocess/3rdparty/gmock-1.7.0/include -DTESTLIBEXECDIR=\"<https://builds.apache.org/job/mesos-reviewbot/ws/mesos-0.29.0/_inst/libexec/mesos/tests\"> -DSBINDIR=\"<https://builds.apache.org/job/mesos-reviewbot/ws/mesos-0.29.0/_inst/sbin\"> -I/home/jenkins/tools/java/jdk1.6.0_20-64/include -I/home/jenkins/tools/java/jdk1.6.0_20-64/include/linux -DZOOKEEPER_VERSION=\"3.4.5\" -I/usr/include/subversion-1 -I/usr/include/apr-1 -I/usr/include/apr-1.0  -pthread -g1 -O0 -Wno-unused-local-typedefs -std=c++11 -MT tests/mesos_tests-container_logger_tests.o -MD -MP -MF tests/.deps/mesos_tests-container_logger_tests.Tpo -c -o tests/mesos_tests-container_logger_tests.o `test -f 'tests/container_logger_tests.cpp' || echo '../../src/'`tests/container_logger_tests.cpp
mv -f examples/.deps/load_generator_framework-load_generator_framework.Tpo examples/.deps/load_generator_framework-load_generator_framework.Po
g++ -DPACKAGE_NAME=\"mesos\" -DPACKAGE_TARNAME=\"mesos\" -DPACKAGE_VERSION=\"0.29.0\" -DPACKAGE_STRING=\"mesos\ 0.29.0\" -DPACKAGE_BUGREPORT=\"\" -DPACKAGE_URL=\"\" -DPACKAGE=\"mesos\" -DVERSION=\"0.29.0\" -DSTDC_HEADERS=1 -DHAVE_SYS_TYPES_H=1 -DHAVE_SYS_STAT_H=1 -DHAVE_STDLIB_H=1 -DHAVE_STRING_H=1 -DHAVE_MEMORY_H=1 -DHAVE_STRINGS_H=1 -DHAVE_INTTYPES_H=1 -DHAVE_STDINT_H=1 -DHAVE_UNISTD_H=1 -DHAVE_DLFCN_H=1 -DLT_OBJDIR=\".libs/\" -DHAVE_CXX11=1 -DHAVE_PTHREAD_PRIO_INHERIT=1 -DHAVE_PTHREAD=1 -DHAVE_LIBZ=1 -DHAVE_LIBCURL=1 -DHAVE_APR_POOLS_H=1 -DHAVE_LIBAPR_1=1 -DHAVE_SVN_VERSION_H=1 -DHAVE_LIBSVN_SUBR_1=1 -DHAVE_SVN_DELTA_H=1 -DHAVE_LIBSVN_DELTA_1=1 -DHAVE_LIBSASL2=1 -DMESOS_HAS_JAVA=1 -DHAVE_PYTHON=\"2.7\" -DMESOS_HAS_PYTHON=1 -I. -I../../src   -Wall -Werror -DLIBDIR=\"<https://builds.apache.org/job/mesos-reviewbot/ws/mesos-0.29.0/_inst/lib\"> -DPKGLIBEXECDIR=\"<https://builds.apache.org/job/mesos-reviewbot/ws/mesos-0.29.0/_inst/libexec/mesos\"> -DPKGDATADIR=\"<https://builds.apache.org/job/mesos-reviewbot/ws/mesos-0.29.0/_inst/share/mesos\"> -DPKGMODULEDIR=\"<https://builds.apache.org/job/mesos-reviewbot/ws/mesos-0.29.0/_inst/lib/mesos/modules\"> -I../../include -I../../3rdparty/libprocess/include -I../../3rdparty/libprocess/3rdparty/stout/include -I../include -I../include/mesos -isystem ../3rdparty/libprocess/3rdparty/boost-1.53.0 -I../3rdparty/libprocess/3rdparty/picojson-1.3.0 -DPICOJSON_USE_INT64 -D__STDC_FORMAT_MACROS -I../3rdparty/libprocess/3rdparty/protobuf-2.5.0/src -I../3rdparty/libprocess/3rdparty/glog-0.3.3/src -I../3rdparty/libprocess/3rdparty/glog-0.3.3/src -I../3rdparty/leveldb-1.4/include -I../3rdparty/zookeeper-3.4.5/src/c/include -I../3rdparty/zookeeper-3.4.5/src/c/generated -I../3rdparty/libprocess/3rdparty/protobuf-2.5.0/src -DSOURCE_DIR=\"<https://builds.apache.org/job/mesos-reviewbot/ws/mesos-0.29.0/_build/..\"> -DBUILD_DIR=\"<https://builds.apache.org/job/mesos-reviewbot/ws/mesos-0.29.0/_build\"> -I../3rdparty/libprocess/3rdparty/gmock-1.7.0/gtest/include -I../3rdparty/libprocess/3rdparty/gmock-1.7.0/include -DTESTLIBEXECDIR=\"<https://builds.apache.org/job/mesos-reviewbot/ws/mesos-0.29.0/_inst/libexec/mesos/tests\"> -DSBINDIR=\"<https://builds.apache.org/job/mesos-reviewbot/ws/mesos-0.29.0/_inst/sbin\"> -I/home/jenkins/tools/java/jdk1.6.0_20-64/include -I/home/jenkins/tools/java/jdk1.6.0_20-64/include/linux -DZOOKEEPER_VERSION=\"3.4.5\" -I/usr/include/subversion-1 -I/usr/include/apr-1 -I/usr/include/apr-1.0  -pthread -g1 -O0 -Wno-unused-local-typedefs -std=c++11 -MT tests/mesos_tests-containerizer.o -MD -MP -MF tests/.deps/mesos_tests-containerizer.Tpo -c -o tests/mesos_tests-containerizer.o `test -f 'tests/containerizer.cpp' || echo '../../src/'`tests/containerizer.cpp
mv -f tests/containerizer/.deps/memory_test_helper-memory_test_helper.Tpo tests/containerizer/.deps/memory_test_helper-memory_test_helper.Po
g++ -DPACKAGE_NAME=\"mesos\" -DPACKAGE_TARNAME=\"mesos\" -DPACKAGE_VERSION=\"0.29.0\" -DPACKAGE_STRING=\"mesos\ 0.29.0\" -DPACKAGE_BUGREPORT=\"\" -DPACKAGE_URL=\"\" -DPACKAGE=\"mesos\" -DVERSION=\"0.29.0\" -DSTDC_HEADERS=1 -DHAVE_SYS_TYPES_H=1 -DHAVE_SYS_STAT_H=1 -DHAVE_STDLIB_H=1 -DHAVE_STRING_H=1 -DHAVE_MEMORY_H=1 -DHAVE_STRINGS_H=1 -DHAVE_INTTYPES_H=1 -DHAVE_STDINT_H=1 -DHAVE_UNISTD_H=1 -DHAVE_DLFCN_H=1 -DLT_OBJDIR=\".libs/\" -DHAVE_CXX11=1 -DHAVE_PTHREAD_PRIO_INHERIT=1 -DHAVE_PTHREAD=1 -DHAVE_LIBZ=1 -DHAVE_LIBCURL=1 -DHAVE_APR_POOLS_H=1 -DHAVE_LIBAPR_1=1 -DHAVE_SVN_VERSION_H=1 -DHAVE_LIBSVN_SUBR_1=1 -DHAVE_SVN_DELTA_H=1 -DHAVE_LIBSVN_DELTA_1=1 -DHAVE_LIBSASL2=1 -DMESOS_HAS_JAVA=1 -DHAVE_PYTHON=\"2.7\" -DMESOS_HAS_PYTHON=1 -I. -I../../src   -Wall -Werror -DLIBDIR=\"<https://builds.apache.org/job/mesos-reviewbot/ws/mesos-0.29.0/_inst/lib\"> -DPKGLIBEXECDIR=\"<https://builds.apache.org/job/mesos-reviewbot/ws/mesos-0.29.0/_inst/libexec/mesos\"> -DPKGDATADIR=\"<https://builds.apache.org/job/mesos-reviewbot/ws/mesos-0.29.0/_inst/share/mesos\"> -DPKGMODULEDIR=\"<https://builds.apache.org/job/mesos-reviewbot/ws/mesos-0.29.0/_inst/lib/mesos/modules\"> -I../../include -I../../3rdparty/libprocess/include -I../../3rdparty/libprocess/3rdparty/stout/include -I../include -I../include/mesos -isystem ../3rdparty/libprocess/3rdparty/boost-1.53.0 -I../3rdparty/libprocess/3rdparty/picojson-1.3.0 -DPICOJSON_USE_INT64 -D__STDC_FORMAT_MACROS -I../3rdparty/libprocess/3rdparty/protobuf-2.5.0/src -I../3rdparty/libprocess/3rdparty/glog-0.3.3/src -I../3rdparty/libprocess/3rdparty/glog-0.3.3/src -I../3rdparty/leveldb-1.4/include -I../3rdparty/zookeeper-3.4.5/src/c/include -I../3rdparty/zookeeper-3.4.5/src/c/generated -I../3rdparty/libprocess/3rdparty/protobuf-2.5.0/src -DSOURCE_DIR=\"<https://builds.apache.org/job/mesos-reviewbot/ws/mesos-0.29.0/_build/..\"> -DBUILD_DIR=\"<https://builds.apache.org/job/mesos-reviewbot/ws/mesos-0.29.0/_build\"> -I../3rdparty/libprocess/3rdparty/gmock-1.7.0/gtest/include -I../3rdparty/libprocess/3rdparty/gmock-1.7.0/include -DTESTLIBEXECDIR=\"<https://builds.apache.org/job/mesos-reviewbot/ws/mesos-0.29.0/_inst/libexec/mesos/tests\"> -DSBINDIR=\"<https://builds.apache.org/job/mesos-reviewbot/ws/mesos-0.29.0/_inst/sbin\"> -I/home/jenkins/tools/java/jdk1.6.0_20-64/include -I/home/jenkins/tools/java/jdk1.6.0_20-64/include/linux -DZOOKEEPER_VERSION=\"3.4.5\" -I/usr/include/subversion-1 -I/usr/include/apr-1 -I/usr/include/apr-1.0  -pthread -g1 -O0 -Wno-unused-local-typedefs -std=c++11 -MT tests/mesos_tests-cram_md5_authentication_tests.o -MD -MP -MF tests/.deps/mesos_tests-cram_md5_authentication_tests.Tpo -c -o tests/mesos_tests-cram_md5_authentication_tests.o `test -f 'tests/cram_md5_authentication_tests.cpp' || echo '../../src/'`tests/cram_md5_authentication_tests.cpp
mv -f examples/.deps/persistent_volume_framework-persistent_volume_framework.Tpo examples/.deps/persistent_volume_framework-persistent_volume_framework.Po
g++ -DPACKAGE_NAME=\"mesos\" -DPACKAGE_TARNAME=\"mesos\" -DPACKAGE_VERSION=\"0.29.0\" -DPACKAGE_STRING=\"mesos\ 0.29.0\" -DPACKAGE_BUGREPORT=\"\" -DPACKAGE_URL=\"\" -DPACKAGE=\"mesos\" -DVERSION=\"0.29.0\" -DSTDC_HEADERS=1 -DHAVE_SYS_TYPES_H=1 -DHAVE_SYS_STAT_H=1 -DHAVE_STDLIB_H=1 -DHAVE_STRING_H=1 -DHAVE_MEMORY_H=1 -DHAVE_STRINGS_H=1 -DHAVE_INTTYPES_H=1 -DHAVE_STDINT_H=1 -DHAVE_UNISTD_H=1 -DHAVE_DLFCN_H=1 -DLT_OBJDIR=\".libs/\" -DHAVE_CXX11=1 -DHAVE_PTHREAD_PRIO_INHERIT=1 -DHAVE_PTHREAD=1 -DHAVE_LIBZ=1 -DHAVE_LIBCURL=1 -DHAVE_APR_POOLS_H=1 -DHAVE_LIBAPR_1=1 -DHAVE_SVN_VERSION_H=1 -DHAVE_LIBSVN_SUBR_1=1 -DHAVE_SVN_DELTA_H=1 -DHAVE_LIBSVN_DELTA_1=1 -DHAVE_LIBSASL2=1 -DMESOS_HAS_JAVA=1 -DHAVE_PYTHON=\"2.7\" -DMESOS_HAS_PYTHON=1 -I. -I../../src   -Wall -Werror -DLIBDIR=\"<https://builds.apache.org/job/mesos-reviewbot/ws/mesos-0.29.0/_inst/lib\"> -DPKGLIBEXECDIR=\"<https://builds.apache.org/job/mesos-reviewbot/ws/mesos-0.29.0/_inst/libexec/mesos\"> -DPKGDATADIR=\"<https://builds.apache.org/job/mesos-reviewbot/ws/mesos-0.29.0/_inst/share/mesos\"> -DPKGMODULEDIR=\"<https://builds.apache.org/job/mesos-reviewbot/ws/mesos-0.29.0/_inst/lib/mesos/modules\"> -I../../include -I../../3rdparty/libprocess/include -I../../3rdparty/libprocess/3rdparty/stout/include -I../include -I../include/mesos -isystem ../3rdparty/libprocess/3rdparty/boost-1.53.0 -I../3rdparty/libprocess/3rdparty/picojson-1.3.0 -DPICOJSON_USE_INT64 -D__STDC_FORMAT_MACROS -I../3rdparty/libprocess/3rdparty/protobuf-2.5.0/src -I../3rdparty/libprocess/3rdparty/glog-0.3.3/src -I../3rdparty/libprocess/3rdparty/glog-0.3.3/src -I../3rdparty/leveldb-1.4/include -I../3rdparty/zookeeper-3.4.5/src/c/include -I../3rdparty/zookeeper-3.4.5/src/c/generated -I../3rdparty/libprocess/3rdparty/protobuf-2.5.0/src -DSOURCE_DIR=\"<https://builds.apache.org/job/mesos-reviewbot/ws/mesos-0.29.0/_build/..\"> -DBUILD_DIR=\"<https://builds.apache.org/job/mesos-reviewbot/ws/mesos-0.29.0/_build\"> -I../3rdparty/libprocess/3rdparty/gmock-1.7.0/gtest/include -I../3rdparty/libprocess/3rdparty/gmock-1.7.0/include -DTESTLIBEXECDIR=\"<https://builds.apache.org/job/mesos-reviewbot/ws/mesos-0.29.0/_inst/libexec/mesos/tests\"> -DSBINDIR=\"<https://builds.apache.org/job/mesos-reviewbot/ws/mesos-0.29.0/_inst/sbin\"> -I/home/jenkins/tools/java/jdk1.6.0_20-64/include -I/home/jenkins/tools/java/jdk1.6.0_20-64/include/linux -DZOOKEEPER_VERSION=\"3.4.5\" -I/usr/include/subversion-1 -I/usr/include/apr-1 -I/usr/include/apr-1.0  -pthread -g1 -O0 -Wno-unused-local-typedefs -std=c++11 -MT tests/mesos_tests-credentials_tests.o -MD -MP -MF tests/.deps/mesos_tests-credentials_tests.Tpo -c -o tests/mesos_tests-credentials_tests.o `test -f 'tests/credentials_tests.cpp' || echo '../../src/'`tests/credentials_tests.cpp
mv -f slave/qos_controllers/.deps/mesos_tests-load.Tpo slave/qos_controllers/.deps/mesos_tests-load.Po
g++ -DPACKAGE_NAME=\"mesos\" -DPACKAGE_TARNAME=\"mesos\" -DPACKAGE_VERSION=\"0.29.0\" -DPACKAGE_STRING=\"mesos\ 0.29.0\" -DPACKAGE_BUGREPORT=\"\" -DPACKAGE_URL=\"\" -DPACKAGE=\"mesos\" -DVERSION=\"0.29.0\" -DSTDC_HEADERS=1 -DHAVE_SYS_TYPES_H=1 -DHAVE_SYS_STAT_H=1 -DHAVE_STDLIB_H=1 -DHAVE_STRING_H=1 -DHAVE_MEMORY_H=1 -DHAVE_STRINGS_H=1 -DHAVE_INTTYPES_H=1 -DHAVE_STDINT_H=1 -DHAVE_UNISTD_H=1 -DHAVE_DLFCN_H=1 -DLT_OBJDIR=\".libs/\" -DHAVE_CXX11=1 -DHAVE_PTHREAD_PRIO_INHERIT=1 -DHAVE_PTHREAD=1 -DHAVE_LIBZ=1 -DHAVE_LIBCURL=1 -DHAVE_APR_POOLS_H=1 -DHAVE_LIBAPR_1=1 -DHAVE_SVN_VERSION_H=1 -DHAVE_LIBSVN_SUBR_1=1 -DHAVE_SVN_DELTA_H=1 -DHAVE_LIBSVN_DELTA_1=1 -DHAVE_LIBSASL2=1 -DMESOS_HAS_JAVA=1 -DHAVE_PYTHON=\"2.7\" -DMESOS_HAS_PYTHON=1 -I. -I../../src   -Wall -Werror -DLIBDIR=\"<https://builds.apache.org/job/mesos-reviewbot/ws/mesos-0.29.0/_inst/lib\"> -DPKGLIBEXECDIR=\"<https://builds.apache.org/job/mesos-reviewbot/ws/mesos-0.29.0/_inst/libexec/mesos\"> -DPKGDATADIR=\"<https://builds.apache.org/job/mesos-reviewbot/ws/mesos-0.29.0/_inst/share/mesos\"> -DPKGMODULEDIR=\"<https://builds.apache.org/job/mesos-reviewbot/ws/mesos-0.29.0/_inst/lib/mesos/modules\"> -I../../include -I../../3rdparty/libprocess/include -I../../3rdparty/libprocess/3rdparty/stout/include -I../include -I../include/mesos -isystem ../3rdparty/libprocess/3rdparty/boost-1.53.0 -I../3rdparty/libprocess/3rdparty/picojson-1.3.0 -DPICOJSON_USE_INT64 -D__STDC_FORMAT_MACROS -I../3rdparty/libprocess/3rdparty/protobuf-2.5.0/src -I../3rdparty/libprocess/3rdparty/glog-0.3.3/src -I../3rdparty/libprocess/3rdparty/glog-0.3.3/src -I../3rdparty/leveldb-1.4/include -I../3rdparty/zookeeper-3.4.5/src/c/include -I../3rdparty/zookeeper-3.4.5/src/c/generated -I../3rdparty/libprocess/3rdparty/protobuf-2.5.0/src -DSOURCE_DIR=\"<https://builds.apache.org/job/mesos-reviewbot/ws/mesos-0.29.0/_build/..\"> -DBUILD_DIR=\"<https://builds.apache.org/job/mesos-reviewbot/ws/mesos-0.29.0/_build\"> -I../3rdparty/libprocess/3rdparty/gmock-1.7.0/gtest/include -I../3rdparty/libprocess/3rdparty/gmock-1.7.0/include -DTESTLIBEXECDIR=\"<https://builds.apache.org/job/mesos-reviewbot/ws/mesos-0.29.0/_inst/libexec/mesos/tests\"> -DSBINDIR=\"<https://builds.apache.org/job/mesos-reviewbot/ws/mesos-0.29.0/_inst/sbin\"> -I/home/jenkins/tools/java/jdk1.6.0_20-64/include -I/home/jenkins/tools/java/jdk1.6.0_20-64/include/linux -DZOOKEEPER_VERSION=\"3.4.5\" -I/usr/include/subversion-1 -I/usr/include/apr-1 -I/usr/include/apr-1.0  -pthread -g1 -O0 -Wno-unused-local-typedefs -std=c++11 -MT tests/mesos_tests-disk_quota_tests.o -MD -MP -MF tests/.deps/mesos_tests-disk_quota_tests.Tpo -c -o tests/mesos_tests-disk_quota_tests.o `test -f 'tests/disk_quota_tests.cpp' || echo '../../src/'`tests/disk_quota_tests.cpp
mv -f tests/.deps/mesos_tests-anonymous_tests.Tpo tests/.deps/mesos_tests-anonymous_tests.Po
g++ -DPACKAGE_NAME=\"mesos\" -DPACKAGE_TARNAME=\"mesos\" -DPACKAGE_VERSION=\"0.29.0\" -DPACKAGE_STRING=\"mesos\ 0.29.0\" -DPACKAGE_BUGREPORT=\"\" -DPACKAGE_URL=\"\" -DPACKAGE=\"mesos\" -DVERSION=\"0.29.0\" -DSTDC_HEADERS=1 -DHAVE_SYS_TYPES_H=1 -DHAVE_SYS_STAT_H=1 -DHAVE_STDLIB_H=1 -DHAVE_STRING_H=1 -DHAVE_MEMORY_H=1 -DHAVE_STRINGS_H=1 -DHAVE_INTTYPES_H=1 -DHAVE_STDINT_H=1 -DHAVE_UNISTD_H=1 -DHAVE_DLFCN_H=1 -DLT_OBJDIR=\".libs/\" -DHAVE_CXX11=1 -DHAVE_PTHREAD_PRIO_INHERIT=1 -DHAVE_PTHREAD=1 -DHAVE_LIBZ=1 -DHAVE_LIBCURL=1 -DHAVE_APR_POOLS_H=1 -DHAVE_LIBAPR_1=1 -DHAVE_SVN_VERSION_H=1 -DHAVE_LIBSVN_SUBR_1=1 -DHAVE_SVN_DELTA_H=1 -DHAVE_LIBSVN_DELTA_1=1 -DHAVE_LIBSASL2=1 -DMESOS_HAS_JAVA=1 -DHAVE_PYTHON=\"2.7\" -DMESOS_HAS_PYTHON=1 -I. -I../../src   -Wall -Werror -DLIBDIR=\"<https://builds.apache.org/job/mesos-reviewbot/ws/mesos-0.29.0/_inst/lib\"> -DPKGLIBEXECDIR=\"<https://builds.apache.org/job/mesos-reviewbot/ws/mesos-0.29.0/_inst/libexec/mesos\"> -DPKGDATADIR=\"<https://builds.apache.org/job/mesos-reviewbot/ws/mesos-0.29.0/_inst/share/mesos\"> -DPKGMODULEDIR=\"<https://builds.apache.org/job/mesos-reviewbot/ws/mesos-0.29.0/_inst/lib/mesos/modules\"> -I../../include -I../../3rdparty/libprocess/include -I../../3rdparty/libprocess/3rdparty/stout/include -I../include -I../include/mesos -isystem ../3rdparty/libprocess/3rdparty/boost-1.53.0 -I../3rdparty/libprocess/3rdparty/picojson-1.3.0 -DPICOJSON_USE_INT64 -D__STDC_FORMAT_MACROS -I../3rdparty/libprocess/3rdparty/protobuf-2.5.0/src -I../3rdparty/libprocess/3rdparty/glog-0.3.3/src -I../3rdparty/libprocess/3rdparty/glog-0.3.3/src -I../3rdparty/leveldb-1.4/include -I../3rdparty/zookeeper-3.4.5/src/c/include -I../3rdparty/zookeeper-3.4.5/src/c/generated -I../3rdparty/libprocess/3rdparty/protobuf-2.5.0/src -DSOURCE_DIR=\"<https://builds.apache.org/job/mesos-reviewbot/ws/mesos-0.29.0/_build/..\"> -DBUILD_DIR=\"<https://builds.apache.org/job/mesos-reviewbot/ws/mesos-0.29.0/_build\"> -I../3rdparty/libprocess/3rdparty/gmock-1.7.0/gtest/include -I../3rdparty/libprocess/3rdparty/gmock-1.7.0/include -DTESTLIBEXECDIR=\"<https://builds.apache.org/job/mesos-reviewbot/ws/mesos-0.29.0/_inst/libexec/mesos/tests\"> -DSBINDIR=\"<https://builds.apache.org/job/mesos-reviewbot/ws/mesos-0.29.0/_inst/sbin\"> -I/home/jenkins/tools/java/jdk1.6.0_20-64/include -I/home/jenkins/tools/java/jdk1.6.0_20-64/include/linux -DZOOKEEPER_VERSION=\"3.4.5\" -I/usr/include/subversion-1 -I/usr/include/apr-1 -I/usr/include/apr-1.0  -pthread -g1 -O0 -Wno-unused-local-typedefs -std=c++11 -MT tests/mesos_tests-dynamic_weights_tests.o -MD -MP -MF tests/.deps/mesos_tests-dynamic_weights_tests.Tpo -c -o tests/mesos_tests-dynamic_weights_tests.o `test -f 'tests/dynamic_weights_tests.cpp' || echo '../../src/'`tests/dynamic_weights_tests.cpp
mv -f tests/.deps/mesos_tests-command_executor_tests.Tpo tests/.deps/mesos_tests-command_executor_tests.Po
g++ -DPACKAGE_NAME=\"mesos\" -DPACKAGE_TARNAME=\"mesos\" -DPACKAGE_VERSION=\"0.29.0\" -DPACKAGE_STRING=\"mesos\ 0.29.0\" -DPACKAGE_BUGREPORT=\"\" -DPACKAGE_URL=\"\" -DPACKAGE=\"mesos\" -DVERSION=\"0.29.0\" -DSTDC_HEADERS=1 -DHAVE_SYS_TYPES_H=1 -DHAVE_SYS_STAT_H=1 -DHAVE_STDLIB_H=1 -DHAVE_STRING_H=1 -DHAVE_MEMORY_H=1 -DHAVE_STRINGS_H=1 -DHAVE_INTTYPES_H=1 -DHAVE_STDINT_H=1 -DHAVE_UNISTD_H=1 -DHAVE_DLFCN_H=1 -DLT_OBJDIR=\".libs/\" -DHAVE_CXX11=1 -DHAVE_PTHREAD_PRIO_INHERIT=1 -DHAVE_PTHREAD=1 -DHAVE_LIBZ=1 -DHAVE_LIBCURL=1 -DHAVE_APR_POOLS_H=1 -DHAVE_LIBAPR_1=1 -DHAVE_SVN_VERSION_H=1 -DHAVE_LIBSVN_SUBR_1=1 -DHAVE_SVN_DELTA_H=1 -DHAVE_LIBSVN_DELTA_1=1 -DHAVE_LIBSASL2=1 -DMESOS_HAS_JAVA=1 -DHAVE_PYTHON=\"2.7\" -DMESOS_HAS_PYTHON=1 -I. -I../../src   -Wall -Werror -DLIBDIR=\"<https://builds.apache.org/job/mesos-reviewbot/ws/mesos-0.29.0/_inst/lib\"> -DPKGLIBEXECDIR=\"<https://builds.apache.org/job/mesos-reviewbot/ws/mesos-0.29.0/_inst/libexec/mesos\"> -DPKGDATADIR=\"<https://builds.apache.org/job/mesos-reviewbot/ws/mesos-0.29.0/_inst/share/mesos\"> -DPKGMODULEDIR=\"<https://builds.apache.org/job/mesos-reviewbot/ws/mesos-0.29.0/_inst/lib/mesos/modules\"> -I../../include -I../../3rdparty/libprocess/include -I../../3rdparty/libprocess/3rdparty/stout/include -I../include -I../include/mesos -isystem ../3rdparty/libprocess/3rdparty/boost-1.53.0 -I../3rdparty/libprocess/3rdparty/picojson-1.3.0 -DPICOJSON_USE_INT64 -D__STDC_FORMAT_MACROS -I../3rdparty/libprocess/3rdparty/protobuf-2.5.0/src -I../3rdparty/libprocess/3rdparty/glog-0.3.3/src -I../3rdparty/libprocess/3rdparty/glog-0.3.3/src -I../3rdparty/leveldb-1.4/include -I../3rdparty/zookeeper-3.4.5/src/c/include -I../3rdparty/zookeeper-3.4.5/src/c/generated -I../3rdparty/libprocess/3rdparty/protobuf-2.5.0/src -DSOURCE_DIR=\"<https://builds.apache.org/job/mesos-reviewbot/ws/mesos-0.29.0/_build/..\"> -DBUILD_DIR=\"<https://builds.apache.org/job/mesos-reviewbot/ws/mesos-0.29.0/_build\"> -I../3rdparty/libprocess/3rdparty/gmock-1.7.0/gtest/include -I../3rdparty/libprocess/3rdparty/gmock-1.7.0/include -DTESTLIBEXECDIR=\"<https://builds.apache.org/job/mesos-reviewbot/ws/mesos-0.29.0/_inst/libexec/mesos/tests\"> -DSBINDIR=\"<https://builds.apache.org/job/mesos-reviewbot/ws/mesos-0.29.0/_inst/sbin\"> -I/home/jenkins/tools/java/jdk1.6.0_20-64/include -I/home/jenkins/tools/java/jdk1.6.0_20-64/include/linux -DZOOKEEPER_VERSION=\"3.4.5\" -I/usr/include/subversion-1 -I/usr/include/apr-1 -I/usr/include/apr-1.0  -pthread -g1 -O0 -Wno-unused-local-typedefs -std=c++11 -MT tests/mesos_tests-environment.o -MD -MP -MF tests/.deps/mesos_tests-environment.Tpo -c -o tests/mesos_tests-environment.o `test -f 'tests/environment.cpp' || echo '../../src/'`tests/environment.cpp
mv -f tests/.deps/mesos_tests-cluster.Tpo tests/.deps/mesos_tests-cluster.Po
g++ -DPACKAGE_NAME=\"mesos\" -DPACKAGE_TARNAME=\"mesos\" -DPACKAGE_VERSION=\"0.29.0\" -DPACKAGE_STRING=\"mesos\ 0.29.0\" -DPACKAGE_BUGREPORT=\"\" -DPACKAGE_URL=\"\" -DPACKAGE=\"mesos\" -DVERSION=\"0.29.0\" -DSTDC_HEADERS=1 -DHAVE_SYS_TYPES_H=1 -DHAVE_SYS_STAT_H=1 -DHAVE_STDLIB_H=1 -DHAVE_STRING_H=1 -DHAVE_MEMORY_H=1 -DHAVE_STRINGS_H=1 -DHAVE_INTTYPES_H=1 -DHAVE_STDINT_H=1 -DHAVE_UNISTD_H=1 -DHAVE_DLFCN_H=1 -DLT_OBJDIR=\".libs/\" -DHAVE_CXX11=1 -DHAVE_PTHREAD_PRIO_INHERIT=1 -DHAVE_PTHREAD=1 -DHAVE_LIBZ=1 -DHAVE_LIBCURL=1 -DHAVE_APR_POOLS_H=1 -DHAVE_LIBAPR_1=1 -DHAVE_SVN_VERSION_H=1 -DHAVE_LIBSVN_SUBR_1=1 -DHAVE_SVN_DELTA_H=1 -DHAVE_LIBSVN_DELTA_1=1 -DHAVE_LIBSASL2=1 -DMESOS_HAS_JAVA=1 -DHAVE_PYTHON=\"2.7\" -DMESOS_HAS_PYTHON=1 -I. -I../../src   -Wall -Werror -DLIBDIR=\"<https://builds.apache.org/job/mesos-reviewbot/ws/mesos-0.29.0/_inst/lib\"> -DPKGLIBEXECDIR=\"<https://builds.apache.org/job/mesos-reviewbot/ws/mesos-0.29.0/_inst/libexec/mesos\"> -DPKGDATADIR=\"<https://builds.apache.org/job/mesos-reviewbot/ws/mesos-0.29.0/_inst/share/mesos\"> -DPKGMODULEDIR=\"<https://builds.apache.org/job/mesos-reviewbot/ws/mesos-0.29.0/_inst/lib/mesos/modules\"> -I../../include -I../../3rdparty/libprocess/include -I../../3rdparty/libprocess/3rdparty/stout/include -I../include -I../include/mesos -isystem ../3rdparty/libprocess/3rdparty/boost-1.53.0 -I../3rdparty/libprocess/3rdparty/picojson-1.3.0 -DPICOJSON_USE_INT64 -D__STDC_FORMAT_MACROS -I../3rdparty/libprocess/3rdparty/protobuf-2.5.0/src -I../3rdparty/libprocess/3rdparty/glog-0.3.3/src -I../3rdparty/libprocess/3rdparty/glog-0.3.3/src -I../3rdparty/leveldb-1.4/include -I../3rdparty/zookeeper-3.4.5/src/c/include -I../3rdparty/zookeeper-3.4.5/src/c/generated -I../3rdparty/libprocess/3rdparty/protobuf-2.5.0/src -DSOURCE_DIR=\"<https://builds.apache.org/job/mesos-reviewbot/ws/mesos-0.29.0/_build/..\"> -DBUILD_DIR=\"<https://builds.apache.org/job/mesos-reviewbot/ws/mesos-0.29.0/_build\"> -I../3rdparty/libprocess/3rdparty/gmock-1.7.0/gtest/include -I../3rdparty/libprocess/3rdparty/gmock-1.7.0/include -DTESTLIBEXECDIR=\"<https://builds.apache.org/job/mesos-reviewbot/ws/mesos-0.29.0/_inst/libexec/mesos/tests\"> -DSBINDIR=\"<https://builds.apache.org/job/mesos-reviewbot/ws/mesos-0.29.0/_inst/sbin\"> -I/home/jenkins/tools/java/jdk1.6.0_20-64/include -I/home/jenkins/tools/java/jdk1.6.0_20-64/include/linux -DZOOKEEPER_VERSION=\"3.4.5\" -I/usr/include/subversion-1 -I/usr/include/apr-1 -I/usr/include/apr-1.0  -pthread -g1 -O0 -Wno-unused-local-typedefs -std=c++11 -MT tests/mesos_tests-examples_tests.o -MD -MP -MF tests/.deps/mesos_tests-examples_tests.Tpo -c -o tests/mesos_tests-examples_tests.o `test -f 'tests/examples_tests.cpp' || echo '../../src/'`tests/examples_tests.cpp
mv -f tests/.deps/mesos_tests-authorization_tests.Tpo tests/.deps/mesos_tests-authorization_tests.Po
g++ -DPACKAGE_NAME=\"mesos\" -DPACKAGE_TARNAME=\"mesos\" -DPACKAGE_VERSION=\"0.29.0\" -DPACKAGE_STRING=\"mesos\ 0.29.0\" -DPACKAGE_BUGREPORT=\"\" -DPACKAGE_URL=\"\" -DPACKAGE=\"mesos\" -DVERSION=\"0.29.0\" -DSTDC_HEADERS=1 -DHAVE_SYS_TYPES_H=1 -DHAVE_SYS_STAT_H=1 -DHAVE_STDLIB_H=1 -DHAVE_STRING_H=1 -DHAVE_MEMORY_H=1 -DHAVE_STRINGS_H=1 -DHAVE_INTTYPES_H=1 -DHAVE_STDINT_H=1 -DHAVE_UNISTD_H=1 -DHAVE_DLFCN_H=1 -DLT_OBJDIR=\".libs/\" -DHAVE_CXX11=1 -DHAVE_PTHREAD_PRIO_INHERIT=1 -DHAVE_PTHREAD=1 -DHAVE_LIBZ=1 -DHAVE_LIBCURL=1 -DHAVE_APR_POOLS_H=1 -DHAVE_LIBAPR_1=1 -DHAVE_SVN_VERSION_H=1 -DHAVE_LIBSVN_SUBR_1=1 -DHAVE_SVN_DELTA_H=1 -DHAVE_LIBSVN_DELTA_1=1 -DHAVE_LIBSASL2=1 -DMESOS_HAS_JAVA=1 -DHAVE_PYTHON=\"2.7\" -DMESOS_HAS_PYTHON=1 -I. -I../../src   -Wall -Werror -DLIBDIR=\"<https://builds.apache.org/job/mesos-reviewbot/ws/mesos-0.29.0/_inst/lib\"> -DPKGLIBEXECDIR=\"<https://builds.apache.org/job/mesos-reviewbot/ws/mesos-0.29.0/_inst/libexec/mesos\"> -DPKGDATADIR=\"<https://builds.apache.org/job/mesos-reviewbot/ws/mesos-0.29.0/_inst/share/mesos\"> -DPKGMODULEDIR=\"<https://builds.apache.org/job/mesos-reviewbot/ws/mesos-0.29.0/_inst/lib/mesos/modules\"> -I../../include -I../../3rdparty/libprocess/include -I../../3rdparty/libprocess/3rdparty/stout/include -I../include -I../include/mesos -isystem ../3rdparty/libprocess/3rdparty/boost-1.53.0 -I../3rdparty/libprocess/3rdparty/picojson-1.3.0 -DPICOJSON_USE_INT64 -D__STDC_FORMAT_MACROS -I../3rdparty/libprocess/3rdparty/protobuf-2.5.0/src -I../3rdparty/libprocess/3rdparty/glog-0.3.3/src -I../3rdparty/libprocess/3rdparty/glog-0.3.3/src -I../3rdparty/leveldb-1.4/include -I../3rdparty/zookeeper-3.4.5/src/c/include -I../3rdparty/zookeeper-3.4.5/src/c/generated -I../3rdparty/libprocess/3rdparty/protobuf-2.5.0/src -DSOURCE_DIR=\"<https://builds.apache.org/job/mesos-reviewbot/ws/mesos-0.29.0/_build/..\"> -DBUILD_DIR=\"<https://builds.apache.org/job/mesos-reviewbot/ws/mesos-0.29.0/_build\"> -I../3rdparty/libprocess/3rdparty/gmock-1.7.0/gtest/include -I../3rdparty/libprocess/3rdparty/gmock-1.7.0/include -DTESTLIBEXECDIR=\"<https://builds.apache.org/job/mesos-reviewbot/ws/mesos-0.29.0/_inst/libexec/mesos/tests\"> -DSBINDIR=\"<https://builds.apache.org/job/mesos-reviewbot/ws/mesos-0.29.0/_inst/sbin\"> -I/home/jenkins/tools/java/jdk1.6.0_20-64/include -I/home/jenkins/tools/java/jdk1.6.0_20-64/include/linux -DZOOKEEPER_VERSION=\"3.4.5\" -I/usr/include/subversion-1 -I/usr/include/apr-1 -I/usr/include/apr-1.0  -pthread -g1 -O0 -Wno-unused-local-typedefs -std=c++11 -MT tests/mesos_tests-exception_tests.o -MD -MP -MF tests/.deps/mesos_tests-exception_tests.Tpo -c -o tests/mesos_tests-exception_tests.o `test -f 'tests/exception_tests.cpp' || echo '../../src/'`tests/exception_tests.cpp
mv -f tests/.deps/mesos_tests-examples_tests.Tpo tests/.deps/mesos_tests-examples_tests.Po
g++ -DPACKAGE_NAME=\"mesos\" -DPACKAGE_TARNAME=\"mesos\" -DPACKAGE_VERSION=\"0.29.0\" -DPACKAGE_STRING=\"mesos\ 0.29.0\" -DPACKAGE_BUGREPORT=\"\" -DPACKAGE_URL=\"\" -DPACKAGE=\"mesos\" -DVERSION=\"0.29.0\" -DSTDC_HEADERS=1 -DHAVE_SYS_TYPES_H=1 -DHAVE_SYS_STAT_H=1 -DHAVE_STDLIB_H=1 -DHAVE_STRING_H=1 -DHAVE_MEMORY_H=1 -DHAVE_STRINGS_H=1 -DHAVE_INTTYPES_H=1 -DHAVE_STDINT_H=1 -DHAVE_UNISTD_H=1 -DHAVE_DLFCN_H=1 -DLT_OBJDIR=\".libs/\" -DHAVE_CXX11=1 -DHAVE_PTHREAD_PRIO_INHERIT=1 -DHAVE_PTHREAD=1 -DHAVE_LIBZ=1 -DHAVE_LIBCURL=1 -DHAVE_APR_POOLS_H=1 -DHAVE_LIBAPR_1=1 -DHAVE_SVN_VERSION_H=1 -DHAVE_LIBSVN_SUBR_1=1 -DHAVE_SVN_DELTA_H=1 -DHAVE_LIBSVN_DELTA_1=1 -DHAVE_LIBSASL2=1 -DMESOS_HAS_JAVA=1 -DHAVE_PYTHON=\"2.7\" -DMESOS_HAS_PYTHON=1 -I. -I../../src   -Wall -Werror -DLIBDIR=\"<https://builds.apache.org/job/mesos-reviewbot/ws/mesos-0.29.0/_inst/lib\"> -DPKGLIBEXECDIR=\"<https://builds.apache.org/job/mesos-reviewbot/ws/mesos-0.29.0/_inst/libexec/mesos\"> -DPKGDATADIR=\"<https://builds.apache.org/job/mesos-reviewbot/ws/mesos-0.29.0/_inst/share/mesos\"> -DPKGMODULEDIR=\"<https://builds.apache.org/job/mesos-reviewbot/ws/mesos-0.29.0/_inst/lib/mesos/modules\"> -I../../include -I../../3rdparty/libprocess/include -I../../3rdparty/libprocess/3rdparty/stout/include -I../include -I../include/mesos -isystem ../3rdparty/libprocess/3rdparty/boost-1.53.0 -I../3rdparty/libprocess/3rdparty/picojson-1.3.0 -DPICOJSON_USE_INT64 -D__STDC_FORMAT_MACROS -I../3rdparty/libprocess/3rdparty/protobuf-2.5.0/src -I../3rdparty/libprocess/3rdparty/glog-0.3.3/src -I../3rdparty/libprocess/3rdparty/glog-0.3.3/src -I../3rdparty/leveldb-1.4/include -I../3rdparty/zookeeper-3.4.5/src/c/include -I../3rdparty/zookeeper-3.4.5/src/c/generated -I../3rdparty/libprocess/3rdparty/protobuf-2.5.0/src -DSOURCE_DIR=\"<https://builds.apache.org/job/mesos-reviewbot/ws/mesos-0.29.0/_build/..\"> -DBUILD_DIR=\"<https://builds.apache.org/job/mesos-reviewbot/ws/mesos-0.29.0/_build\"> -I../3rdparty/libprocess/3rdparty/gmock-1.7.0/gtest/include -I../3rdparty/libprocess/3rdparty/gmock-1.7.0/include -DTESTLIBEXECDIR=\"<https://builds.apache.org/job/mesos-reviewbot/ws/mesos-0.29.0/_inst/libexec/mesos/tests\"> -DSBINDIR=\"<https://builds.apache.org/job/mesos-reviewbot/ws/mesos-0.29.0/_inst/sbin\"> -I/home/jenkins/tools/java/jdk1.6.0_20-64/include -I/home/jenkins/tools/java/jdk1.6.0_20-64/include/linux -DZOOKEEPER_VERSION=\"3.4.5\" -I/usr/include/subversion-1 -I/usr/include/apr-1 -I/usr/include/apr-1.0  -pthread -g1 -O0 -Wno-unused-local-typedefs -std=c++11 -MT tests/mesos_tests-executor_http_api_tests.o -MD -MP -MF tests/.deps/mesos_tests-executor_http_api_tests.Tpo -c -o tests/mesos_tests-executor_http_api_tests.o `test -f 'tests/executor_http_api_tests.cpp' || echo '../../src/'`tests/executor_http_api_tests.cpp
mv -f tests/.deps/mesos_tests-containerizer.Tpo tests/.deps/mesos_tests-containerizer.Po
g++ -DPACKAGE_NAME=\"mesos\" -DPACKAGE_TARNAME=\"mesos\" -DPACKAGE_VERSION=\"0.29.0\" -DPACKAGE_STRING=\"mesos\ 0.29.0\" -DPACKAGE_BUGREPORT=\"\" -DPACKAGE_URL=\"\" -DPACKAGE=\"mesos\" -DVERSION=\"0.29.0\" -DSTDC_HEADERS=1 -DHAVE_SYS_TYPES_H=1 -DHAVE_SYS_STAT_H=1 -DHAVE_STDLIB_H=1 -DHAVE_STRING_H=1 -DHAVE_MEMORY_H=1 -DHAVE_STRINGS_H=1 -DHAVE_INTTYPES_H=1 -DHAVE_STDINT_H=1 -DHAVE_UNISTD_H=1 -DHAVE_DLFCN_H=1 -DLT_OBJDIR=\".libs/\" -DHAVE_CXX11=1 -DHAVE_PTHREAD_PRIO_INHERIT=1 -DHAVE_PTHREAD=1 -DHAVE_LIBZ=1 -DHAVE_LIBCURL=1 -DHAVE_APR_POOLS_H=1 -DHAVE_LIBAPR_1=1 -DHAVE_SVN_VERSION_H=1 -DHAVE_LIBSVN_SUBR_1=1 -DHAVE_SVN_DELTA_H=1 -DHAVE_LIBSVN_DELTA_1=1 -DHAVE_LIBSASL2=1 -DMESOS_HAS_JAVA=1 -DHAVE_PYTHON=\"2.7\" -DMESOS_HAS_PYTHON=1 -I. -I../../src   -Wall -Werror -DLIBDIR=\"<https://builds.apache.org/job/mesos-reviewbot/ws/mesos-0.29.0/_inst/lib\"> -DPKGLIBEXECDIR=\"<https://builds.apache.org/job/mesos-reviewbot/ws/mesos-0.29.0/_inst/libexec/mesos\"> -DPKGDATADIR=\"<https://builds.apache.org/job/mesos-reviewbot/ws/mesos-0.29.0/_inst/share/mesos\"> -DPKGMODULEDIR=\"<https://builds.apache.org/job/mesos-reviewbot/ws/mesos-0.29.0/_inst/lib/mesos/modules\"> -I../../include -I../../3rdparty/libprocess/include -I../../3rdparty/libprocess/3rdparty/stout/include -I../include -I../include/mesos -isystem ../3rdparty/libprocess/3rdparty/boost-1.53.0 -I../3rdparty/libprocess/3rdparty/picojson-1.3.0 -DPICOJSON_USE_INT64 -D__STDC_FORMAT_MACROS -I../3rdparty/libprocess/3rdparty/protobuf-2.5.0/src -I../3rdparty/libprocess/3rdparty/glog-0.3.3/src -I../3rdparty/libprocess/3rdparty/glog-0.3.3/src -I../3rdparty/leveldb-1.4/include -I../3rdparty/zookeeper-3.4.5/src/c/include -I../3rdparty/zookeeper-3.4.5/src/c/generated -I../3rdparty/libprocess/3rdparty/protobuf-2.5.0/src -DSOURCE_DIR=\"<https://builds.apache.org/job/mesos-reviewbot/ws/mesos-0.29.0/_build/..\"> -DBUILD_DIR=\"<https://builds.apache.org/job/mesos-reviewbot/ws/mesos-0.29.0/_build\"> -I../3rdparty/libprocess/3rdparty/gmock-1.7.0/gtest/include -I../3rdparty/libprocess/3rdparty/gmock-1.7.0/include -DTESTLIBEXECDIR=\"<https://builds.apache.org/job/mesos-reviewbot/ws/mesos-0.29.0/_inst/libexec/mesos/tests\"> -DSBINDIR=\"<https://builds.apache.org/job/mesos-reviewbot/ws/mesos-0.29.0/_inst/sbin\"> -I/home/jenkins/tools/java/jdk1.6.0_20-64/include -I/home/jenkins/tools/java/jdk1.6.0_20-64/include/linux -DZOOKEEPER_VERSION=\"3.4.5\" -I/usr/include/subversion-1 -I/usr/include/apr-1 -I/usr/include/apr-1.0  -pthread -g1 -O0 -Wno-unused-local-typedefs -std=c++11 -MT tests/mesos_tests-fault_tolerance_tests.o -MD -MP -MF tests/.deps/mesos_tests-fault_tolerance_tests.Tpo -c -o tests/mesos_tests-fault_tolerance_tests.o `test -f 'tests/fault_tolerance_tests.cpp' || echo '../../src/'`tests/fault_tolerance_tests.cpp
mv -f tests/.deps/mesos_tests-credentials_tests.Tpo tests/.deps/mesos_tests-credentials_tests.Po
g++ -DPACKAGE_NAME=\"mesos\" -DPACKAGE_TARNAME=\"mesos\" -DPACKAGE_VERSION=\"0.29.0\" -DPACKAGE_STRING=\"mesos\ 0.29.0\" -DPACKAGE_BUGREPORT=\"\" -DPACKAGE_URL=\"\" -DPACKAGE=\"mesos\" -DVERSION=\"0.29.0\" -DSTDC_HEADERS=1 -DHAVE_SYS_TYPES_H=1 -DHAVE_SYS_STAT_H=1 -DHAVE_STDLIB_H=1 -DHAVE_STRING_H=1 -DHAVE_MEMORY_H=1 -DHAVE_STRINGS_H=1 -DHAVE_INTTYPES_H=1 -DHAVE_STDINT_H=1 -DHAVE_UNISTD_H=1 -DHAVE_DLFCN_H=1 -DLT_OBJDIR=\".libs/\" -DHAVE_CXX11=1 -DHAVE_PTHREAD_PRIO_INHERIT=1 -DHAVE_PTHREAD=1 -DHAVE_LIBZ=1 -DHAVE_LIBCURL=1 -DHAVE_APR_POOLS_H=1 -DHAVE_LIBAPR_1=1 -DHAVE_SVN_VERSION_H=1 -DHAVE_LIBSVN_SUBR_1=1 -DHAVE_SVN_DELTA_H=1 -DHAVE_LIBSVN_DELTA_1=1 -DHAVE_LIBSASL2=1 -DMESOS_HAS_JAVA=1 -DHAVE_PYTHON=\"2.7\" -DMESOS_HAS_PYTHON=1 -I. -I../../src   -Wall -Werror -DLIBDIR=\"<https://builds.apache.org/job/mesos-reviewbot/ws/mesos-0.29.0/_inst/lib\"> -DPKGLIBEXECDIR=\"<https://builds.apache.org/job/mesos-reviewbot/ws/mesos-0.29.0/_inst/libexec/mesos\"> -DPKGDATADIR=\"<https://builds.apache.org/job/mesos-reviewbot/ws/mesos-0.29.0/_inst/share/mesos\"> -DPKGMODULEDIR=\"<https://builds.apache.org/job/mesos-reviewbot/ws/mesos-0.29.0/_inst/lib/mesos/modules\"> -I../../include -I../../3rdparty/libprocess/include -I../../3rdparty/libprocess/3rdparty/stout/include -I../include -I../include/mesos -isystem ../3rdparty/libprocess/3rdparty/boost-1.53.0 -I../3rdparty/libprocess/3rdparty/picojson-1.3.0 -DPICOJSON_USE_INT64 -D__STDC_FORMAT_MACROS -I../3rdparty/libprocess/3rdparty/protobuf-2.5.0/src -I../3rdparty/libprocess/3rdparty/glog-0.3.3/src -I../3rdparty/libprocess/3rdparty/glog-0.3.3/src -I../3rdparty/leveldb-1.4/include -I../3rdparty/zookeeper-3.4.5/src/c/include -I../3rdparty/zookeeper-3.4.5/src/c/generated -I../3rdparty/libprocess/3rdparty/protobuf-2.5.0/src -DSOURCE_DIR=\"<https://builds.apache.org/job/mesos-reviewbot/ws/mesos-0.29.0/_build/..\"> -DBUILD_DIR=\"<https://builds.apache.org/job/mesos-reviewbot/ws/mesos-0.29.0/_build\"> -I../3rdparty/libprocess/3rdparty/gmock-1.7.0/gtest/include -I../3rdparty/libprocess/3rdparty/gmock-1.7.0/include -DTESTLIBEXECDIR=\"<https://builds.apache.org/job/mesos-reviewbot/ws/mesos-0.29.0/_inst/libexec/mesos/tests\"> -DSBINDIR=\"<https://builds.apache.org/job/mesos-reviewbot/ws/mesos-0.29.0/_inst/sbin\"> -I/home/jenkins/tools/java/jdk1.6.0_20-64/include -I/home/jenkins/tools/java/jdk1.6.0_20-64/include/linux -DZOOKEEPER_VERSION=\"3.4.5\" -I/usr/include/subversion-1 -I/usr/include/apr-1 -I/usr/include/apr-1.0  -pthread -g1 -O0 -Wno-unused-local-typedefs -std=c++11 -MT tests/mesos_tests-fetcher_cache_tests.o -MD -MP -MF tests/.deps/mesos_tests-fetcher_cache_tests.Tpo -c -o tests/mesos_tests-fetcher_cache_tests.o `test -f 'tests/fetcher_cache_tests.cpp' || echo '../../src/'`tests/fetcher_cache_tests.cpp
mv -f tests/.deps/mesos_tests-authentication_tests.Tpo tests/.deps/mesos_tests-authentication_tests.Po
g++ -DPACKAGE_NAME=\"mesos\" -DPACKAGE_TARNAME=\"mesos\" -DPACKAGE_VERSION=\"0.29.0\" -DPACKAGE_STRING=\"mesos\ 0.29.0\" -DPACKAGE_BUGREPORT=\"\" -DPACKAGE_URL=\"\" -DPACKAGE=\"mesos\" -DVERSION=\"0.29.0\" -DSTDC_HEADERS=1 -DHAVE_SYS_TYPES_H=1 -DHAVE_SYS_STAT_H=1 -DHAVE_STDLIB_H=1 -DHAVE_STRING_H=1 -DHAVE_MEMORY_H=1 -DHAVE_STRINGS_H=1 -DHAVE_INTTYPES_H=1 -DHAVE_STDINT_H=1 -DHAVE_UNISTD_H=1 -DHAVE_DLFCN_H=1 -DLT_OBJDIR=\".libs/\" -DHAVE_CXX11=1 -DHAVE_PTHREAD_PRIO_INHERIT=1 -DHAVE_PTHREAD=1 -DHAVE_LIBZ=1 -DHAVE_LIBCURL=1 -DHAVE_APR_POOLS_H=1 -DHAVE_LIBAPR_1=1 -DHAVE_SVN_VERSION_H=1 -DHAVE_LIBSVN_SUBR_1=1 -DHAVE_SVN_DELTA_H=1 -DHAVE_LIBSVN_DELTA_1=1 -DHAVE_LIBSASL2=1 -DMESOS_HAS_JAVA=1 -DHAVE_PYTHON=\"2.7\" -DMESOS_HAS_PYTHON=1 -I. -I../../src   -Wall -Werror -DLIBDIR=\"<https://builds.apache.org/job/mesos-reviewbot/ws/mesos-0.29.0/_inst/lib\"> -DPKGLIBEXECDIR=\"<https://builds.apache.org/job/mesos-reviewbot/ws/mesos-0.29.0/_inst/libexec/mesos\"> -DPKGDATADIR=\"<https://builds.apache.org/job/mesos-reviewbot/ws/mesos-0.29.0/_inst/share/mesos\"> -DPKGMODULEDIR=\"<https://builds.apache.org/job/mesos-reviewbot/ws/mesos-0.29.0/_inst/lib/mesos/modules\"> -I../../include -I../../3rdparty/libprocess/include -I../../3rdparty/libprocess/3rdparty/stout/include -I../include -I../include/mesos -isystem ../3rdparty/libprocess/3rdparty/boost-1.53.0 -I../3rdparty/libprocess/3rdparty/picojson-1.3.0 -DPICOJSON_USE_INT64 -D__STDC_FORMAT_MACROS -I../3rdparty/libprocess/3rdparty/protobuf-2.5.0/src -I../3rdparty/libprocess/3rdparty/glog-0.3.3/src -I../3rdparty/libprocess/3rdparty/glog-0.3.3/src -I../3rdparty/leveldb-1.4/include -I../3rdparty/zookeeper-3.4.5/src/c/include -I../3rdparty/zookeeper-3.4.5/src/c/generated -I../3rdparty/libprocess/3rdparty/protobuf-2.5.0/src -DSOURCE_DIR=\"<https://builds.apache.org/job/mesos-reviewbot/ws/mesos-0.29.0/_build/..\"> -DBUILD_DIR=\"<https://builds.apache.org/job/mesos-reviewbot/ws/mesos-0.29.0/_build\"> -I../3rdparty/libprocess/3rdparty/gmock-1.7.0/gtest/include -I../3rdparty/libprocess/3rdparty/gmock-1.7.0/include -DTESTLIBEXECDIR=\"<https://builds.apache.org/job/mesos-reviewbot/ws/mesos-0.29.0/_inst/libexec/mesos/tests\"> -DSBINDIR=\"<https://builds.apache.org/job/mesos-reviewbot/ws/mesos-0.29.0/_inst/sbin\"> -I/home/jenkins/tools/java/jdk1.6.0_20-64/include -I/home/jenkins/tools/java/jdk1.6.0_20-64/include/linux -DZOOKEEPER_VERSION=\"3.4.5\" -I/usr/include/subversion-1 -I/usr/include/apr-1 -I/usr/include/apr-1.0  -pthread -g1 -O0 -Wno-unused-local-typedefs -std=c++11 -MT tests/mesos_tests-fetcher_tests.o -MD -MP -MF tests/.deps/mesos_tests-fetcher_tests.Tpo -c -o tests/mesos_tests-fetcher_tests.o `test -f 'tests/fetcher_tests.cpp' || echo '../../src/'`tests/fetcher_tests.cpp
mv -f tests/.deps/mesos_tests-cram_md5_authentication_tests.Tpo tests/.deps/mesos_tests-cram_md5_authentication_tests.Po
g++ -DPACKAGE_NAME=\"mesos\" -DPACKAGE_TARNAME=\"mesos\" -DPACKAGE_VERSION=\"0.29.0\" -DPACKAGE_STRING=\"mesos\ 0.29.0\" -DPACKAGE_BUGREPORT=\"\" -DPACKAGE_URL=\"\" -DPACKAGE=\"mesos\" -DVERSION=\"0.29.0\" -DSTDC_HEADERS=1 -DHAVE_SYS_TYPES_H=1 -DHAVE_SYS_STAT_H=1 -DHAVE_STDLIB_H=1 -DHAVE_STRING_H=1 -DHAVE_MEMORY_H=1 -DHAVE_STRINGS_H=1 -DHAVE_INTTYPES_H=1 -DHAVE_STDINT_H=1 -DHAVE_UNISTD_H=1 -DHAVE_DLFCN_H=1 -DLT_OBJDIR=\".libs/\" -DHAVE_CXX11=1 -DHAVE_PTHREAD_PRIO_INHERIT=1 -DHAVE_PTHREAD=1 -DHAVE_LIBZ=1 -DHAVE_LIBCURL=1 -DHAVE_APR_POOLS_H=1 -DHAVE_LIBAPR_1=1 -DHAVE_SVN_VERSION_H=1 -DHAVE_LIBSVN_SUBR_1=1 -DHAVE_SVN_DELTA_H=1 -DHAVE_LIBSVN_DELTA_1=1 -DHAVE_LIBSASL2=1 -DMESOS_HAS_JAVA=1 -DHAVE_PYTHON=\"2.7\" -DMESOS_HAS_PYTHON=1 -I. -I../../src   -Wall -Werror -DLIBDIR=\"<https://builds.apache.org/job/mesos-reviewbot/ws/mesos-0.29.0/_inst/lib\"> -DPKGLIBEXECDIR=\"<https://builds.apache.org/job/mesos-reviewbot/ws/mesos-0.29.0/_inst/libexec/mesos\"> -DPKGDATADIR=\"<https://builds.apache.org/job/mesos-reviewbot/ws/mesos-0.29.0/_inst/share/mesos\"> -DPKGMODULEDIR=\"<https://builds.apache.org/job/mesos-reviewbot/ws/mesos-0.29.0/_inst/lib/mesos/modules\"> -I../../include -I../../3rdparty/libprocess/include -I../../3rdparty/libprocess/3rdparty/stout/include -I../include -I../include/mesos -isystem ../3rdparty/libprocess/3rdparty/boost-1.53.0 -I../3rdparty/libprocess/3rdparty/picojson-1.3.0 -DPICOJSON_USE_INT64 -D__STDC_FORMAT_MACROS -I../3rdparty/libprocess/3rdparty/protobuf-2.5.0/src -I../3rdparty/libprocess/3rdparty/glog-0.3.3/src -I../3rdparty/libprocess/3rdparty/glog-0.3.3/src -I../3rdparty/leveldb-1.4/include -I../3rdparty/zookeeper-3.4.5/src/c/include -I../3rdparty/zookeeper-3.4.5/src/c/generated -I../3rdparty/libprocess/3rdparty/protobuf-2.5.0/src -DSOURCE_DIR=\"<https://builds.apache.org/job/mesos-reviewbot/ws/mesos-0.29.0/_build/..\"> -DBUILD_DIR=\"<https://builds.apache.org/job/mesos-reviewbot/ws/mesos-0.29.0/_build\"> -I../3rdparty/libprocess/3rdparty/gmock-1.7.0/gtest/include -I../3rdparty/libprocess/3rdparty/gmock-1.7.0/include -DTESTLIBEXECDIR=\"<https://builds.apache.org/job/mesos-reviewbot/ws/mesos-0.29.0/_inst/libexec/mesos/tests\"> -DSBINDIR=\"<https://builds.apache.org/job/mesos-reviewbot/ws/mesos-0.29.0/_inst/sbin\"> -I/home/jenkins/tools/java/jdk1.6.0_20-64/include -I/home/jenkins/tools/java/jdk1.6.0_20-64/include/linux -DZOOKEEPER_VERSION=\"3.4.5\" -I/usr/include/subversion-1 -I/usr/include/apr-1 -I/usr/include/apr-1.0  -pthread -g1 -O0 -Wno-unused-local-typedefs -std=c++11 -MT tests/mesos_tests-files_tests.o -MD -MP -MF tests/.deps/mesos_tests-files_tests.Tpo -c -o tests/mesos_tests-files_tests.o `test -f 'tests/files_tests.cpp' || echo '../../src/'`tests/files_tests.cpp
mv -f tests/.deps/mesos_tests-environment.Tpo tests/.deps/mesos_tests-environment.Po
g++ -DPACKAGE_NAME=\"mesos\" -DPACKAGE_TARNAME=\"mesos\" -DPACKAGE_VERSION=\"0.29.0\" -DPACKAGE_STRING=\"mesos\ 0.29.0\" -DPACKAGE_BUGREPORT=\"\" -DPACKAGE_URL=\"\" -DPACKAGE=\"mesos\" -DVERSION=\"0.29.0\" -DSTDC_HEADERS=1 -DHAVE_SYS_TYPES_H=1 -DHAVE_SYS_STAT_H=1 -DHAVE_STDLIB_H=1 -DHAVE_STRING_H=1 -DHAVE_MEMORY_H=1 -DHAVE_STRINGS_H=1 -DHAVE_INTTYPES_H=1 -DHAVE_STDINT_H=1 -DHAVE_UNISTD_H=1 -DHAVE_DLFCN_H=1 -DLT_OBJDIR=\".libs/\" -DHAVE_CXX11=1 -DHAVE_PTHREAD_PRIO_INHERIT=1 -DHAVE_PTHREAD=1 -DHAVE_LIBZ=1 -DHAVE_LIBCURL=1 -DHAVE_APR_POOLS_H=1 -DHAVE_LIBAPR_1=1 -DHAVE_SVN_VERSION_H=1 -DHAVE_LIBSVN_SUBR_1=1 -DHAVE_SVN_DELTA_H=1 -DHAVE_LIBSVN_DELTA_1=1 -DHAVE_LIBSASL2=1 -DMESOS_HAS_JAVA=1 -DHAVE_PYTHON=\"2.7\" -DMESOS_HAS_PYTHON=1 -I. -I../../src   -Wall -Werror -DLIBDIR=\"<https://builds.apache.org/job/mesos-reviewbot/ws/mesos-0.29.0/_inst/lib\"> -DPKGLIBEXECDIR=\"<https://builds.apache.org/job/mesos-reviewbot/ws/mesos-0.29.0/_inst/libexec/mesos\"> -DPKGDATADIR=\"<https://builds.apache.org/job/mesos-reviewbot/ws/mesos-0.29.0/_inst/share/mesos\"> -DPKGMODULEDIR=\"<https://builds.apache.org/job/mesos-reviewbot/ws/mesos-0.29.0/_inst/lib/mesos/modules\"> -I../../include -I../../3rdparty/libprocess/include -I../../3rdparty/libprocess/3rdparty/stout/include -I../include -I../include/mesos -isystem ../3rdparty/libprocess/3rdparty/boost-1.53.0 -I../3rdparty/libprocess/3rdparty/picojson-1.3.0 -DPICOJSON_USE_INT64 -D__STDC_FORMAT_MACROS -I../3rdparty/libprocess/3rdparty/protobuf-2.5.0/src -I../3rdparty/libprocess/3rdparty/glog-0.3.3/src -I../3rdparty/libprocess/3rdparty/glog-0.3.3/src -I../3rdparty/leveldb-1.4/include -I../3rdparty/zookeeper-3.4.5/src/c/include -I../3rdparty/zookeeper-3.4.5/src/c/generated -I../3rdparty/libprocess/3rdparty/protobuf-2.5.0/src -DSOURCE_DIR=\"<https://builds.apache.org/job/mesos-reviewbot/ws/mesos-0.29.0/_build/..\"> -DBUILD_DIR=\"<https://builds.apache.org/job/mesos-reviewbot/ws/mesos-0.29.0/_build\"> -I../3rdparty/libprocess/3rdparty/gmock-1.7.0/gtest/include -I../3rdparty/libprocess/3rdparty/gmock-1.7.0/include -DTESTLIBEXECDIR=\"<https://builds.apache.org/job/mesos-reviewbot/ws/mesos-0.29.0/_inst/libexec/mesos/tests\"> -DSBINDIR=\"<https://builds.apache.org/job/mesos-reviewbot/ws/mesos-0.29.0/_inst/sbin\"> -I/home/jenkins/tools/java/jdk1.6.0_20-64/include -I/home/jenkins/tools/java/jdk1.6.0_20-64/include/linux -DZOOKEEPER_VERSION=\"3.4.5\" -I/usr/include/subversion-1 -I/usr/include/apr-1 -I/usr/include/apr-1.0  -pthread -g1 -O0 -Wno-unused-local-typedefs -std=c++11 -MT tests/mesos_tests-flags.o -MD -MP -MF tests/.deps/mesos_tests-flags.Tpo -c -o tests/mesos_tests-flags.o `test -f 'tests/flags.cpp' || echo '../../src/'`tests/flags.cpp
mv -f tests/.deps/mesos_tests-container_logger_tests.Tpo tests/.deps/mesos_tests-container_logger_tests.Po
g++ -DPACKAGE_NAME=\"mesos\" -DPACKAGE_TARNAME=\"mesos\" -DPACKAGE_VERSION=\"0.29.0\" -DPACKAGE_STRING=\"mesos\ 0.29.0\" -DPACKAGE_BUGREPORT=\"\" -DPACKAGE_URL=\"\" -DPACKAGE=\"mesos\" -DVERSION=\"0.29.0\" -DSTDC_HEADERS=1 -DHAVE_SYS_TYPES_H=1 -DHAVE_SYS_STAT_H=1 -DHAVE_STDLIB_H=1 -DHAVE_STRING_H=1 -DHAVE_MEMORY_H=1 -DHAVE_STRINGS_H=1 -DHAVE_INTTYPES_H=1 -DHAVE_STDINT_H=1 -DHAVE_UNISTD_H=1 -DHAVE_DLFCN_H=1 -DLT_OBJDIR=\".libs/\" -DHAVE_CXX11=1 -DHAVE_PTHREAD_PRIO_INHERIT=1 -DHAVE_PTHREAD=1 -DHAVE_LIBZ=1 -DHAVE_LIBCURL=1 -DHAVE_APR_POOLS_H=1 -DHAVE_LIBAPR_1=1 -DHAVE_SVN_VERSION_H=1 -DHAVE_LIBSVN_SUBR_1=1 -DHAVE_SVN_DELTA_H=1 -DHAVE_LIBSVN_DELTA_1=1 -DHAVE_LIBSASL2=1 -DMESOS_HAS_JAVA=1 -DHAVE_PYTHON=\"2.7\" -DMESOS_HAS_PYTHON=1 -I. -I../../src   -Wall -Werror -DLIBDIR=\"<https://builds.apache.org/job/mesos-reviewbot/ws/mesos-0.29.0/_inst/lib\"> -DPKGLIBEXECDIR=\"<https://builds.apache.org/job/mesos-reviewbot/ws/mesos-0.29.0/_inst/libexec/mesos\"> -DPKGDATADIR=\"<https://builds.apache.org/job/mesos-reviewbot/ws/mesos-0.29.0/_inst/share/mesos\"> -DPKGMODULEDIR=\"<https://builds.apache.org/job/mesos-reviewbot/ws/mesos-0.29.0/_inst/lib/mesos/modules\"> -I../../include -I../../3rdparty/libprocess/include -I../../3rdparty/libprocess/3rdparty/stout/include -I../include -I../include/mesos -isystem ../3rdparty/libprocess/3rdparty/boost-1.53.0 -I../3rdparty/libprocess/3rdparty/picojson-1.3.0 -DPICOJSON_USE_INT64 -D__STDC_FORMAT_MACROS -I../3rdparty/libprocess/3rdparty/protobuf-2.5.0/src -I../3rdparty/libprocess/3rdparty/glog-0.3.3/src -I../3rdparty/libprocess/3rdparty/glog-0.3.3/src -I../3rdparty/leveldb-1.4/include -I../3rdparty/zookeeper-3.4.5/src/c/include -I../3rdparty/zookeeper-3.4.5/src/c/generated -I../3rdparty/libprocess/3rdparty/protobuf-2.5.0/src -DSOURCE_DIR=\"<https://builds.apache.org/job/mesos-reviewbot/ws/mesos-0.29.0/_build/..\"> -DBUILD_DIR=\"<https://builds.apache.org/job/mesos-reviewbot/ws/mesos-0.29.0/_build\"> -I../3rdparty/libprocess/3rdparty/gmock-1.7.0/gtest/include -I../3rdparty/libprocess/3rdparty/gmock-1.7.0/include -DTESTLIBEXECDIR=\"<https://builds.apache.org/job/mesos-reviewbot/ws/mesos-0.29.0/_inst/libexec/mesos/tests\"> -DSBINDIR=\"<https://builds.apache.org/job/mesos-reviewbot/ws/mesos-0.29.0/_inst/sbin\"> -I/home/jenkins/tools/java/jdk1.6.0_20-64/include -I/home/jenkins/tools/java/jdk1.6.0_20-64/include/linux -DZOOKEEPER_VERSION=\"3.4.5\" -I/usr/include/subversion-1 -I/usr/include/apr-1 -I/usr/include/apr-1.0  -pthread -g1 -O0 -Wno-unused-local-typedefs -std=c++11 -MT tests/mesos_tests-gc_tests.o -MD -MP -MF tests/.deps/mesos_tests-gc_tests.Tpo -c -o tests/mesos_tests-gc_tests.o `test -f 'tests/gc_tests.cpp' || echo '../../src/'`tests/gc_tests.cpp
mv -f tests/.deps/mesos_tests-disk_quota_tests.Tpo tests/.deps/mesos_tests-disk_quota_tests.Po
g++ -DPACKAGE_NAME=\"mesos\" -DPACKAGE_TARNAME=\"mesos\" -DPACKAGE_VERSION=\"0.29.0\" -DPACKAGE_STRING=\"mesos\ 0.29.0\" -DPACKAGE_BUGREPORT=\"\" -DPACKAGE_URL=\"\" -DPACKAGE=\"mesos\" -DVERSION=\"0.29.0\" -DSTDC_HEADERS=1 -DHAVE_SYS_TYPES_H=1 -DHAVE_SYS_STAT_H=1 -DHAVE_STDLIB_H=1 -DHAVE_STRING_H=1 -DHAVE_MEMORY_H=1 -DHAVE_STRINGS_H=1 -DHAVE_INTTYPES_H=1 -DHAVE_STDINT_H=1 -DHAVE_UNISTD_H=1 -DHAVE_DLFCN_H=1 -DLT_OBJDIR=\".libs/\" -DHAVE_CXX11=1 -DHAVE_PTHREAD_PRIO_INHERIT=1 -DHAVE_PTHREAD=1 -DHAVE_LIBZ=1 -DHAVE_LIBCURL=1 -DHAVE_APR_POOLS_H=1 -DHAVE_LIBAPR_1=1 -DHAVE_SVN_VERSION_H=1 -DHAVE_LIBSVN_SUBR_1=1 -DHAVE_SVN_DELTA_H=1 -DHAVE_LIBSVN_DELTA_1=1 -DHAVE_LIBSASL2=1 -DMESOS_HAS_JAVA=1 -DHAVE_PYTHON=\"2.7\" -DMESOS_HAS_PYTHON=1 -I. -I../../src   -Wall -Werror -DLIBDIR=\"<https://builds.apache.org/job/mesos-reviewbot/ws/mesos-0.29.0/_inst/lib\"> -DPKGLIBEXECDIR=\"<https://builds.apache.org/job/mesos-reviewbot/ws/mesos-0.29.0/_inst/libexec/mesos\"> -DPKGDATADIR=\"<https://builds.apache.org/job/mesos-reviewbot/ws/mesos-0.29.0/_inst/share/mesos\"> -DPKGMODULEDIR=\"<https://builds.apache.org/job/mesos-reviewbot/ws/mesos-0.29.0/_inst/lib/mesos/modules\"> -I../../include -I../../3rdparty/libprocess/include -I../../3rdparty/libprocess/3rdparty/stout/include -I../include -I../include/mesos -isystem ../3rdparty/libprocess/3rdparty/boost-1.53.0 -I../3rdparty/libprocess/3rdparty/picojson-1.3.0 -DPICOJSON_USE_INT64 -D__STDC_FORMAT_MACROS -I../3rdparty/libprocess/3rdparty/protobuf-2.5.0/src -I../3rdparty/libprocess/3rdparty/glog-0.3.3/src -I../3rdparty/libprocess/3rdparty/glog-0.3.3/src -I../3rdparty/leveldb-1.4/include -I../3rdparty/zookeeper-3.4.5/src/c/include -I../3rdparty/zookeeper-3.4.5/src/c/generated -I../3rdparty/libprocess/3rdparty/protobuf-2.5.0/src -DSOURCE_DIR=\"<https://builds.apache.org/job/mesos-reviewbot/ws/mesos-0.29.0/_build/..\"> -DBUILD_DIR=\"<https://builds.apache.org/job/mesos-reviewbot/ws/mesos-0.29.0/_build\"> -I../3rdparty/libprocess/3rdparty/gmock-1.7.0/gtest/include -I../3rdparty/libprocess/3rdparty/gmock-1.7.0/include -DTESTLIBEXECDIR=\"<https://builds.apache.org/job/mesos-reviewbot/ws/mesos-0.29.0/_inst/libexec/mesos/tests\"> -DSBINDIR=\"<https://builds.apache.org/job/mesos-reviewbot/ws/mesos-0.29.0/_inst/sbin\"> -I/home/jenkins/tools/java/jdk1.6.0_20-64/include -I/home/jenkins/tools/java/jdk1.6.0_20-64/include/linux -DZOOKEEPER_VERSION=\"3.4.5\" -I/usr/include/subversion-1 -I/usr/include/apr-1 -I/usr/include/apr-1.0  -pthread -g1 -O0 -Wno-unused-local-typedefs -std=c++11 -MT tests/mesos_tests-hdfs_tests.o -MD -MP -MF tests/.deps/mesos_tests-hdfs_tests.Tpo -c -o tests/mesos_tests-hdfs_tests.o `test -f 'tests/hdfs_tests.cpp' || echo '../../src/'`tests/hdfs_tests.cpp
mv -f tests/.deps/mesos_tests-hdfs_tests.Tpo tests/.deps/mesos_tests-hdfs_tests.Po
g++ -DPACKAGE_NAME=\"mesos\" -DPACKAGE_TARNAME=\"mesos\" -DPACKAGE_VERSION=\"0.29.0\" -DPACKAGE_STRING=\"mesos\ 0.29.0\" -DPACKAGE_BUGREPORT=\"\" -DPACKAGE_URL=\"\" -DPACKAGE=\"mesos\" -DVERSION=\"0.29.0\" -DSTDC_HEADERS=1 -DHAVE_SYS_TYPES_H=1 -DHAVE_SYS_STAT_H=1 -DHAVE_STDLIB_H=1 -DHAVE_STRING_H=1 -DHAVE_MEMORY_H=1 -DHAVE_STRINGS_H=1 -DHAVE_INTTYPES_H=1 -DHAVE_STDINT_H=1 -DHAVE_UNISTD_H=1 -DHAVE_DLFCN_H=1 -DLT_OBJDIR=\".libs/\" -DHAVE_CXX11=1 -DHAVE_PTHREAD_PRIO_INHERIT=1 -DHAVE_PTHREAD=1 -DHAVE_LIBZ=1 -DHAVE_LIBCURL=1 -DHAVE_APR_POOLS_H=1 -DHAVE_LIBAPR_1=1 -DHAVE_SVN_VERSION_H=1 -DHAVE_LIBSVN_SUBR_1=1 -DHAVE_SVN_DELTA_H=1 -DHAVE_LIBSVN_DELTA_1=1 -DHAVE_LIBSASL2=1 -DMESOS_HAS_JAVA=1 -DHAVE_PYTHON=\"2.7\" -DMESOS_HAS_PYTHON=1 -I. -I../../src   -Wall -Werror -DLIBDIR=\"<https://builds.apache.org/job/mesos-reviewbot/ws/mesos-0.29.0/_inst/lib\"> -DPKGLIBEXECDIR=\"<https://builds.apache.org/job/mesos-reviewbot/ws/mesos-0.29.0/_inst/libexec/mesos\"> -DPKGDATADIR=\"<https://builds.apache.org/job/mesos-reviewbot/ws/mesos-0.29.0/_inst/share/mesos\"> -DPKGMODULEDIR=\"<https://builds.apache.org/job/mesos-reviewbot/ws/mesos-0.29.0/_inst/lib/mesos/modules\"> -I../../include -I../../3rdparty/libprocess/include -I../../3rdparty/libprocess/3rdparty/stout/include -I../include -I../include/mesos -isystem ../3rdparty/libprocess/3rdparty/boost-1.53.0 -I../3rdparty/libprocess/3rdparty/picojson-1.3.0 -DPICOJSON_USE_INT64 -D__STDC_FORMAT_MACROS -I../3rdparty/libprocess/3rdparty/protobuf-2.5.0/src -I../3rdparty/libprocess/3rdparty/glog-0.3.3/src -I../3rdparty/libprocess/3rdparty/glog-0.3.3/src -I../3rdparty/leveldb-1.4/include -I../3rdparty/zookeeper-3.4.5/src/c/include -I../3rdparty/zookeeper-3.4.5/src/c/generated -I../3rdparty/libprocess/3rdparty/protobuf-2.5.0/src -DSOURCE_DIR=\"<https://builds.apache.org/job/mesos-reviewbot/ws/mesos-0.29.0/_build/..\"> -DBUILD_DIR=\"<https://builds.apache.org/job/mesos-reviewbot/ws/mesos-0.29.0/_build\"> -I../3rdparty/libprocess/3rdparty/gmock-1.7.0/gtest/include -I../3rdparty/libprocess/3rdparty/gmock-1.7.0/include -DTESTLIBEXECDIR=\"<https://builds.apache.org/job/mesos-reviewbot/ws/mesos-0.29.0/_inst/libexec/mesos/tests\"> -DSBINDIR=\"<https://builds.apache.org/job/mesos-reviewbot/ws/mesos-0.29.0/_inst/sbin\"> -I/home/jenkins/tools/java/jdk1.6.0_20-64/include -I/home/jenkins/tools/java/jdk1.6.0_20-64/include/linux -DZOOKEEPER_VERSION=\"3.4.5\" -I/usr/include/subversion-1 -I/usr/include/apr-1 -I/usr/include/apr-1.0  -pthread -g1 -O0 -Wno-unused-local-typedefs -std=c++11 -MT tests/mesos_tests-health_check_tests.o -MD -MP -MF tests/.deps/mesos_tests-health_check_tests.Tpo -c -o tests/mesos_tests-health_check_tests.o `test -f 'tests/health_check_tests.cpp' || echo '../../src/'`tests/health_check_tests.cpp
mv -f tests/.deps/mesos_tests-flags.Tpo tests/.deps/mesos_tests-flags.Po
g++ -DPACKAGE_NAME=\"mesos\" -DPACKAGE_TARNAME=\"mesos\" -DPACKAGE_VERSION=\"0.29.0\" -DPACKAGE_STRING=\"mesos\ 0.29.0\" -DPACKAGE_BUGREPORT=\"\" -DPACKAGE_URL=\"\" -DPACKAGE=\"mesos\" -DVERSION=\"0.29.0\" -DSTDC_HEADERS=1 -DHAVE_SYS_TYPES_H=1 -DHAVE_SYS_STAT_H=1 -DHAVE_STDLIB_H=1 -DHAVE_STRING_H=1 -DHAVE_MEMORY_H=1 -DHAVE_STRINGS_H=1 -DHAVE_INTTYPES_H=1 -DHAVE_STDINT_H=1 -DHAVE_UNISTD_H=1 -DHAVE_DLFCN_H=1 -DLT_OBJDIR=\".libs/\" -DHAVE_CXX11=1 -DHAVE_PTHREAD_PRIO_INHERIT=1 -DHAVE_PTHREAD=1 -DHAVE_LIBZ=1 -DHAVE_LIBCURL=1 -DHAVE_APR_POOLS_H=1 -DHAVE_LIBAPR_1=1 -DHAVE_SVN_VERSION_H=1 -DHAVE_LIBSVN_SUBR_1=1 -DHAVE_SVN_DELTA_H=1 -DHAVE_LIBSVN_DELTA_1=1 -DHAVE_LIBSASL2=1 -DMESOS_HAS_JAVA=1 -DHAVE_PYTHON=\"2.7\" -DMESOS_HAS_PYTHON=1 -I. -I../../src   -Wall -Werror -DLIBDIR=\"<https://builds.apache.org/job/mesos-reviewbot/ws/mesos-0.29.0/_inst/lib\"> -DPKGLIBEXECDIR=\"<https://builds.apache.org/job/mesos-reviewbot/ws/mesos-0.29.0/_inst/libexec/mesos\"> -DPKGDATADIR=\"<https://builds.apache.org/job/mesos-reviewbot/ws/mesos-0.29.0/_inst/share/mesos\"> -DPKGMODULEDIR=\"<https://builds.apache.org/job/mesos-reviewbot/ws/mesos-0.29.0/_inst/lib/mesos/modules\"> -I../../include -I../../3rdparty/libprocess/include -I../../3rdparty/libprocess/3rdparty/stout/include -I../include -I../include/mesos -isystem ../3rdparty/libprocess/3rdparty/boost-1.53.0 -I../3rdparty/libprocess/3rdparty/picojson-1.3.0 -DPICOJSON_USE_INT64 -D__STDC_FORMAT_MACROS -I../3rdparty/libprocess/3rdparty/protobuf-2.5.0/src -I../3rdparty/libprocess/3rdparty/glog-0.3.3/src -I../3rdparty/libprocess/3rdparty/glog-0.3.3/src -I../3rdparty/leveldb-1.4/include -I../3rdparty/zookeeper-3.4.5/src/c/include -I../3rdparty/zookeeper-3.4.5/src/c/generated -I../3rdparty/libprocess/3rdparty/protobuf-2.5.0/src -DSOURCE_DIR=\"<https://builds.apache.org/job/mesos-reviewbot/ws/mesos-0.29.0/_build/..\"> -DBUILD_DIR=\"<https://builds.apache.org/job/mesos-reviewbot/ws/mesos-0.29.0/_build\"> -I../3rdparty/libprocess/3rdparty/gmock-1.7.0/gtest/include -I../3rdparty/libprocess/3rdparty/gmock-1.7.0/include -DTESTLIBEXECDIR=\"<https://builds.apache.org/job/mesos-reviewbot/ws/mesos-0.29.0/_inst/libexec/mesos/tests\"> -DSBINDIR=\"<https://builds.apache.org/job/mesos-reviewbot/ws/mesos-0.29.0/_inst/sbin\"> -I/home/jenkins/tools/java/jdk1.6.0_20-64/include -I/home/jenkins/tools/java/jdk1.6.0_20-64/include/linux -DZOOKEEPER_VERSION=\"3.4.5\" -I/usr/include/subversion-1 -I/usr/include/apr-1 -I/usr/include/apr-1.0  -pthread -g1 -O0 -Wno-unused-local-typedefs -std=c++11 -MT tests/mesos_tests-hierarchical_allocator_tests.o -MD -MP -MF tests/.deps/mesos_tests-hierarchical_allocator_tests.Tpo -c -o tests/mesos_tests-hierarchical_allocator_tests.o `test -f 'tests/hierarchical_allocator_tests.cpp' || echo '../../src/'`tests/hierarchical_allocator_tests.cpp
mv -f tests/.deps/mesos_tests-dynamic_weights_tests.Tpo tests/.deps/mesos_tests-dynamic_weights_tests.Po
g++ -DPACKAGE_NAME=\"mesos\" -DPACKAGE_TARNAME=\"mesos\" -DPACKAGE_VERSION=\"0.29.0\" -DPACKAGE_STRING=\"mesos\ 0.29.0\" -DPACKAGE_BUGREPORT=\"\" -DPACKAGE_URL=\"\" -DPACKAGE=\"mesos\" -DVERSION=\"0.29.0\" -DSTDC_HEADERS=1 -DHAVE_SYS_TYPES_H=1 -DHAVE_SYS_STAT_H=1 -DHAVE_STDLIB_H=1 -DHAVE_STRING_H=1 -DHAVE_MEMORY_H=1 -DHAVE_STRINGS_H=1 -DHAVE_INTTYPES_H=1 -DHAVE_STDINT_H=1 -DHAVE_UNISTD_H=1 -DHAVE_DLFCN_H=1 -DLT_OBJDIR=\".libs/\" -DHAVE_CXX11=1 -DHAVE_PTHREAD_PRIO_INHERIT=1 -DHAVE_PTHREAD=1 -DHAVE_LIBZ=1 -DHAVE_LIBCURL=1 -DHAVE_APR_POOLS_H=1 -DHAVE_LIBAPR_1=1 -DHAVE_SVN_VERSION_H=1 -DHAVE_LIBSVN_SUBR_1=1 -DHAVE_SVN_DELTA_H=1 -DHAVE_LIBSVN_DELTA_1=1 -DHAVE_LIBSASL2=1 -DMESOS_HAS_JAVA=1 -DHAVE_PYTHON=\"2.7\" -DMESOS_HAS_PYTHON=1 -I. -I../../src   -Wall -Werror -DLIBDIR=\"<https://builds.apache.org/job/mesos-reviewbot/ws/mesos-0.29.0/_inst/lib\"> -DPKGLIBEXECDIR=\"<https://builds.apache.org/job/mesos-reviewbot/ws/mesos-0.29.0/_inst/libexec/mesos\"> -DPKGDATADIR=\"<https://builds.apache.org/job/mesos-reviewbot/ws/mesos-0.29.0/_inst/share/mesos\"> -DPKGMODULEDIR=\"<https://builds.apache.org/job/mesos-reviewbot/ws/mesos-0.29.0/_inst/lib/mesos/modules\"> -I../../include -I../../3rdparty/libprocess/include -I../../3rdparty/libprocess/3rdparty/stout/include -I../include -I../include/mesos -isystem ../3rdparty/libprocess/3rdparty/boost-1.53.0 -I../3rdparty/libprocess/3rdparty/picojson-1.3.0 -DPICOJSON_USE_INT64 -D__STDC_FORMAT_MACROS -I../3rdparty/libprocess/3rdparty/protobuf-2.5.0/src -I../3rdparty/libprocess/3rdparty/glog-0.3.3/src -I../3rdparty/libprocess/3rdparty/glog-0.3.3/src -I../3rdparty/leveldb-1.4/include -I../3rdparty/zookeeper-3.4.5/src/c/include -I../3rdparty/zookeeper-3.4.5/src/c/generated -I../3rdparty/libprocess/3rdparty/protobuf-2.5.0/src -DSOURCE_DIR=\"<https://builds.apache.org/job/mesos-reviewbot/ws/mesos-0.29.0/_build/..\"> -DBUILD_DIR=\"<https://builds.apache.org/job/mesos-reviewbot/ws/mesos-0.29.0/_build\"> -I../3rdparty/libprocess/3rdparty/gmock-1.7.0/gtest/include -I../3rdparty/libprocess/3rdparty/gmock-1.7.0/include -DTESTLIBEXECDIR=\"<https://builds.apache.org/job/mesos-reviewbot/ws/mesos-0.29.0/_inst/libexec/mesos/tests\"> -DSBINDIR=\"<https://builds.apache.org/job/mesos-reviewbot/ws/mesos-0.29.0/_inst/sbin\"> -I/home/jenkins/tools/java/jdk1.6.0_20-64/include -I/home/jenkins/tools/java/jdk1.6.0_20-64/include/linux -DZOOKEEPER_VERSION=\"3.4.5\" -I/usr/include/subversion-1 -I/usr/include/apr-1 -I/usr/include/apr-1.0  -pthread -g1 -O0 -Wno-unused-local-typedefs -std=c++11 -MT tests/mesos_tests-hook_tests.o -MD -MP -MF tests/.deps/mesos_tests-hook_tests.Tpo -c -o tests/mesos_tests-hook_tests.o `test -f 'tests/hook_tests.cpp' || echo '../../src/'`tests/hook_tests.cpp
mv -f tests/.deps/mesos_tests-exception_tests.Tpo tests/.deps/mesos_tests-exception_tests.Po
g++ -DPACKAGE_NAME=\"mesos\" -DPACKAGE_TARNAME=\"mesos\" -DPACKAGE_VERSION=\"0.29.0\" -DPACKAGE_STRING=\"mesos\ 0.29.0\" -DPACKAGE_BUGREPORT=\"\" -DPACKAGE_URL=\"\" -DPACKAGE=\"mesos\" -DVERSION=\"0.29.0\" -DSTDC_HEADERS=1 -DHAVE_SYS_TYPES_H=1 -DHAVE_SYS_STAT_H=1 -DHAVE_STDLIB_H=1 -DHAVE_STRING_H=1 -DHAVE_MEMORY_H=1 -DHAVE_STRINGS_H=1 -DHAVE_INTTYPES_H=1 -DHAVE_STDINT_H=1 -DHAVE_UNISTD_H=1 -DHAVE_DLFCN_H=1 -DLT_OBJDIR=\".libs/\" -DHAVE_CXX11=1 -DHAVE_PTHREAD_PRIO_INHERIT=1 -DHAVE_PTHREAD=1 -DHAVE_LIBZ=1 -DHAVE_LIBCURL=1 -DHAVE_APR_POOLS_H=1 -DHAVE_LIBAPR_1=1 -DHAVE_SVN_VERSION_H=1 -DHAVE_LIBSVN_SUBR_1=1 -DHAVE_SVN_DELTA_H=1 -DHAVE_LIBSVN_DELTA_1=1 -DHAVE_LIBSASL2=1 -DMESOS_HAS_JAVA=1 -DHAVE_PYTHON=\"2.7\" -DMESOS_HAS_PYTHON=1 -I. -I../../src   -Wall -Werror -DLIBDIR=\"<https://builds.apache.org/job/mesos-reviewbot/ws/mesos-0.29.0/_inst/lib\"> -DPKGLIBEXECDIR=\"<https://builds.apache.org/job/mesos-reviewbot/ws/mesos-0.29.0/_inst/libexec/mesos\"> -DPKGDATADIR=\"<https://builds.apache.org/job/mesos-reviewbot/ws/mesos-0.29.0/_inst/share/mesos\"> -DPKGMODULEDIR=\"<https://builds.apache.org/job/mesos-reviewbot/ws/mesos-0.29.0/_inst/lib/mesos/modules\"> -I../../include -I../../3rdparty/libprocess/include -I../../3rdparty/libprocess/3rdparty/stout/include -I../include -I../include/mesos -isystem ../3rdparty/libprocess/3rdparty/boost-1.53.0 -I../3rdparty/libprocess/3rdparty/picojson-1.3.0 -DPICOJSON_USE_INT64 -D__STDC_FORMAT_MACROS -I../3rdparty/libprocess/3rdparty/protobuf-2.5.0/src -I../3rdparty/libprocess/3rdparty/glog-0.3.3/src -I../3rdparty/libprocess/3rdparty/glog-0.3.3/src -I../3rdparty/leveldb-1.4/include -I../3rdparty/zookeeper-3.4.5/src/c/include -I../3rdparty/zookeeper-3.4.5/src/c/generated -I../3rdparty/libprocess/3rdparty/protobuf-2.5.0/src -DSOURCE_DIR=\"<https://builds.apache.org/job/mesos-reviewbot/ws/mesos-0.29.0/_build/..\"> -DBUILD_DIR=\"<https://builds.apache.org/job/mesos-reviewbot/ws/mesos-0.29.0/_build\"> -I../3rdparty/libprocess/3rdparty/gmock-1.7.0/gtest/include -I../3rdparty/libprocess/3rdparty/gmock-1.7.0/include -DTESTLIBEXECDIR=\"<https://builds.apache.org/job/mesos-reviewbot/ws/mesos-0.29.0/_inst/libexec/mesos/tests\"> -DSBINDIR=\"<https://builds.apache.org/job/mesos-reviewbot/ws/mesos-0.29.0/_inst/sbin\"> -I/home/jenkins/tools/java/jdk1.6.0_20-64/include -I/home/jenkins/tools/java/jdk1.6.0_20-64/include/linux -DZOOKEEPER_VERSION=\"3.4.5\" -I/usr/include/subversion-1 -I/usr/include/apr-1 -I/usr/include/apr-1.0  -pthread -g1 -O0 -Wno-unused-local-typedefs -std=c++11 -MT tests/mesos_tests-http_authentication_tests.o -MD -MP -MF tests/.deps/mesos_tests-http_authentication_tests.Tpo -c -o tests/mesos_tests-http_authentication_tests.o `test -f 'tests/http_authentication_tests.cpp' || echo '../../src/'`tests/http_authentication_tests.cpp
mv -f tests/.deps/mesos_tests-files_tests.Tpo tests/.deps/mesos_tests-files_tests.Po
g++ -DPACKAGE_NAME=\"mesos\" -DPACKAGE_TARNAME=\"mesos\" -DPACKAGE_VERSION=\"0.29.0\" -DPACKAGE_STRING=\"mesos\ 0.29.0\" -DPACKAGE_BUGREPORT=\"\" -DPACKAGE_URL=\"\" -DPACKAGE=\"mesos\" -DVERSION=\"0.29.0\" -DSTDC_HEADERS=1 -DHAVE_SYS_TYPES_H=1 -DHAVE_SYS_STAT_H=1 -DHAVE_STDLIB_H=1 -DHAVE_STRING_H=1 -DHAVE_MEMORY_H=1 -DHAVE_STRINGS_H=1 -DHAVE_INTTYPES_H=1 -DHAVE_STDINT_H=1 -DHAVE_UNISTD_H=1 -DHAVE_DLFCN_H=1 -DLT_OBJDIR=\".libs/\" -DHAVE_CXX11=1 -DHAVE_PTHREAD_PRIO_INHERIT=1 -DHAVE_PTHREAD=1 -DHAVE_LIBZ=1 -DHAVE_LIBCURL=1 -DHAVE_APR_POOLS_H=1 -DHAVE_LIBAPR_1=1 -DHAVE_SVN_VERSION_H=1 -DHAVE_LIBSVN_SUBR_1=1 -DHAVE_SVN_DELTA_H=1 -DHAVE_LIBSVN_DELTA_1=1 -DHAVE_LIBSASL2=1 -DMESOS_HAS_JAVA=1 -DHAVE_PYTHON=\"2.7\" -DMESOS_HAS_PYTHON=1 -I. -I../../src   -Wall -Werror -DLIBDIR=\"<https://builds.apache.org/job/mesos-reviewbot/ws/mesos-0.29.0/_inst/lib\"> -DPKGLIBEXECDIR=\"<https://builds.apache.org/job/mesos-reviewbot/ws/mesos-0.29.0/_inst/libexec/mesos\"> -DPKGDATADIR=\"<https://builds.apache.org/job/mesos-reviewbot/ws/mesos-0.29.0/_inst/share/mesos\"> -DPKGMODULEDIR=\"<https://builds.apache.org/job/mesos-reviewbot/ws/mesos-0.29.0/_inst/lib/mesos/modules\"> -I../../include -I../../3rdparty/libprocess/include -I../../3rdparty/libprocess/3rdparty/stout/include -I../include -I../include/mesos -isystem ../3rdparty/libprocess/3rdparty/boost-1.53.0 -I../3rdparty/libprocess/3rdparty/picojson-1.3.0 -DPICOJSON_USE_INT64 -D__STDC_FORMAT_MACROS -I../3rdparty/libprocess/3rdparty/protobuf-2.5.0/src -I../3rdparty/libprocess/3rdparty/glog-0.3.3/src -I../3rdparty/libprocess/3rdparty/glog-0.3.3/src -I../3rdparty/leveldb-1.4/include -I../3rdparty/zookeeper-3.4.5/src/c/include -I../3rdparty/zookeeper-3.4.5/src/c/generated -I../3rdparty/libprocess/3rdparty/protobuf-2.5.0/src -DSOURCE_DIR=\"<https://builds.apache.org/job/mesos-reviewbot/ws/mesos-0.29.0/_build/..\"> -DBUILD_DIR=\"<https://builds.apache.org/job/mesos-reviewbot/ws/mesos-0.29.0/_build\"> -I../3rdparty/libprocess/3rdparty/gmock-1.7.0/gtest/include -I../3rdparty/libprocess/3rdparty/gmock-1.7.0/include -DTESTLIBEXECDIR=\"<https://builds.apache.org/job/mesos-reviewbot/ws/mesos-0.29.0/_inst/libexec/mesos/tests\"> -DSBINDIR=\"<https://builds.apache.org/job/mesos-reviewbot/ws/mesos-0.29.0/_inst/sbin\"> -I/home/jenkins/tools/java/jdk1.6.0_20-64/include -I/home/jenkins/tools/java/jdk1.6.0_20-64/include/linux -DZOOKEEPER_VERSION=\"3.4.5\" -I/usr/include/subversion-1 -I/usr/include/apr-1 -I/usr/include/apr-1.0  -pthread -g1 -O0 -Wno-unused-local-typedefs -std=c++11 -MT tests/mesos_tests-http_fault_tolerance_tests.o -MD -MP -MF tests/.deps/mesos_tests-http_fault_tolerance_tests.Tpo -c -o tests/mesos_tests-http_fault_tolerance_tests.o `test -f 'tests/http_fault_tolerance_tests.cpp' || echo '../../src/'`tests/http_fault_tolerance_tests.cpp
mv -f tests/.deps/mesos_tests-fetcher_tests.Tpo tests/.deps/mesos_tests-fetcher_tests.Po
g++ -DPACKAGE_NAME=\"mesos\" -DPACKAGE_TARNAME=\"mesos\" -DPACKAGE_VERSION=\"0.29.0\" -DPACKAGE_STRING=\"mesos\ 0.29.0\" -DPACKAGE_BUGREPORT=\"\" -DPACKAGE_URL=\"\" -DPACKAGE=\"mesos\" -DVERSION=\"0.29.0\" -DSTDC_HEADERS=1 -DHAVE_SYS_TYPES_H=1 -DHAVE_SYS_STAT_H=1 -DHAVE_STDLIB_H=1 -DHAVE_STRING_H=1 -DHAVE_MEMORY_H=1 -DHAVE_STRINGS_H=1 -DHAVE_INTTYPES_H=1 -DHAVE_STDINT_H=1 -DHAVE_UNISTD_H=1 -DHAVE_DLFCN_H=1 -DLT_OBJDIR=\".libs/\" -DHAVE_CXX11=1 -DHAVE_PTHREAD_PRIO_INHERIT=1 -DHAVE_PTHREAD=1 -DHAVE_LIBZ=1 -DHAVE_LIBCURL=1 -DHAVE_APR_POOLS_H=1 -DHAVE_LIBAPR_1=1 -DHAVE_SVN_VERSION_H=1 -DHAVE_LIBSVN_SUBR_1=1 -DHAVE_SVN_DELTA_H=1 -DHAVE_LIBSVN_DELTA_1=1 -DHAVE_LIBSASL2=1 -DMESOS_HAS_JAVA=1 -DHAVE_PYTHON=\"2.7\" -DMESOS_HAS_PYTHON=1 -I. -I../../src   -Wall -Werror -DLIBDIR=\"<https://builds.apache.org/job/mesos-reviewbot/ws/mesos-0.29.0/_inst/lib\"> -DPKGLIBEXECDIR=\"<https://builds.apache.org/job/mesos-reviewbot/ws/mesos-0.29.0/_inst/libexec/mesos\"> -DPKGDATADIR=\"<https://builds.apache.org/job/mesos-reviewbot/ws/mesos-0.29.0/_inst/share/mesos\"> -DPKGMODULEDIR=\"<https://builds.apache.org/job/mesos-reviewbot/ws/mesos-0.29.0/_inst/lib/mesos/modules\"> -I../../include -I../../3rdparty/libprocess/include -I../../3rdparty/libprocess/3rdparty/stout/include -I../include -I../include/mesos -isystem ../3rdparty/libprocess/3rdparty/boost-1.53.0 -I../3rdparty/libprocess/3rdparty/picojson-1.3.0 -DPICOJSON_USE_INT64 -D__STDC_FORMAT_MACROS -I../3rdparty/libprocess/3rdparty/protobuf-2.5.0/src -I../3rdparty/libprocess/3rdparty/glog-0.3.3/src -I../3rdparty/libprocess/3rdparty/glog-0.3.3/src -I../3rdparty/leveldb-1.4/include -I../3rdparty/zookeeper-3.4.5/src/c/include -I../3rdparty/zookeeper-3.4.5/src/c/generated -I../3rdparty/libprocess/3rdparty/protobuf-2.5.0/src -DSOURCE_DIR=\"<https://builds.apache.org/job/mesos-reviewbot/ws/mesos-0.29.0/_build/..\"> -DBUILD_DIR=\"<https://builds.apache.org/job/mesos-reviewbot/ws/mesos-0.29.0/_build\"> -I../3rdparty/libprocess/3rdparty/gmock-1.7.0/gtest/include -I../3rdparty/libprocess/3rdparty/gmock-1.7.0/include -DTESTLIBEXECDIR=\"<https://builds.apache.org/job/mesos-reviewbot/ws/mesos-0.29.0/_inst/libexec/mesos/tests\"> -DSBINDIR=\"<https://builds.apache.org/job/mesos-reviewbot/ws/mesos-0.29.0/_inst/sbin\"> -I/home/jenkins/tools/java/jdk1.6.0_20-64/include -I/home/jenkins/tools/java/jdk1.6.0_20-64/include/linux -DZOOKEEPER_VERSION=\"3.4.5\" -I/usr/include/subversion-1 -I/usr/include/apr-1 -I/usr/include/apr-1.0  -pthread -g1 -O0 -Wno-unused-local-typedefs -std=c++11 -MT tests/mesos_tests-log_tests.o -MD -MP -MF tests/.deps/mesos_tests-log_tests.Tpo -c -o tests/mesos_tests-log_tests.o `test -f 'tests/log_tests.cpp' || echo '../../src/'`tests/log_tests.cpp
mv -f tests/.deps/mesos_tests-executor_http_api_tests.Tpo tests/.deps/mesos_tests-executor_http_api_tests.Po
g++ -DPACKAGE_NAME=\"mesos\" -DPACKAGE_TARNAME=\"mesos\" -DPACKAGE_VERSION=\"0.29.0\" -DPACKAGE_STRING=\"mesos\ 0.29.0\" -DPACKAGE_BUGREPORT=\"\" -DPACKAGE_URL=\"\" -DPACKAGE=\"mesos\" -DVERSION=\"0.29.0\" -DSTDC_HEADERS=1 -DHAVE_SYS_TYPES_H=1 -DHAVE_SYS_STAT_H=1 -DHAVE_STDLIB_H=1 -DHAVE_STRING_H=1 -DHAVE_MEMORY_H=1 -DHAVE_STRINGS_H=1 -DHAVE_INTTYPES_H=1 -DHAVE_STDINT_H=1 -DHAVE_UNISTD_H=1 -DHAVE_DLFCN_H=1 -DLT_OBJDIR=\".libs/\" -DHAVE_CXX11=1 -DHAVE_PTHREAD_PRIO_INHERIT=1 -DHAVE_PTHREAD=1 -DHAVE_LIBZ=1 -DHAVE_LIBCURL=1 -DHAVE_APR_POOLS_H=1 -DHAVE_LIBAPR_1=1 -DHAVE_SVN_VERSION_H=1 -DHAVE_LIBSVN_SUBR_1=1 -DHAVE_SVN_DELTA_H=1 -DHAVE_LIBSVN_DELTA_1=1 -DHAVE_LIBSASL2=1 -DMESOS_HAS_JAVA=1 -DHAVE_PYTHON=\"2.7\" -DMESOS_HAS_PYTHON=1 -I. -I../../src   -Wall -Werror -DLIBDIR=\"<https://builds.apache.org/job/mesos-reviewbot/ws/mesos-0.29.0/_inst/lib\"> -DPKGLIBEXECDIR=\"<https://builds.apache.org/job/mesos-reviewbot/ws/mesos-0.29.0/_inst/libexec/mesos\"> -DPKGDATADIR=\"<https://builds.apache.org/job/mesos-reviewbot/ws/mesos-0.29.0/_inst/share/mesos\"> -DPKGMODULEDIR=\"<https://builds.apache.org/job/mesos-reviewbot/ws/mesos-0.29.0/_inst/lib/mesos/modules\"> -I../../include -I../../3rdparty/libprocess/include -I../../3rdparty/libprocess/3rdparty/stout/include -I../include -I../include/mesos -isystem ../3rdparty/libprocess/3rdparty/boost-1.53.0 -I../3rdparty/libprocess/3rdparty/picojson-1.3.0 -DPICOJSON_USE_INT64 -D__STDC_FORMAT_MACROS -I../3rdparty/libprocess/3rdparty/protobuf-2.5.0/src -I../3rdparty/libprocess/3rdparty/glog-0.3.3/src -I../3rdparty/libprocess/3rdparty/glog-0.3.3/src -I../3rdparty/leveldb-1.4/include -I../3rdparty/zookeeper-3.4.5/src/c/include -I../3rdparty/zookeeper-3.4.5/src/c/generated -I../3rdparty/libprocess/3rdparty/protobuf-2.5.0/src -DSOURCE_DIR=\"<https://builds.apache.org/job/mesos-reviewbot/ws/mesos-0.29.0/_build/..\"> -DBUILD_DIR=\"<https://builds.apache.org/job/mesos-reviewbot/ws/mesos-0.29.0/_build\"> -I../3rdparty/libprocess/3rdparty/gmock-1.7.0/gtest/include -I../3rdparty/libprocess/3rdparty/gmock-1.7.0/include -DTESTLIBEXECDIR=\"<https://builds.apache.org/job/mesos-reviewbot/ws/mesos-0.29.0/_inst/libexec/mesos/tests\"> -DSBINDIR=\"<https://builds.apache.org/job/mesos-reviewbot/ws/mesos-0.29.0/_inst/sbin\"> -I/home/jenkins/tools/java/jdk1.6.0_20-64/include -I/home/jenkins/tools/java/jdk1.6.0_20-64/include/linux -DZOOKEEPER_VERSION=\"3.4.5\" -I/usr/include/subversion-1 -I/usr/include/apr-1 -I/usr/include/apr-1.0  -pthread -g1 -O0 -Wno-unused-local-typedefs -std=c++11 -MT tests/mesos_tests-logging_tests.o -MD -MP -MF tests/.deps/mesos_tests-logging_tests.Tpo -c -o tests/mesos_tests-logging_tests.o `test -f 'tests/logging_tests.cpp' || echo '../../src/'`tests/logging_tests.cpp
mv -f tests/.deps/mesos_tests-fetcher_cache_tests.Tpo tests/.deps/mesos_tests-fetcher_cache_tests.Po
g++ -DPACKAGE_NAME=\"mesos\" -DPACKAGE_TARNAME=\"mesos\" -DPACKAGE_VERSION=\"0.29.0\" -DPACKAGE_STRING=\"mesos\ 0.29.0\" -DPACKAGE_BUGREPORT=\"\" -DPACKAGE_URL=\"\" -DPACKAGE=\"mesos\" -DVERSION=\"0.29.0\" -DSTDC_HEADERS=1 -DHAVE_SYS_TYPES_H=1 -DHAVE_SYS_STAT_H=1 -DHAVE_STDLIB_H=1 -DHAVE_STRING_H=1 -DHAVE_MEMORY_H=1 -DHAVE_STRINGS_H=1 -DHAVE_INTTYPES_H=1 -DHAVE_STDINT_H=1 -DHAVE_UNISTD_H=1 -DHAVE_DLFCN_H=1 -DLT_OBJDIR=\".libs/\" -DHAVE_CXX11=1 -DHAVE_PTHREAD_PRIO_INHERIT=1 -DHAVE_PTHREAD=1 -DHAVE_LIBZ=1 -DHAVE_LIBCURL=1 -DHAVE_APR_POOLS_H=1 -DHAVE_LIBAPR_1=1 -DHAVE_SVN_VERSION_H=1 -DHAVE_LIBSVN_SUBR_1=1 -DHAVE_SVN_DELTA_H=1 -DHAVE_LIBSVN_DELTA_1=1 -DHAVE_LIBSASL2=1 -DMESOS_HAS_JAVA=1 -DHAVE_PYTHON=\"2.7\" -DMESOS_HAS_PYTHON=1 -I. -I../../src   -Wall -Werror -DLIBDIR=\"<https://builds.apache.org/job/mesos-reviewbot/ws/mesos-0.29.0/_inst/lib\"> -DPKGLIBEXECDIR=\"<https://builds.apache.org/job/mesos-reviewbot/ws/mesos-0.29.0/_inst/libexec/mesos\"> -DPKGDATADIR=\"<https://builds.apache.org/job/mesos-reviewbot/ws/mesos-0.29.0/_inst/share/mesos\"> -DPKGMODULEDIR=\"<https://builds.apache.org/job/mesos-reviewbot/ws/mesos-0.29.0/_inst/lib/mesos/modules\"> -I../../include -I../../3rdparty/libprocess/include -I../../3rdparty/libprocess/3rdparty/stout/include -I../include -I../include/mesos -isystem ../3rdparty/libprocess/3rdparty/boost-1.53.0 -I../3rdparty/libprocess/3rdparty/picojson-1.3.0 -DPICOJSON_USE_INT64 -D__STDC_FORMAT_MACROS -I../3rdparty/libprocess/3rdparty/protobuf-2.5.0/src -I../3rdparty/libprocess/3rdparty/glog-0.3.3/src -I../3rdparty/libprocess/3rdparty/glog-0.3.3/src -I../3rdparty/leveldb-1.4/include -I../3rdparty/zookeeper-3.4.5/src/c/include -I../3rdparty/zookeeper-3.4.5/src/c/generated -I../3rdparty/libprocess/3rdparty/protobuf-2.5.0/src -DSOURCE_DIR=\"<https://builds.apache.org/job/mesos-reviewbot/ws/mesos-0.29.0/_build/..\"> -DBUILD_DIR=\"<https://builds.apache.org/job/mesos-reviewbot/ws/mesos-0.29.0/_build\"> -I../3rdparty/libprocess/3rdparty/gmock-1.7.0/gtest/include -I../3rdparty/libprocess/3rdparty/gmock-1.7.0/include -DTESTLIBEXECDIR=\"<https://builds.apache.org/job/mesos-reviewbot/ws/mesos-0.29.0/_inst/libexec/mesos/tests\"> -DSBINDIR=\"<https://builds.apache.org/job/mesos-reviewbot/ws/mesos-0.29.0/_inst/sbin\"> -I/home/jenkins/tools/java/jdk1.6.0_20-64/include -I/home/jenkins/tools/java/jdk1.6.0_20-64/include/linux -DZOOKEEPER_VERSION=\"3.4.5\" -I/usr/include/subversion-1 -I/usr/include/apr-1 -I/usr/include/apr-1.0  -pthread -g1 -O0 -Wno-unused-local-typedefs -std=c++11 -MT tests/mesos_tests-main.o -MD -MP -MF tests/.deps/mesos_tests-main.Tpo -c -o tests/mesos_tests-main.o `test -f 'tests/main.cpp' || echo '../../src/'`tests/main.cpp
mv -f tests/.deps/mesos_tests-gc_tests.Tpo tests/.deps/mesos_tests-gc_tests.Po
g++ -DPACKAGE_NAME=\"mesos\" -DPACKAGE_TARNAME=\"mesos\" -DPACKAGE_VERSION=\"0.29.0\" -DPACKAGE_STRING=\"mesos\ 0.29.0\" -DPACKAGE_BUGREPORT=\"\" -DPACKAGE_URL=\"\" -DPACKAGE=\"mesos\" -DVERSION=\"0.29.0\" -DSTDC_HEADERS=1 -DHAVE_SYS_TYPES_H=1 -DHAVE_SYS_STAT_H=1 -DHAVE_STDLIB_H=1 -DHAVE_STRING_H=1 -DHAVE_MEMORY_H=1 -DHAVE_STRINGS_H=1 -DHAVE_INTTYPES_H=1 -DHAVE_STDINT_H=1 -DHAVE_UNISTD_H=1 -DHAVE_DLFCN_H=1 -DLT_OBJDIR=\".libs/\" -DHAVE_CXX11=1 -DHAVE_PTHREAD_PRIO_INHERIT=1 -DHAVE_PTHREAD=1 -DHAVE_LIBZ=1 -DHAVE_LIBCURL=1 -DHAVE_APR_POOLS_H=1 -DHAVE_LIBAPR_1=1 -DHAVE_SVN_VERSION_H=1 -DHAVE_LIBSVN_SUBR_1=1 -DHAVE_SVN_DELTA_H=1 -DHAVE_LIBSVN_DELTA_1=1 -DHAVE_LIBSASL2=1 -DMESOS_HAS_JAVA=1 -DHAVE_PYTHON=\"2.7\" -DMESOS_HAS_PYTHON=1 -I. -I../../src   -Wall -Werror -DLIBDIR=\"<https://builds.apache.org/job/mesos-reviewbot/ws/mesos-0.29.0/_inst/lib\"> -DPKGLIBEXECDIR=\"<https://builds.apache.org/job/mesos-reviewbot/ws/mesos-0.29.0/_inst/libexec/mesos\"> -DPKGDATADIR=\"<https://builds.apache.org/job/mesos-reviewbot/ws/mesos-0.29.0/_inst/share/mesos\"> -DPKGMODULEDIR=\"<https://builds.apache.org/job/mesos-reviewbot/ws/mesos-0.29.0/_inst/lib/mesos/modules\"> -I../../include -I../../3rdparty/libprocess/include -I../../3rdparty/libprocess/3rdparty/stout/include -I../include -I../include/mesos -isystem ../3rdparty/libprocess/3rdparty/boost-1.53.0 -I../3rdparty/libprocess/3rdparty/picojson-1.3.0 -DPICOJSON_USE_INT64 -D__STDC_FORMAT_MACROS -I../3rdparty/libprocess/3rdparty/protobuf-2.5.0/src -I../3rdparty/libprocess/3rdparty/glog-0.3.3/src -I../3rdparty/libprocess/3rdparty/glog-0.3.3/src -I../3rdparty/leveldb-1.4/include -I../3rdparty/zookeeper-3.4.5/src/c/include -I../3rdparty/zookeeper-3.4.5/src/c/generated -I../3rdparty/libprocess/3rdparty/protobuf-2.5.0/src -DSOURCE_DIR=\"<https://builds.apache.org/job/mesos-reviewbot/ws/mesos-0.29.0/_build/..\"> -DBUILD_DIR=\"<https://builds.apache.org/job/mesos-reviewbot/ws/mesos-0.29.0/_build\"> -I../3rdparty/libprocess/3rdparty/gmock-1.7.0/gtest/include -I../3rdparty/libprocess/3rdparty/gmock-1.7.0/include -DTESTLIBEXECDIR=\"<https://builds.apache.org/job/mesos-reviewbot/ws/mesos-0.29.0/_inst/libexec/mesos/tests\"> -DSBINDIR=\"<https://builds.apache.org/job/mesos-reviewbot/ws/mesos-0.29.0/_inst/sbin\"> -I/home/jenkins/tools/java/jdk1.6.0_20-64/include -I/home/jenkins/tools/java/jdk1.6.0_20-64/include/linux -DZOOKEEPER_VERSION=\"3.4.5\" -I/usr/include/subversion-1 -I/usr/include/apr-1 -I/usr/include/apr-1.0  -pthread -g1 -O0 -Wno-unused-local-typedefs -std=c++11 -MT tests/mesos_tests-master_allocator_tests.o -MD -MP -MF tests/.deps/mesos_tests-master_allocator_tests.Tpo -c -o tests/mesos_tests-master_allocator_tests.o `test -f 'tests/master_allocator_tests.cpp' || echo '../../src/'`tests/master_allocator_tests.cpp
mv -f tests/.deps/mesos_tests-logging_tests.Tpo tests/.deps/mesos_tests-logging_tests.Po
g++ -DPACKAGE_NAME=\"mesos\" -DPACKAGE_TARNAME=\"mesos\" -DPACKAGE_VERSION=\"0.29.0\" -DPACKAGE_STRING=\"mesos\ 0.29.0\" -DPACKAGE_BUGREPORT=\"\" -DPACKAGE_URL=\"\" -DPACKAGE=\"mesos\" -DVERSION=\"0.29.0\" -DSTDC_HEADERS=1 -DHAVE_SYS_TYPES_H=1 -DHAVE_SYS_STAT_H=1 -DHAVE_STDLIB_H=1 -DHAVE_STRING_H=1 -DHAVE_MEMORY_H=1 -DHAVE_STRINGS_H=1 -DHAVE_INTTYPES_H=1 -DHAVE_STDINT_H=1 -DHAVE_UNISTD_H=1 -DHAVE_DLFCN_H=1 -DLT_OBJDIR=\".libs/\" -DHAVE_CXX11=1 -DHAVE_PTHREAD_PRIO_INHERIT=1 -DHAVE_PTHREAD=1 -DHAVE_LIBZ=1 -DHAVE_LIBCURL=1 -DHAVE_APR_POOLS_H=1 -DHAVE_LIBAPR_1=1 -DHAVE_SVN_VERSION_H=1 -DHAVE_LIBSVN_SUBR_1=1 -DHAVE_SVN_DELTA_H=1 -DHAVE_LIBSVN_DELTA_1=1 -DHAVE_LIBSASL2=1 -DMESOS_HAS_JAVA=1 -DHAVE_PYTHON=\"2.7\" -DMESOS_HAS_PYTHON=1 -I. -I../../src   -Wall -Werror -DLIBDIR=\"<https://builds.apache.org/job/mesos-reviewbot/ws/mesos-0.29.0/_inst/lib\"> -DPKGLIBEXECDIR=\"<https://builds.apache.org/job/mesos-reviewbot/ws/mesos-0.29.0/_inst/libexec/mesos\"> -DPKGDATADIR=\"<https://builds.apache.org/job/mesos-reviewbot/ws/mesos-0.29.0/_inst/share/mesos\"> -DPKGMODULEDIR=\"<https://builds.apache.org/job/mesos-reviewbot/ws/mesos-0.29.0/_inst/lib/mesos/modules\"> -I../../include -I../../3rdparty/libprocess/include -I../../3rdparty/libprocess/3rdparty/stout/include -I../include -I../include/mesos -isystem ../3rdparty/libprocess/3rdparty/boost-1.53.0 -I../3rdparty/libprocess/3rdparty/picojson-1.3.0 -DPICOJSON_USE_INT64 -D__STDC_FORMAT_MACROS -I../3rdparty/libprocess/3rdparty/protobuf-2.5.0/src -I../3rdparty/libprocess/3rdparty/glog-0.3.3/src -I../3rdparty/libprocess/3rdparty/glog-0.3.3/src -I../3rdparty/leveldb-1.4/include -I../3rdparty/zookeeper-3.4.5/src/c/include -I../3rdparty/zookeeper-3.4.5/src/c/generated -I../3rdparty/libprocess/3rdparty/protobuf-2.5.0/src -DSOURCE_DIR=\"<https://builds.apache.org/job/mesos-reviewbot/ws/mesos-0.29.0/_build/..\"> -DBUILD_DIR=\"<https://builds.apache.org/job/mesos-reviewbot/ws/mesos-0.29.0/_build\"> -I../3rdparty/libprocess/3rdparty/gmock-1.7.0/gtest/include -I../3rdparty/libprocess/3rdparty/gmock-1.7.0/include -DTESTLIBEXECDIR=\"<https://builds.apache.org/job/mesos-reviewbot/ws/mesos-0.29.0/_inst/libexec/mesos/tests\"> -DSBINDIR=\"<https://builds.apache.org/job/mesos-reviewbot/ws/mesos-0.29.0/_inst/sbin\"> -I/home/jenkins/tools/java/jdk1.6.0_20-64/include -I/home/jenkins/tools/java/jdk1.6.0_20-64/include/linux -DZOOKEEPER_VERSION=\"3.4.5\" -I/usr/include/subversion-1 -I/usr/include/apr-1 -I/usr/include/apr-1.0  -pthread -g1 -O0 -Wno-unused-local-typedefs -std=c++11 -MT tests/mesos_tests-master_authorization_tests.o -MD -MP -MF tests/.deps/mesos_tests-master_authorization_tests.Tpo -c -o tests/mesos_tests-master_authorization_tests.o `test -f 'tests/master_authorization_tests.cpp' || echo '../../src/'`tests/master_authorization_tests.cpp
mv -f tests/.deps/mesos_tests-fault_tolerance_tests.Tpo tests/.deps/mesos_tests-fault_tolerance_tests.Po
g++ -DPACKAGE_NAME=\"mesos\" -DPACKAGE_TARNAME=\"mesos\" -DPACKAGE_VERSION=\"0.29.0\" -DPACKAGE_STRING=\"mesos\ 0.29.0\" -DPACKAGE_BUGREPORT=\"\" -DPACKAGE_URL=\"\" -DPACKAGE=\"mesos\" -DVERSION=\"0.29.0\" -DSTDC_HEADERS=1 -DHAVE_SYS_TYPES_H=1 -DHAVE_SYS_STAT_H=1 -DHAVE_STDLIB_H=1 -DHAVE_STRING_H=1 -DHAVE_MEMORY_H=1 -DHAVE_STRINGS_H=1 -DHAVE_INTTYPES_H=1 -DHAVE_STDINT_H=1 -DHAVE_UNISTD_H=1 -DHAVE_DLFCN_H=1 -DLT_OBJDIR=\".libs/\" -DHAVE_CXX11=1 -DHAVE_PTHREAD_PRIO_INHERIT=1 -DHAVE_PTHREAD=1 -DHAVE_LIBZ=1 -DHAVE_LIBCURL=1 -DHAVE_APR_POOLS_H=1 -DHAVE_LIBAPR_1=1 -DHAVE_SVN_VERSION_H=1 -DHAVE_LIBSVN_SUBR_1=1 -DHAVE_SVN_DELTA_H=1 -DHAVE_LIBSVN_DELTA_1=1 -DHAVE_LIBSASL2=1 -DMESOS_HAS_JAVA=1 -DHAVE_PYTHON=\"2.7\" -DMESOS_HAS_PYTHON=1 -I. -I../../src   -Wall -Werror -DLIBDIR=\"<https://builds.apache.org/job/mesos-reviewbot/ws/mesos-0.29.0/_inst/lib\"> -DPKGLIBEXECDIR=\"<https://builds.apache.org/job/mesos-reviewbot/ws/mesos-0.29.0/_inst/libexec/mesos\"> -DPKGDATADIR=\"<https://builds.apache.org/job/mesos-reviewbot/ws/mesos-0.29.0/_inst/share/mesos\"> -DPKGMODULEDIR=\"<https://builds.apache.org/job/mesos-reviewbot/ws/mesos-0.29.0/_inst/lib/mesos/modules\"> -I../../include -I../../3rdparty/libprocess/include -I../../3rdparty/libprocess/3rdparty/stout/include -I../include -I../include/mesos -isystem ../3rdparty/libprocess/3rdparty/boost-1.53.0 -I../3rdparty/libprocess/3rdparty/picojson-1.3.0 -DPICOJSON_USE_INT64 -D__STDC_FORMAT_MACROS -I../3rdparty/libprocess/3rdparty/protobuf-2.5.0/src -I../3rdparty/libprocess/3rdparty/glog-0.3.3/src -I../3rdparty/libprocess/3rdparty/glog-0.3.3/src -I../3rdparty/leveldb-1.4/include -I../3rdparty/zookeeper-3.4.5/src/c/include -I../3rdparty/zookeeper-3.4.5/src/c/generated -I../3rdparty/libprocess/3rdparty/protobuf-2.5.0/src -DSOURCE_DIR=\"<https://builds.apache.org/job/mesos-reviewbot/ws/mesos-0.29.0/_build/..\"> -DBUILD_DIR=\"<https://builds.apache.org/job/mesos-reviewbot/ws/mesos-0.29.0/_build\"> -I../3rdparty/libprocess/3rdparty/gmock-1.7.0/gtest/include -I../3rdparty/libprocess/3rdparty/gmock-1.7.0/include -DTESTLIBEXECDIR=\"<https://builds.apache.org/job/mesos-reviewbot/ws/mesos-0.29.0/_inst/libexec/mesos/tests\"> -DSBINDIR=\"<https://builds.apache.org/job/mesos-reviewbot/ws/mesos-0.29.0/_inst/sbin\"> -I/home/jenkins/tools/java/jdk1.6.0_20-64/include -I/home/jenkins/tools/java/jdk1.6.0_20-64/include/linux -DZOOKEEPER_VERSION=\"3.4.5\" -I/usr/include/subversion-1 -I/usr/include/apr-1 -I/usr/include/apr-1.0  -pthread -g1 -O0 -Wno-unused-local-typedefs -std=c++11 -MT tests/mesos_tests-master_contender_detector_tests.o -MD -MP -MF tests/.deps/mesos_tests-master_contender_detector_tests.Tpo -c -o tests/mesos_tests-master_contender_detector_tests.o `test -f 'tests/master_contender_detector_tests.cpp' || echo '../../src/'`tests/master_contender_detector_tests.cpp
mv -f tests/.deps/mesos_tests-health_check_tests.Tpo tests/.deps/mesos_tests-health_check_tests.Po
g++ -DPACKAGE_NAME=\"mesos\" -DPACKAGE_TARNAME=\"mesos\" -DPACKAGE_VERSION=\"0.29.0\" -DPACKAGE_STRING=\"mesos\ 0.29.0\" -DPACKAGE_BUGREPORT=\"\" -DPACKAGE_URL=\"\" -DPACKAGE=\"mesos\" -DVERSION=\"0.29.0\" -DSTDC_HEADERS=1 -DHAVE_SYS_TYPES_H=1 -DHAVE_SYS_STAT_H=1 -DHAVE_STDLIB_H=1 -DHAVE_STRING_H=1 -DHAVE_MEMORY_H=1 -DHAVE_STRINGS_H=1 -DHAVE_INTTYPES_H=1 -DHAVE_STDINT_H=1 -DHAVE_UNISTD_H=1 -DHAVE_DLFCN_H=1 -DLT_OBJDIR=\".libs/\" -DHAVE_CXX11=1 -DHAVE_PTHREAD_PRIO_INHERIT=1 -DHAVE_PTHREAD=1 -DHAVE_LIBZ=1 -DHAVE_LIBCURL=1 -DHAVE_APR_POOLS_H=1 -DHAVE_LIBAPR_1=1 -DHAVE_SVN_VERSION_H=1 -DHAVE_LIBSVN_SUBR_1=1 -DHAVE_SVN_DELTA_H=1 -DHAVE_LIBSVN_DELTA_1=1 -DHAVE_LIBSASL2=1 -DMESOS_HAS_JAVA=1 -DHAVE_PYTHON=\"2.7\" -DMESOS_HAS_PYTHON=1 -I. -I../../src   -Wall -Werror -DLIBDIR=\"<https://builds.apache.org/job/mesos-reviewbot/ws/mesos-0.29.0/_inst/lib\"> -DPKGLIBEXECDIR=\"<https://builds.apache.org/job/mesos-reviewbot/ws/mesos-0.29.0/_inst/libexec/mesos\"> -DPKGDATADIR=\"<https://builds.apache.org/job/mesos-reviewbot/ws/mesos-0.29.0/_inst/share/mesos\"> -DPKGMODULEDIR=\"<https://builds.apache.org/job/mesos-reviewbot/ws/mesos-0.29.0/_inst/lib/mesos/modules\"> -I../../include -I../../3rdparty/libprocess/include -I../../3rdparty/libprocess/3rdparty/stout/include -I../include -I../include/mesos -isystem ../3rdparty/libprocess/3rdparty/boost-1.53.0 -I../3rdparty/libprocess/3rdparty/picojson-1.3.0 -DPICOJSON_USE_INT64 -D__STDC_FORMAT_MACROS -I../3rdparty/libprocess/3rdparty/protobuf-2.5.0/src -I../3rdparty/libprocess/3rdparty/glog-0.3.3/src -I../3rdparty/libprocess/3rdparty/glog-0.3.3/src -I../3rdparty/leveldb-1.4/include -I../3rdparty/zookeeper-3.4.5/src/c/include -I../3rdparty/zookeeper-3.4.5/src/c/generated -I../3rdparty/libprocess/3rdparty/protobuf-2.5.0/src -DSOURCE_DIR=\"<https://builds.apache.org/job/mesos-reviewbot/ws/mesos-0.29.0/_build/..\"> -DBUILD_DIR=\"<https://builds.apache.org/job/mesos-reviewbot/ws/mesos-0.29.0/_build\"> -I../3rdparty/libprocess/3rdparty/gmock-1.7.0/gtest/include -I../3rdparty/libprocess/3rdparty/gmock-1.7.0/include -DTESTLIBEXECDIR=\"<https://builds.apache.org/job/mesos-reviewbot/ws/mesos-0.29.0/_inst/libexec/mesos/tests\"> -DSBINDIR=\"<https://builds.apache.org/job/mesos-reviewbot/ws/mesos-0.29.0/_inst/sbin\"> -I/home/jenkins/tools/java/jdk1.6.0_20-64/include -I/home/jenkins/tools/java/jdk1.6.0_20-64/include/linux -DZOOKEEPER_VERSION=\"3.4.5\" -I/usr/include/subversion-1 -I/usr/include/apr-1 -I/usr/include/apr-1.0  -pthread -g1 -O0 -Wno-unused-local-typedefs -std=c++11 -MT tests/mesos_tests-master_maintenance_tests.o -MD -MP -MF tests/.deps/mesos_tests-master_maintenance_tests.Tpo -c -o tests/mesos_tests-master_maintenance_tests.o `test -f 'tests/master_maintenance_tests.cpp' || echo '../../src/'`tests/master_maintenance_tests.cpp
mv -f tests/.deps/mesos_tests-hierarchical_allocator_tests.Tpo tests/.deps/mesos_tests-hierarchical_allocator_tests.Po
g++ -DPACKAGE_NAME=\"mesos\" -DPACKAGE_TARNAME=\"mesos\" -DPACKAGE_VERSION=\"0.29.0\" -DPACKAGE_STRING=\"mesos\ 0.29.0\" -DPACKAGE_BUGREPORT=\"\" -DPACKAGE_URL=\"\" -DPACKAGE=\"mesos\" -DVERSION=\"0.29.0\" -DSTDC_HEADERS=1 -DHAVE_SYS_TYPES_H=1 -DHAVE_SYS_STAT_H=1 -DHAVE_STDLIB_H=1 -DHAVE_STRING_H=1 -DHAVE_MEMORY_H=1 -DHAVE_STRINGS_H=1 -DHAVE_INTTYPES_H=1 -DHAVE_STDINT_H=1 -DHAVE_UNISTD_H=1 -DHAVE_DLFCN_H=1 -DLT_OBJDIR=\".libs/\" -DHAVE_CXX11=1 -DHAVE_PTHREAD_PRIO_INHERIT=1 -DHAVE_PTHREAD=1 -DHAVE_LIBZ=1 -DHAVE_LIBCURL=1 -DHAVE_APR_POOLS_H=1 -DHAVE_LIBAPR_1=1 -DHAVE_SVN_VERSION_H=1 -DHAVE_LIBSVN_SUBR_1=1 -DHAVE_SVN_DELTA_H=1 -DHAVE_LIBSVN_DELTA_1=1 -DHAVE_LIBSASL2=1 -DMESOS_HAS_JAVA=1 -DHAVE_PYTHON=\"2.7\" -DMESOS_HAS_PYTHON=1 -I. -I../../src   -Wall -Werror -DLIBDIR=\"<https://builds.apache.org/job/mesos-reviewbot/ws/mesos-0.29.0/_inst/lib\"> -DPKGLIBEXECDIR=\"<https://builds.apache.org/job/mesos-reviewbot/ws/mesos-0.29.0/_inst/libexec/mesos\"> -DPKGDATADIR=\"<https://builds.apache.org/job/mesos-reviewbot/ws/mesos-0.29.0/_inst/share/mesos\"> -DPKGMODULEDIR=\"<https://builds.apache.org/job/mesos-reviewbot/ws/mesos-0.29.0/_inst/lib/mesos/modules\"> -I../../include -I../../3rdparty/libprocess/include -I../../3rdparty/libprocess/3rdparty/stout/include -I../include -I../include/mesos -isystem ../3rdparty/libprocess/3rdparty/boost-1.53.0 -I../3rdparty/libprocess/3rdparty/picojson-1.3.0 -DPICOJSON_USE_INT64 -D__STDC_FORMAT_MACROS -I../3rdparty/libprocess/3rdparty/protobuf-2.5.0/src -I../3rdparty/libprocess/3rdparty/glog-0.3.3/src -I../3rdparty/libprocess/3rdparty/glog-0.3.3/src -I../3rdparty/leveldb-1.4/include -I../3rdparty/zookeeper-3.4.5/src/c/include -I../3rdparty/zookeeper-3.4.5/src/c/generated -I../3rdparty/libprocess/3rdparty/protobuf-2.5.0/src -DSOURCE_DIR=\"<https://builds.apache.org/job/mesos-reviewbot/ws/mesos-0.29.0/_build/..\"> -DBUILD_DIR=\"<https://builds.apache.org/job/mesos-reviewbot/ws/mesos-0.29.0/_build\"> -I../3rdparty/libprocess/3rdparty/gmock-1.7.0/gtest/include -I../3rdparty/libprocess/3rdparty/gmock-1.7.0/include -DTESTLIBEXECDIR=\"<https://builds.apache.org/job/mesos-reviewbot/ws/mesos-0.29.0/_inst/libexec/mesos/tests\"> -DSBINDIR=\"<https://builds.apache.org/job/mesos-reviewbot/ws/mesos-0.29.0/_inst/sbin\"> -I/home/jenkins/tools/java/jdk1.6.0_20-64/include -I/home/jenkins/tools/java/jdk1.6.0_20-64/include/linux -DZOOKEEPER_VERSION=\"3.4.5\" -I/usr/include/subversion-1 -I/usr/include/apr-1 -I/usr/include/apr-1.0  -pthread -g1 -O0 -Wno-unused-local-typedefs -std=c++11 -MT tests/mesos_tests-master_quota_tests.o -MD -MP -MF tests/.deps/mesos_tests-master_quota_tests.Tpo -c -o tests/mesos_tests-master_quota_tests.o `test -f 'tests/master_quota_tests.cpp' || echo '../../src/'`tests/master_quota_tests.cpp
mv -f tests/.deps/mesos_tests-hook_tests.Tpo tests/.deps/mesos_tests-hook_tests.Po
g++ -DPACKAGE_NAME=\"mesos\" -DPACKAGE_TARNAME=\"mesos\" -DPACKAGE_VERSION=\"0.29.0\" -DPACKAGE_STRING=\"mesos\ 0.29.0\" -DPACKAGE_BUGREPORT=\"\" -DPACKAGE_URL=\"\" -DPACKAGE=\"mesos\" -DVERSION=\"0.29.0\" -DSTDC_HEADERS=1 -DHAVE_SYS_TYPES_H=1 -DHAVE_SYS_STAT_H=1 -DHAVE_STDLIB_H=1 -DHAVE_STRING_H=1 -DHAVE_MEMORY_H=1 -DHAVE_STRINGS_H=1 -DHAVE_INTTYPES_H=1 -DHAVE_STDINT_H=1 -DHAVE_UNISTD_H=1 -DHAVE_DLFCN_H=1 -DLT_OBJDIR=\".libs/\" -DHAVE_CXX11=1 -DHAVE_PTHREAD_PRIO_INHERIT=1 -DHAVE_PTHREAD=1 -DHAVE_LIBZ=1 -DHAVE_LIBCURL=1 -DHAVE_APR_POOLS_H=1 -DHAVE_LIBAPR_1=1 -DHAVE_SVN_VERSION_H=1 -DHAVE_LIBSVN_SUBR_1=1 -DHAVE_SVN_DELTA_H=1 -DHAVE_LIBSVN_DELTA_1=1 -DHAVE_LIBSASL2=1 -DMESOS_HAS_JAVA=1 -DHAVE_PYTHON=\"2.7\" -DMESOS_HAS_PYTHON=1 -I. -I../../src   -Wall -Werror -DLIBDIR=\"<https://builds.apache.org/job/mesos-reviewbot/ws/mesos-0.29.0/_inst/lib\"> -DPKGLIBEXECDIR=\"<https://builds.apache.org/job/mesos-reviewbot/ws/mesos-0.29.0/_inst/libexec/mesos\"> -DPKGDATADIR=\"<https://builds.apache.org/job/mesos-reviewbot/ws/mesos-0.29.0/_inst/share/mesos\"> -DPKGMODULEDIR=\"<https://builds.apache.org/job/mesos-reviewbot/ws/mesos-0.29.0/_inst/lib/mesos/modules\"> -I../../include -I../../3rdparty/libprocess/include -I../../3rdparty/libprocess/3rdparty/stout/include -I../include -I../include/mesos -isystem ../3rdparty/libprocess/3rdparty/boost-1.53.0 -I../3rdparty/libprocess/3rdparty/picojson-1.3.0 -DPICOJSON_USE_INT64 -D__STDC_FORMAT_MACROS -I../3rdparty/libprocess/3rdparty/protobuf-2.5.0/src -I../3rdparty/libprocess/3rdparty/glog-0.3.3/src -I../3rdparty/libprocess/3rdparty/glog-0.3.3/src -I../3rdparty/leveldb-1.4/include -I../3rdparty/zookeeper-3.4.5/src/c/include -I../3rdparty/zookeeper-3.4.5/src/c/generated -I../3rdparty/libprocess/3rdparty/protobuf-2.5.0/src -DSOURCE_DIR=\"<https://builds.apache.org/job/mesos-reviewbot/ws/mesos-0.29.0/_build/..\"> -DBUILD_DIR=\"<https://builds.apache.org/job/mesos-reviewbot/ws/mesos-0.29.0/_build\"> -I../3rdparty/libprocess/3rdparty/gmock-1.7.0/gtest/include -I../3rdparty/libprocess/3rdparty/gmock-1.7.0/include -DTESTLIBEXECDIR=\"<https://builds.apache.org/job/mesos-reviewbot/ws/mesos-0.29.0/_inst/libexec/mesos/tests\"> -DSBINDIR=\"<https://builds.apache.org/job/mesos-reviewbot/ws/mesos-0.29.0/_inst/sbin\"> -I/home/jenkins/tools/java/jdk1.6.0_20-64/include -I/home/jenkins/tools/java/jdk1.6.0_20-64/include/linux -DZOOKEEPER_VERSION=\"3.4.5\" -I/usr/include/subversion-1 -I/usr/include/apr-1 -I/usr/include/apr-1.0  -pthread -g1 -O0 -Wno-unused-local-typedefs -std=c++11 -MT tests/mesos_tests-master_slave_reconciliation_tests.o -MD -MP -MF tests/.deps/mesos_tests-master_slave_reconciliation_tests.Tpo -c -o tests/mesos_tests-master_slave_reconciliation_tests.o `test -f 'tests/master_slave_reconciliation_tests.cpp' || echo '../../src/'`tests/master_slave_reconciliation_tests.cpp
mv -f tests/.deps/mesos_tests-http_authentication_tests.Tpo tests/.deps/mesos_tests-http_authentication_tests.Po
g++ -DPACKAGE_NAME=\"mesos\" -DPACKAGE_TARNAME=\"mesos\" -DPACKAGE_VERSION=\"0.29.0\" -DPACKAGE_STRING=\"mesos\ 0.29.0\" -DPACKAGE_BUGREPORT=\"\" -DPACKAGE_URL=\"\" -DPACKAGE=\"mesos\" -DVERSION=\"0.29.0\" -DSTDC_HEADERS=1 -DHAVE_SYS_TYPES_H=1 -DHAVE_SYS_STAT_H=1 -DHAVE_STDLIB_H=1 -DHAVE_STRING_H=1 -DHAVE_MEMORY_H=1 -DHAVE_STRINGS_H=1 -DHAVE_INTTYPES_H=1 -DHAVE_STDINT_H=1 -DHAVE_UNISTD_H=1 -DHAVE_DLFCN_H=1 -DLT_OBJDIR=\".libs/\" -DHAVE_CXX11=1 -DHAVE_PTHREAD_PRIO_INHERIT=1 -DHAVE_PTHREAD=1 -DHAVE_LIBZ=1 -DHAVE_LIBCURL=1 -DHAVE_APR_POOLS_H=1 -DHAVE_LIBAPR_1=1 -DHAVE_SVN_VERSION_H=1 -DHAVE_LIBSVN_SUBR_1=1 -DHAVE_SVN_DELTA_H=1 -DHAVE_LIBSVN_DELTA_1=1 -DHAVE_LIBSASL2=1 -DMESOS_HAS_JAVA=1 -DHAVE_PYTHON=\"2.7\" -DMESOS_HAS_PYTHON=1 -I. -I../../src   -Wall -Werror -DLIBDIR=\"<https://builds.apache.org/job/mesos-reviewbot/ws/mesos-0.29.0/_inst/lib\"> -DPKGLIBEXECDIR=\"<https://builds.apache.org/job/mesos-reviewbot/ws/mesos-0.29.0/_inst/libexec/mesos\"> -DPKGDATADIR=\"<https://builds.apache.org/job/mesos-reviewbot/ws/mesos-0.29.0/_inst/share/mesos\"> -DPKGMODULEDIR=\"<https://builds.apache.org/job/mesos-reviewbot/ws/mesos-0.29.0/_inst/lib/mesos/modules\"> -I../../include -I../../3rdparty/libprocess/include -I../../3rdparty/libprocess/3rdparty/stout/include -I../include -I../include/mesos -isystem ../3rdparty/libprocess/3rdparty/boost-1.53.0 -I../3rdparty/libprocess/3rdparty/picojson-1.3.0 -DPICOJSON_USE_INT64 -D__STDC_FORMAT_MACROS -I../3rdparty/libprocess/3rdparty/protobuf-2.5.0/src -I../3rdparty/libprocess/3rdparty/glog-0.3.3/src -I../3rdparty/libprocess/3rdparty/glog-0.3.3/src -I../3rdparty/leveldb-1.4/include -I../3rdparty/zookeeper-3.4.5/src/c/include -I../3rdparty/zookeeper-3.4.5/src/c/generated -I../3rdparty/libprocess/3rdparty/protobuf-2.5.0/src -DSOURCE_DIR=\"<https://builds.apache.org/job/mesos-reviewbot/ws/mesos-0.29.0/_build/..\"> -DBUILD_DIR=\"<https://builds.apache.org/job/mesos-reviewbot/ws/mesos-0.29.0/_build\"> -I../3rdparty/libprocess/3rdparty/gmock-1.7.0/gtest/include -I../3rdparty/libprocess/3rdparty/gmock-1.7.0/include -DTESTLIBEXECDIR=\"<https://builds.apache.org/job/mesos-reviewbot/ws/mesos-0.29.0/_inst/libexec/mesos/tests\"> -DSBINDIR=\"<https://builds.apache.org/job/mesos-reviewbot/ws/mesos-0.29.0/_inst/sbin\"> -I/home/jenkins/tools/java/jdk1.6.0_20-64/include -I/home/jenkins/tools/java/jdk1.6.0_20-64/include/linux -DZOOKEEPER_VERSION=\"3.4.5\" -I/usr/include/subversion-1 -I/usr/include/apr-1 -I/usr/include/apr-1.0  -pthread -g1 -O0 -Wno-unused-local-typedefs -std=c++11 -MT tests/mesos_tests-master_tests.o -MD -MP -MF tests/.deps/mesos_tests-master_tests.Tpo -c -o tests/mesos_tests-master_tests.o `test -f 'tests/master_tests.cpp' || echo '../../src/'`tests/master_tests.cpp
mv -f tests/.deps/mesos_tests-main.Tpo tests/.deps/mesos_tests-main.Po
g++ -DPACKAGE_NAME=\"mesos\" -DPACKAGE_TARNAME=\"mesos\" -DPACKAGE_VERSION=\"0.29.0\" -DPACKAGE_STRING=\"mesos\ 0.29.0\" -DPACKAGE_BUGREPORT=\"\" -DPACKAGE_URL=\"\" -DPACKAGE=\"mesos\" -DVERSION=\"0.29.0\" -DSTDC_HEADERS=1 -DHAVE_SYS_TYPES_H=1 -DHAVE_SYS_STAT_H=1 -DHAVE_STDLIB_H=1 -DHAVE_STRING_H=1 -DHAVE_MEMORY_H=1 -DHAVE_STRINGS_H=1 -DHAVE_INTTYPES_H=1 -DHAVE_STDINT_H=1 -DHAVE_UNISTD_H=1 -DHAVE_DLFCN_H=1 -DLT_OBJDIR=\".libs/\" -DHAVE_CXX11=1 -DHAVE_PTHREAD_PRIO_INHERIT=1 -DHAVE_PTHREAD=1 -DHAVE_LIBZ=1 -DHAVE_LIBCURL=1 -DHAVE_APR_POOLS_H=1 -DHAVE_LIBAPR_1=1 -DHAVE_SVN_VERSION_H=1 -DHAVE_LIBSVN_SUBR_1=1 -DHAVE_SVN_DELTA_H=1 -DHAVE_LIBSVN_DELTA_1=1 -DHAVE_LIBSASL2=1 -DMESOS_HAS_JAVA=1 -DHAVE_PYTHON=\"2.7\" -DMESOS_HAS_PYTHON=1 -I. -I../../src   -Wall -Werror -DLIBDIR=\"<https://builds.apache.org/job/mesos-reviewbot/ws/mesos-0.29.0/_inst/lib\"> -DPKGLIBEXECDIR=\"<https://builds.apache.org/job/mesos-reviewbot/ws/mesos-0.29.0/_inst/libexec/mesos\"> -DPKGDATADIR=\"<https://builds.apache.org/job/mesos-reviewbot/ws/mesos-0.29.0/_inst/share/mesos\"> -DPKGMODULEDIR=\"<https://builds.apache.org/job/mesos-reviewbot/ws/mesos-0.29.0/_inst/lib/mesos/modules\"> -I../../include -I../../3rdparty/libprocess/include -I../../3rdparty/libprocess/3rdparty/stout/include -I../include -I../include/mesos -isystem ../3rdparty/libprocess/3rdparty/boost-1.53.0 -I../3rdparty/libprocess/3rdparty/picojson-1.3.0 -DPICOJSON_USE_INT64 -D__STDC_FORMAT_MACROS -I../3rdparty/libprocess/3rdparty/protobuf-2.5.0/src -I../3rdparty/libprocess/3rdparty/glog-0.3.3/src -I../3rdparty/libprocess/3rdparty/glog-0.3.3/src -I../3rdparty/leveldb-1.4/include -I../3rdparty/zookeeper-3.4.5/src/c/include -I../3rdparty/zookeeper-3.4.5/src/c/generated -I../3rdparty/libprocess/3rdparty/protobuf-2.5.0/src -DSOURCE_DIR=\"<https://builds.apache.org/job/mesos-reviewbot/ws/mesos-0.29.0/_build/..\"> -DBUILD_DIR=\"<https://builds.apache.org/job/mesos-reviewbot/ws/mesos-0.29.0/_build\"> -I../3rdparty/libprocess/3rdparty/gmock-1.7.0/gtest/include -I../3rdparty/libprocess/3rdparty/gmock-1.7.0/include -DTESTLIBEXECDIR=\"<https://builds.apache.org/job/mesos-reviewbot/ws/mesos-0.29.0/_inst/libexec/mesos/tests\"> -DSBINDIR=\"<https://builds.apache.org/job/mesos-reviewbot/ws/mesos-0.29.0/_inst/sbin\"> -I/home/jenkins/tools/java/jdk1.6.0_20-64/include -I/home/jenkins/tools/java/jdk1.6.0_20-64/include/linux -DZOOKEEPER_VERSION=\"3.4.5\" -I/usr/include/subversion-1 -I/usr/include/apr-1 -I/usr/include/apr-1.0  -pthread -g1 -O0 -Wno-unused-local-typedefs -std=c++11 -MT tests/mesos_tests-master_validation_tests.o -MD -MP -MF tests/.deps/mesos_tests-master_validation_tests.Tpo -c -o tests/mesos_tests-master_validation_tests.o `test -f 'tests/master_validation_tests.cpp' || echo '../../src/'`tests/master_validation_tests.cpp
mv -f tests/.deps/mesos_tests-http_fault_tolerance_tests.Tpo tests/.deps/mesos_tests-http_fault_tolerance_tests.Po
g++ -DPACKAGE_NAME=\"mesos\" -DPACKAGE_TARNAME=\"mesos\" -DPACKAGE_VERSION=\"0.29.0\" -DPACKAGE_STRING=\"mesos\ 0.29.0\" -DPACKAGE_BUGREPORT=\"\" -DPACKAGE_URL=\"\" -DPACKAGE=\"mesos\" -DVERSION=\"0.29.0\" -DSTDC_HEADERS=1 -DHAVE_SYS_TYPES_H=1 -DHAVE_SYS_STAT_H=1 -DHAVE_STDLIB_H=1 -DHAVE_STRING_H=1 -DHAVE_MEMORY_H=1 -DHAVE_STRINGS_H=1 -DHAVE_INTTYPES_H=1 -DHAVE_STDINT_H=1 -DHAVE_UNISTD_H=1 -DHAVE_DLFCN_H=1 -DLT_OBJDIR=\".libs/\" -DHAVE_CXX11=1 -DHAVE_PTHREAD_PRIO_INHERIT=1 -DHAVE_PTHREAD=1 -DHAVE_LIBZ=1 -DHAVE_LIBCURL=1 -DHAVE_APR_POOLS_H=1 -DHAVE_LIBAPR_1=1 -DHAVE_SVN_VERSION_H=1 -DHAVE_LIBSVN_SUBR_1=1 -DHAVE_SVN_DELTA_H=1 -DHAVE_LIBSVN_DELTA_1=1 -DHAVE_LIBSASL2=1 -DMESOS_HAS_JAVA=1 -DHAVE_PYTHON=\"2.7\" -DMESOS_HAS_PYTHON=1 -I. -I../../src   -Wall -Werror -DLIBDIR=\"<https://builds.apache.org/job/mesos-reviewbot/ws/mesos-0.29.0/_inst/lib\"> -DPKGLIBEXECDIR=\"<https://builds.apache.org/job/mesos-reviewbot/ws/mesos-0.29.0/_inst/libexec/mesos\"> -DPKGDATADIR=\"<https://builds.apache.org/job/mesos-reviewbot/ws/mesos-0.29.0/_inst/share/mesos\"> -DPKGMODULEDIR=\"<https://builds.apache.org/job/mesos-reviewbot/ws/mesos-0.29.0/_inst/lib/mesos/modules\"> -I../../include -I../../3rdparty/libprocess/include -I../../3rdparty/libprocess/3rdparty/stout/include -I../include -I../include/mesos -isystem ../3rdparty/libprocess/3rdparty/boost-1.53.0 -I../3rdparty/libprocess/3rdparty/picojson-1.3.0 -DPICOJSON_USE_INT64 -D__STDC_FORMAT_MACROS -I../3rdparty/libprocess/3rdparty/protobuf-2.5.0/src -I../3rdparty/libprocess/3rdparty/glog-0.3.3/src -I../3rdparty/libprocess/3rdparty/glog-0.3.3/src -I../3rdparty/leveldb-1.4/include -I../3rdparty/zookeeper-3.4.5/src/c/include -I../3rdparty/zookeeper-3.4.5/src/c/generated -I../3rdparty/libprocess/3rdparty/protobuf-2.5.0/src -DSOURCE_DIR=\"<https://builds.apache.org/job/mesos-reviewbot/ws/mesos-0.29.0/_build/..\"> -DBUILD_DIR=\"<https://builds.apache.org/job/mesos-reviewbot/ws/mesos-0.29.0/_build\"> -I../3rdparty/libprocess/3rdparty/gmock-1.7.0/gtest/include -I../3rdparty/libprocess/3rdparty/gmock-1.7.0/include -DTESTLIBEXECDIR=\"<https://builds.apache.org/job/mesos-reviewbot/ws/mesos-0.29.0/_inst/libexec/mesos/tests\"> -DSBINDIR=\"<https://builds.apache.org/job/mesos-reviewbot/ws/mesos-0.29.0/_inst/sbin\"> -I/home/jenkins/tools/java/jdk1.6.0_20-64/include -I/home/jenkins/tools/java/jdk1.6.0_20-64/include/linux -DZOOKEEPER_VERSION=\"3.4.5\" -I/usr/include/subversion-1 -I/usr/include/apr-1 -I/usr/include/apr-1.0  -pthread -g1 -O0 -Wno-unused-local-typedefs -std=c++11 -MT tests/mesos_tests-mesos.o -MD -MP -MF tests/.deps/mesos_tests-mesos.Tpo -c -o tests/mesos_tests-mesos.o `test -f 'tests/mesos.cpp' || echo '../../src/'`tests/mesos.cpp
mv -f tests/.deps/mesos_tests-log_tests.Tpo tests/.deps/mesos_tests-log_tests.Po
g++ -DPACKAGE_NAME=\"mesos\" -DPACKAGE_TARNAME=\"mesos\" -DPACKAGE_VERSION=\"0.29.0\" -DPACKAGE_STRING=\"mesos\ 0.29.0\" -DPACKAGE_BUGREPORT=\"\" -DPACKAGE_URL=\"\" -DPACKAGE=\"mesos\" -DVERSION=\"0.29.0\" -DSTDC_HEADERS=1 -DHAVE_SYS_TYPES_H=1 -DHAVE_SYS_STAT_H=1 -DHAVE_STDLIB_H=1 -DHAVE_STRING_H=1 -DHAVE_MEMORY_H=1 -DHAVE_STRINGS_H=1 -DHAVE_INTTYPES_H=1 -DHAVE_STDINT_H=1 -DHAVE_UNISTD_H=1 -DHAVE_DLFCN_H=1 -DLT_OBJDIR=\".libs/\" -DHAVE_CXX11=1 -DHAVE_PTHREAD_PRIO_INHERIT=1 -DHAVE_PTHREAD=1 -DHAVE_LIBZ=1 -DHAVE_LIBCURL=1 -DHAVE_APR_POOLS_H=1 -DHAVE_LIBAPR_1=1 -DHAVE_SVN_VERSION_H=1 -DHAVE_LIBSVN_SUBR_1=1 -DHAVE_SVN_DELTA_H=1 -DHAVE_LIBSVN_DELTA_1=1 -DHAVE_LIBSASL2=1 -DMESOS_HAS_JAVA=1 -DHAVE_PYTHON=\"2.7\" -DMESOS_HAS_PYTHON=1 -I. -I../../src   -Wall -Werror -DLIBDIR=\"<https://builds.apache.org/job/mesos-reviewbot/ws/mesos-0.29.0/_inst/lib\"> -DPKGLIBEXECDIR=\"<https://builds.apache.org/job/mesos-reviewbot/ws/mesos-0.29.0/_inst/libexec/mesos\"> -DPKGDATADIR=\"<https://builds.apache.org/job/mesos-reviewbot/ws/mesos-0.29.0/_inst/share/mesos\"> -DPKGMODULEDIR=\"<https://builds.apache.org/job/mesos-reviewbot/ws/mesos-0.29.0/_inst/lib/mesos/modules\"> -I../../include -I../../3rdparty/libprocess/include -I../../3rdparty/libprocess/3rdparty/stout/include -I../include -I../include/mesos -isystem ../3rdparty/libprocess/3rdparty/boost-1.53.0 -I../3rdparty/libprocess/3rdparty/picojson-1.3.0 -DPICOJSON_USE_INT64 -D__STDC_FORMAT_MACROS -I../3rdparty/libprocess/3rdparty/protobuf-2.5.0/src -I../3rdparty/libprocess/3rdparty/glog-0.3.3/src -I../3rdparty/libprocess/3rdparty/glog-0.3.3/src -I../3rdparty/leveldb-1.4/include -I../3rdparty/zookeeper-3.4.5/src/c/include -I../3rdparty/zookeeper-3.4.5/src/c/generated -I../3rdparty/libprocess/3rdparty/protobuf-2.5.0/src -DSOURCE_DIR=\"<https://builds.apache.org/job/mesos-reviewbot/ws/mesos-0.29.0/_build/..\"> -DBUILD_DIR=\"<https://builds.apache.org/job/mesos-reviewbot/ws/mesos-0.29.0/_build\"> -I../3rdparty/libprocess/3rdparty/gmock-1.7.0/gtest/include -I../3rdparty/libprocess/3rdparty/gmock-1.7.0/include -DTESTLIBEXECDIR=\"<https://builds.apache.org/job/mesos-reviewbot/ws/mesos-0.29.0/_inst/libexec/mesos/tests\"> -DSBINDIR=\"<https://builds.apache.org/job/mesos-reviewbot/ws/mesos-0.29.0/_inst/sbin\"> -I/home/jenkins/tools/java/jdk1.6.0_20-64/include -I/home/jenkins/tools/java/jdk1.6.0_20-64/include/linux -DZOOKEEPER_VERSION=\"3.4.5\" -I/usr/include/subversion-1 -I/usr/include/apr-1 -I/usr/include/apr-1.0  -pthread -g1 -O0 -Wno-unused-local-typedefs -std=c++11 -MT tests/mesos_tests-metrics_tests.o -MD -MP -MF tests/.deps/mesos_tests-metrics_tests.Tpo -c -o tests/mesos_tests-metrics_tests.o `test -f 'tests/metrics_tests.cpp' || echo '../../src/'`tests/metrics_tests.cpp
mv -f tests/.deps/mesos_tests-master_authorization_tests.Tpo tests/.deps/mesos_tests-master_authorization_tests.Po
g++ -DPACKAGE_NAME=\"mesos\" -DPACKAGE_TARNAME=\"mesos\" -DPACKAGE_VERSION=\"0.29.0\" -DPACKAGE_STRING=\"mesos\ 0.29.0\" -DPACKAGE_BUGREPORT=\"\" -DPACKAGE_URL=\"\" -DPACKAGE=\"mesos\" -DVERSION=\"0.29.0\" -DSTDC_HEADERS=1 -DHAVE_SYS_TYPES_H=1 -DHAVE_SYS_STAT_H=1 -DHAVE_STDLIB_H=1 -DHAVE_STRING_H=1 -DHAVE_MEMORY_H=1 -DHAVE_STRINGS_H=1 -DHAVE_INTTYPES_H=1 -DHAVE_STDINT_H=1 -DHAVE_UNISTD_H=1 -DHAVE_DLFCN_H=1 -DLT_OBJDIR=\".libs/\" -DHAVE_CXX11=1 -DHAVE_PTHREAD_PRIO_INHERIT=1 -DHAVE_PTHREAD=1 -DHAVE_LIBZ=1 -DHAVE_LIBCURL=1 -DHAVE_APR_POOLS_H=1 -DHAVE_LIBAPR_1=1 -DHAVE_SVN_VERSION_H=1 -DHAVE_LIBSVN_SUBR_1=1 -DHAVE_SVN_DELTA_H=1 -DHAVE_LIBSVN_DELTA_1=1 -DHAVE_LIBSASL2=1 -DMESOS_HAS_JAVA=1 -DHAVE_PYTHON=\"2.7\" -DMESOS_HAS_PYTHON=1 -I. -I../../src   -Wall -Werror -DLIBDIR=\"<https://builds.apache.org/job/mesos-reviewbot/ws/mesos-0.29.0/_inst/lib\"> -DPKGLIBEXECDIR=\"<https://builds.apache.org/job/mesos-reviewbot/ws/mesos-0.29.0/_inst/libexec/mesos\"> -DPKGDATADIR=\"<https://builds.apache.org/job/mesos-reviewbot/ws/mesos-0.29.0/_inst/share/mesos\"> -DPKGMODULEDIR=\"<https://builds.apache.org/job/mesos-reviewbot/ws/mesos-0.29.0/_inst/lib/mesos/modules\"> -I../../include -I../../3rdparty/libprocess/include -I../../3rdparty/libprocess/3rdparty/stout/include -I../include -I../include/mesos -isystem ../3rdparty/libprocess/3rdparty/boost-1.53.0 -I../3rdparty/libprocess/3rdparty/picojson-1.3.0 -DPICOJSON_USE_INT64 -D__STDC_FORMAT_MACROS -I../3rdparty/libprocess/3rdparty/protobuf-2.5.0/src -I../3rdparty/libprocess/3rdparty/glog-0.3.3/src -I../3rdparty/libprocess/3rdparty/glog-0.3.3/src -I../3rdparty/leveldb-1.4/include -I../3rdparty/zookeeper-3.4.5/src/c/include -I../3rdparty/zookeeper-3.4.5/src/c/generated -I../3rdparty/libprocess/3rdparty/protobuf-2.5.0/src -DSOURCE_DIR=\"<https://builds.apache.org/job/mesos-reviewbot/ws/mesos-0.29.0/_build/..\"> -DBUILD_DIR=\"<https://builds.apache.org/job/mesos-reviewbot/ws/mesos-0.29.0/_build\"> -I../3rdparty/libprocess/3rdparty/gmock-1.7.0/gtest/include -I../3rdparty/libprocess/3rdparty/gmock-1.7.0/include -DTESTLIBEXECDIR=\"<https://builds.apache.org/job/mesos-reviewbot/ws/mesos-0.29.0/_inst/libexec/mesos/tests\"> -DSBINDIR=\"<https://builds.apache.org/job/mesos-reviewbot/ws/mesos-0.29.0/_inst/sbin\"> -I/home/jenkins/tools/java/jdk1.6.0_20-64/include -I/home/jenkins/tools/java/jdk1.6.0_20-64/include/linux -DZOOKEEPER_VERSION=\"3.4.5\" -I/usr/include/subversion-1 -I/usr/include/apr-1 -I/usr/include/apr-1.0  -pthread -g1 -O0 -Wno-unused-local-typedefs -std=c++11 -MT tests/mesos_tests-module.o -MD -MP -MF tests/.deps/mesos_tests-module.Tpo -c -o tests/mesos_tests-module.o `test -f 'tests/module.cpp' || echo '../../src/'`tests/module.cpp
mv -f tests/.deps/mesos_tests-master_contender_detector_tests.Tpo tests/.deps/mesos_tests-master_contender_detector_tests.Po
g++ -DPACKAGE_NAME=\"mesos\" -DPACKAGE_TARNAME=\"mesos\" -DPACKAGE_VERSION=\"0.29.0\" -DPACKAGE_STRING=\"mesos\ 0.29.0\" -DPACKAGE_BUGREPORT=\"\" -DPACKAGE_URL=\"\" -DPACKAGE=\"mesos\" -DVERSION=\"0.29.0\" -DSTDC_HEADERS=1 -DHAVE_SYS_TYPES_H=1 -DHAVE_SYS_STAT_H=1 -DHAVE_STDLIB_H=1 -DHAVE_STRING_H=1 -DHAVE_MEMORY_H=1 -DHAVE_STRINGS_H=1 -DHAVE_INTTYPES_H=1 -DHAVE_STDINT_H=1 -DHAVE_UNISTD_H=1 -DHAVE_DLFCN_H=1 -DLT_OBJDIR=\".libs/\" -DHAVE_CXX11=1 -DHAVE_PTHREAD_PRIO_INHERIT=1 -DHAVE_PTHREAD=1 -DHAVE_LIBZ=1 -DHAVE_LIBCURL=1 -DHAVE_APR_POOLS_H=1 -DHAVE_LIBAPR_1=1 -DHAVE_SVN_VERSION_H=1 -DHAVE_LIBSVN_SUBR_1=1 -DHAVE_SVN_DELTA_H=1 -DHAVE_LIBSVN_DELTA_1=1 -DHAVE_LIBSASL2=1 -DMESOS_HAS_JAVA=1 -DHAVE_PYTHON=\"2.7\" -DMESOS_HAS_PYTHON=1 -I. -I../../src   -Wall -Werror -DLIBDIR=\"<https://builds.apache.org/job/mesos-reviewbot/ws/mesos-0.29.0/_inst/lib\"> -DPKGLIBEXECDIR=\"<https://builds.apache.org/job/mesos-reviewbot/ws/mesos-0.29.0/_inst/libexec/mesos\"> -DPKGDATADIR=\"<https://builds.apache.org/job/mesos-reviewbot/ws/mesos-0.29.0/_inst/share/mesos\"> -DPKGMODULEDIR=\"<https://builds.apache.org/job/mesos-reviewbot/ws/mesos-0.29.0/_inst/lib/mesos/modules\"> -I../../include -I../../3rdparty/libprocess/include -I../../3rdparty/libprocess/3rdparty/stout/include -I../include -I../include/mesos -isystem ../3rdparty/libprocess/3rdparty/boost-1.53.0 -I../3rdparty/libprocess/3rdparty/picojson-1.3.0 -DPICOJSON_USE_INT64 -D__STDC_FORMAT_MACROS -I../3rdparty/libprocess/3rdparty/protobuf-2.5.0/src -I../3rdparty/libprocess/3rdparty/glog-0.3.3/src -I../3rdparty/libprocess/3rdparty/glog-0.3.3/src -I../3rdparty/leveldb-1.4/include -I../3rdparty/zookeeper-3.4.5/src/c/include -I../3rdparty/zookeeper-3.4.5/src/c/generated -I../3rdparty/libprocess/3rdparty/protobuf-2.5.0/src -DSOURCE_DIR=\"<https://builds.apache.org/job/mesos-reviewbot/ws/mesos-0.29.0/_build/..\"> -DBUILD_DIR=\"<https://builds.apache.org/job/mesos-reviewbot/ws/mesos-0.29.0/_build\"> -I../3rdparty/libprocess/3rdparty/gmock-1.7.0/gtest/include -I../3rdparty/libprocess/3rdparty/gmock-1.7.0/include -DTESTLIBEXECDIR=\"<https://builds.apache.org/job/mesos-reviewbot/ws/mesos-0.29.0/_inst/libexec/mesos/tests\"> -DSBINDIR=\"<https://builds.apache.org/job/mesos-reviewbot/ws/mesos-0.29.0/_inst/sbin\"> -I/home/jenkins/tools/java/jdk1.6.0_20-64/include -I/home/jenkins/tools/java/jdk1.6.0_20-64/include/linux -DZOOKEEPER_VERSION=\"3.4.5\" -I/usr/include/subversion-1 -I/usr/include/apr-1 -I/usr/include/apr-1.0  -pthread -g1 -O0 -Wno-unused-local-typedefs -std=c++11 -MT tests/mesos_tests-module_tests.o -MD -MP -MF tests/.deps/mesos_tests-module_tests.Tpo -c -o tests/mesos_tests-module_tests.o `test -f 'tests/module_tests.cpp' || echo '../../src/'`tests/module_tests.cpp
mv -f tests/.deps/mesos_tests-master_allocator_tests.Tpo tests/.deps/mesos_tests-master_allocator_tests.Po
g++ -DPACKAGE_NAME=\"mesos\" -DPACKAGE_TARNAME=\"mesos\" -DPACKAGE_VERSION=\"0.29.0\" -DPACKAGE_STRING=\"mesos\ 0.29.0\" -DPACKAGE_BUGREPORT=\"\" -DPACKAGE_URL=\"\" -DPACKAGE=\"mesos\" -DVERSION=\"0.29.0\" -DSTDC_HEADERS=1 -DHAVE_SYS_TYPES_H=1 -DHAVE_SYS_STAT_H=1 -DHAVE_STDLIB_H=1 -DHAVE_STRING_H=1 -DHAVE_MEMORY_H=1 -DHAVE_STRINGS_H=1 -DHAVE_INTTYPES_H=1 -DHAVE_STDINT_H=1 -DHAVE_UNISTD_H=1 -DHAVE_DLFCN_H=1 -DLT_OBJDIR=\".libs/\" -DHAVE_CXX11=1 -DHAVE_PTHREAD_PRIO_INHERIT=1 -DHAVE_PTHREAD=1 -DHAVE_LIBZ=1 -DHAVE_LIBCURL=1 -DHAVE_APR_POOLS_H=1 -DHAVE_LIBAPR_1=1 -DHAVE_SVN_VERSION_H=1 -DHAVE_LIBSVN_SUBR_1=1 -DHAVE_SVN_DELTA_H=1 -DHAVE_LIBSVN_DELTA_1=1 -DHAVE_LIBSASL2=1 -DMESOS_HAS_JAVA=1 -DHAVE_PYTHON=\"2.7\" -DMESOS_HAS_PYTHON=1 -I. -I../../src   -Wall -Werror -DLIBDIR=\"<https://builds.apache.org/job/mesos-reviewbot/ws/mesos-0.29.0/_inst/lib\"> -DPKGLIBEXECDIR=\"<https://builds.apache.org/job/mesos-reviewbot/ws/mesos-0.29.0/_inst/libexec/mesos\"> -DPKGDATADIR=\"<https://builds.apache.org/job/mesos-reviewbot/ws/mesos-0.29.0/_inst/share/mesos\"> -DPKGMODULEDIR=\"<https://builds.apache.org/job/mesos-reviewbot/ws/mesos-0.29.0/_inst/lib/mesos/modules\"> -I../../include -I../../3rdparty/libprocess/include -I../../3rdparty/libprocess/3rdparty/stout/include -I../include -I../include/mesos -isystem ../3rdparty/libprocess/3rdparty/boost-1.53.0 -I../3rdparty/libprocess/3rdparty/picojson-1.3.0 -DPICOJSON_USE_INT64 -D__STDC_FORMAT_MACROS -I../3rdparty/libprocess/3rdparty/protobuf-2.5.0/src -I../3rdparty/libprocess/3rdparty/glog-0.3.3/src -I../3rdparty/libprocess/3rdparty/glog-0.3.3/src -I../3rdparty/leveldb-1.4/include -I../3rdparty/zookeeper-3.4.5/src/c/include -I../3rdparty/zookeeper-3.4.5/src/c/generated -I../3rdparty/libprocess/3rdparty/protobuf-2.5.0/src -DSOURCE_DIR=\"<https://builds.apache.org/job/mesos-reviewbot/ws/mesos-0.29.0/_build/..\"> -DBUILD_DIR=\"<https://builds.apache.org/job/mesos-reviewbot/ws/mesos-0.29.0/_build\"> -I../3rdparty/libprocess/3rdparty/gmock-1.7.0/gtest/include -I../3rdparty/libprocess/3rdparty/gmock-1.7.0/include -DTESTLIBEXECDIR=\"<https://builds.apache.org/job/mesos-reviewbot/ws/mesos-0.29.0/_inst/libexec/mesos/tests\"> -DSBINDIR=\"<https://builds.apache.org/job/mesos-reviewbot/ws/mesos-0.29.0/_inst/sbin\"> -I/home/jenkins/tools/java/jdk1.6.0_20-64/include -I/home/jenkins/tools/java/jdk1.6.0_20-64/include/linux -DZOOKEEPER_VERSION=\"3.4.5\" -I/usr/include/subversion-1 -I/usr/include/apr-1 -I/usr/include/apr-1.0  -pthread -g1 -O0 -Wno-unused-local-typedefs -std=c++11 -MT tests/mesos_tests-monitor_tests.o -MD -MP -MF tests/.deps/mesos_tests-monitor_tests.Tpo -c -o tests/mesos_tests-monitor_tests.o `test -f 'tests/monitor_tests.cpp' || echo '../../src/'`tests/monitor_tests.cpp
mv -f tests/.deps/mesos_tests-master_maintenance_tests.Tpo tests/.deps/mesos_tests-master_maintenance_tests.Po
g++ -DPACKAGE_NAME=\"mesos\" -DPACKAGE_TARNAME=\"mesos\" -DPACKAGE_VERSION=\"0.29.0\" -DPACKAGE_STRING=\"mesos\ 0.29.0\" -DPACKAGE_BUGREPORT=\"\" -DPACKAGE_URL=\"\" -DPACKAGE=\"mesos\" -DVERSION=\"0.29.0\" -DSTDC_HEADERS=1 -DHAVE_SYS_TYPES_H=1 -DHAVE_SYS_STAT_H=1 -DHAVE_STDLIB_H=1 -DHAVE_STRING_H=1 -DHAVE_MEMORY_H=1 -DHAVE_STRINGS_H=1 -DHAVE_INTTYPES_H=1 -DHAVE_STDINT_H=1 -DHAVE_UNISTD_H=1 -DHAVE_DLFCN_H=1 -DLT_OBJDIR=\".libs/\" -DHAVE_CXX11=1 -DHAVE_PTHREAD_PRIO_INHERIT=1 -DHAVE_PTHREAD=1 -DHAVE_LIBZ=1 -DHAVE_LIBCURL=1 -DHAVE_APR_POOLS_H=1 -DHAVE_LIBAPR_1=1 -DHAVE_SVN_VERSION_H=1 -DHAVE_LIBSVN_SUBR_1=1 -DHAVE_SVN_DELTA_H=1 -DHAVE_LIBSVN_DELTA_1=1 -DHAVE_LIBSASL2=1 -DMESOS_HAS_JAVA=1 -DHAVE_PYTHON=\"2.7\" -DMESOS_HAS_PYTHON=1 -I. -I../../src   -Wall -Werror -DLIBDIR=\"<https://builds.apache.org/job/mesos-reviewbot/ws/mesos-0.29.0/_inst/lib\"> -DPKGLIBEXECDIR=\"<https://builds.apache.org/job/mesos-reviewbot/ws/mesos-0.29.0/_inst/libexec/mesos\"> -DPKGDATADIR=\"<https://builds.apache.org/job/mesos-reviewbot/ws/mesos-0.29.0/_inst/share/mesos\"> -DPKGMODULEDIR=\"<https://builds.apache.org/job/mesos-reviewbot/ws/mesos-0.29.0/_inst/lib/mesos/modules\"> -I../../include -I../../3rdparty/libprocess/include -I../../3rdparty/libprocess/3rdparty/stout/include -I../include -I../include/mesos -isystem ../3rdparty/libprocess/3rdparty/boost-1.53.0 -I../3rdparty/libprocess/3rdparty/picojson-1.3.0 -DPICOJSON_USE_INT64 -D__STDC_FORMAT_MACROS -I../3rdparty/libprocess/3rdparty/protobuf-2.5.0/src -I../3rdparty/libprocess/3rdparty/glog-0.3.3/src -I../3rdparty/libprocess/3rdparty/glog-0.3.3/src -I../3rdparty/leveldb-1.4/include -I../3rdparty/zookeeper-3.4.5/src/c/include -I../3rdparty/zookeeper-3.4.5/src/c/generated -I../3rdparty/libprocess/3rdparty/protobuf-2.5.0/src -DSOURCE_DIR=\"<https://builds.apache.org/job/mesos-reviewbot/ws/mesos-0.29.0/_build/..\"> -DBUILD_DIR=\"<https://builds.apache.org/job/mesos-reviewbot/ws/mesos-0.29.0/_build\"> -I../3rdparty/libprocess/3rdparty/gmock-1.7.0/gtest/include -I../3rdparty/libprocess/3rdparty/gmock-1.7.0/include -DTESTLIBEXECDIR=\"<https://builds.apache.org/job/mesos-reviewbot/ws/mesos-0.29.0/_inst/libexec/mesos/tests\"> -DSBINDIR=\"<https://builds.apache.org/job/mesos-reviewbot/ws/mesos-0.29.0/_inst/sbin\"> -I/home/jenkins/tools/java/jdk1.6.0_20-64/include -I/home/jenkins/tools/java/jdk1.6.0_20-64/include/linux -DZOOKEEPER_VERSION=\"3.4.5\" -I/usr/include/subversion-1 -I/usr/include/apr-1 -I/usr/include/apr-1.0  -pthread -g1 -O0 -Wno-unused-local-typedefs -std=c++11 -MT tests/mesos_tests-oversubscription_tests.o -MD -MP -MF tests/.deps/mesos_tests-oversubscription_tests.Tpo -c -o tests/mesos_tests-oversubscription_tests.o `test -f 'tests/oversubscription_tests.cpp' || echo '../../src/'`tests/oversubscription_tests.cpp
mv -f tests/.deps/mesos_tests-master_validation_tests.Tpo tests/.deps/mesos_tests-master_validation_tests.Po
g++ -DPACKAGE_NAME=\"mesos\" -DPACKAGE_TARNAME=\"mesos\" -DPACKAGE_VERSION=\"0.29.0\" -DPACKAGE_STRING=\"mesos\ 0.29.0\" -DPACKAGE_BUGREPORT=\"\" -DPACKAGE_URL=\"\" -DPACKAGE=\"mesos\" -DVERSION=\"0.29.0\" -DSTDC_HEADERS=1 -DHAVE_SYS_TYPES_H=1 -DHAVE_SYS_STAT_H=1 -DHAVE_STDLIB_H=1 -DHAVE_STRING_H=1 -DHAVE_MEMORY_H=1 -DHAVE_STRINGS_H=1 -DHAVE_INTTYPES_H=1 -DHAVE_STDINT_H=1 -DHAVE_UNISTD_H=1 -DHAVE_DLFCN_H=1 -DLT_OBJDIR=\".libs/\" -DHAVE_CXX11=1 -DHAVE_PTHREAD_PRIO_INHERIT=1 -DHAVE_PTHREAD=1 -DHAVE_LIBZ=1 -DHAVE_LIBCURL=1 -DHAVE_APR_POOLS_H=1 -DHAVE_LIBAPR_1=1 -DHAVE_SVN_VERSION_H=1 -DHAVE_LIBSVN_SUBR_1=1 -DHAVE_SVN_DELTA_H=1 -DHAVE_LIBSVN_DELTA_1=1 -DHAVE_LIBSASL2=1 -DMESOS_HAS_JAVA=1 -DHAVE_PYTHON=\"2.7\" -DMESOS_HAS_PYTHON=1 -I. -I../../src   -Wall -Werror -DLIBDIR=\"<https://builds.apache.org/job/mesos-reviewbot/ws/mesos-0.29.0/_inst/lib\"> -DPKGLIBEXECDIR=\"<https://builds.apache.org/job/mesos-reviewbot/ws/mesos-0.29.0/_inst/libexec/mesos\"> -DPKGDATADIR=\"<https://builds.apache.org/job/mesos-reviewbot/ws/mesos-0.29.0/_inst/share/mesos\"> -DPKGMODULEDIR=\"<https://builds.apache.org/job/mesos-reviewbot/ws/mesos-0.29.0/_inst/lib/mesos/modules\"> -I../../include -I../../3rdparty/libprocess/include -I../../3rdparty/libprocess/3rdparty/stout/include -I../include -I../include/mesos -isystem ../3rdparty/libprocess/3rdparty/boost-1.53.0 -I../3rdparty/libprocess/3rdparty/picojson-1.3.0 -DPICOJSON_USE_INT64 -D__STDC_FORMAT_MACROS -I../3rdparty/libprocess/3rdparty/protobuf-2.5.0/src -I../3rdparty/libprocess/3rdparty/glog-0.3.3/src -I../3rdparty/libprocess/3rdparty/glog-0.3.3/src -I../3rdparty/leveldb-1.4/include -I../3rdparty/zookeeper-3.4.5/src/c/include -I../3rdparty/zookeeper-3.4.5/src/c/generated -I../3rdparty/libprocess/3rdparty/protobuf-2.5.0/src -DSOURCE_DIR=\"<https://builds.apache.org/job/mesos-reviewbot/ws/mesos-0.29.0/_build/..\"> -DBUILD_DIR=\"<https://builds.apache.org/job/mesos-reviewbot/ws/mesos-0.29.0/_build\"> -I../3rdparty/libprocess/3rdparty/gmock-1.7.0/gtest/include -I../3rdparty/libprocess/3rdparty/gmock-1.7.0/include -DTESTLIBEXECDIR=\"<https://builds.apache.org/job/mesos-reviewbot/ws/mesos-0.29.0/_inst/libexec/mesos/tests\"> -DSBINDIR=\"<https://builds.apache.org/job/mesos-reviewbot/ws/mesos-0.29.0/_inst/sbin\"> -I/home/jenkins/tools/java/jdk1.6.0_20-64/include -I/home/jenkins/tools/java/jdk1.6.0_20-64/include/linux -DZOOKEEPER_VERSION=\"3.4.5\" -I/usr/include/subversion-1 -I/usr/include/apr-1 -I/usr/include/apr-1.0  -pthread -g1 -O0 -Wno-unused-local-typedefs -std=c++11 -MT tests/mesos_tests-partition_tests.o -MD -MP -MF tests/.deps/mesos_tests-partition_tests.Tpo -c -o tests/mesos_tests-partition_tests.o `test -f 'tests/partition_tests.cpp' || echo '../../src/'`tests/partition_tests.cpp
mv -f tests/.deps/mesos_tests-master_quota_tests.Tpo tests/.deps/mesos_tests-master_quota_tests.Po
g++ -DPACKAGE_NAME=\"mesos\" -DPACKAGE_TARNAME=\"mesos\" -DPACKAGE_VERSION=\"0.29.0\" -DPACKAGE_STRING=\"mesos\ 0.29.0\" -DPACKAGE_BUGREPORT=\"\" -DPACKAGE_URL=\"\" -DPACKAGE=\"mesos\" -DVERSION=\"0.29.0\" -DSTDC_HEADERS=1 -DHAVE_SYS_TYPES_H=1 -DHAVE_SYS_STAT_H=1 -DHAVE_STDLIB_H=1 -DHAVE_STRING_H=1 -DHAVE_MEMORY_H=1 -DHAVE_STRINGS_H=1 -DHAVE_INTTYPES_H=1 -DHAVE_STDINT_H=1 -DHAVE_UNISTD_H=1 -DHAVE_DLFCN_H=1 -DLT_OBJDIR=\".libs/\" -DHAVE_CXX11=1 -DHAVE_PTHREAD_PRIO_INHERIT=1 -DHAVE_PTHREAD=1 -DHAVE_LIBZ=1 -DHAVE_LIBCURL=1 -DHAVE_APR_POOLS_H=1 -DHAVE_LIBAPR_1=1 -DHAVE_SVN_VERSION_H=1 -DHAVE_LIBSVN_SUBR_1=1 -DHAVE_SVN_DELTA_H=1 -DHAVE_LIBSVN_DELTA_1=1 -DHAVE_LIBSASL2=1 -DMESOS_HAS_JAVA=1 -DHAVE_PYTHON=\"2.7\" -DMESOS_HAS_PYTHON=1 -I. -I../../src   -Wall -Werror -DLIBDIR=\"<https://builds.apache.org/job/mesos-reviewbot/ws/mesos-0.29.0/_inst/lib\"> -DPKGLIBEXECDIR=\"<https://builds.apache.org/job/mesos-reviewbot/ws/mesos-0.29.0/_inst/libexec/mesos\"> -DPKGDATADIR=\"<https://builds.apache.org/job/mesos-reviewbot/ws/mesos-0.29.0/_inst/share/mesos\"> -DPKGMODULEDIR=\"<https://builds.apache.org/job/mesos-reviewbot/ws/mesos-0.29.0/_inst/lib/mesos/modules\"> -I../../include -I../../3rdparty/libprocess/include -I../../3rdparty/libprocess/3rdparty/stout/include -I../include -I../include/mesos -isystem ../3rdparty/libprocess/3rdparty/boost-1.53.0 -I../3rdparty/libprocess/3rdparty/picojson-1.3.0 -DPICOJSON_USE_INT64 -D__STDC_FORMAT_MACROS -I../3rdparty/libprocess/3rdparty/protobuf-2.5.0/src -I../3rdparty/libprocess/3rdparty/glog-0.3.3/src -I../3rdparty/libprocess/3rdparty/glog-0.3.3/src -I../3rdparty/leveldb-1.4/include -I../3rdparty/zookeeper-3.4.5/src/c/include -I../3rdparty/zookeeper-3.4.5/src/c/generated -I../3rdparty/libprocess/3rdparty/protobuf-2.5.0/src -DSOURCE_DIR=\"<https://builds.apache.org/job/mesos-reviewbot/ws/mesos-0.29.0/_build/..\"> -DBUILD_DIR=\"<https://builds.apache.org/job/mesos-reviewbot/ws/mesos-0.29.0/_build\"> -I../3rdparty/libprocess/3rdparty/gmock-1.7.0/gtest/include -I../3rdparty/libprocess/3rdparty/gmock-1.7.0/include -DTESTLIBEXECDIR=\"<https://builds.apache.org/job/mesos-reviewbot/ws/mesos-0.29.0/_inst/libexec/mesos/tests\"> -DSBINDIR=\"<https://builds.apache.org/job/mesos-reviewbot/ws/mesos-0.29.0/_inst/sbin\"> -I/home/jenkins/tools/java/jdk1.6.0_20-64/include -I/home/jenkins/tools/java/jdk1.6.0_20-64/include/linux -DZOOKEEPER_VERSION=\"3.4.5\" -I/usr/include/subversion-1 -I/usr/include/apr-1 -I/usr/include/apr-1.0  -pthread -g1 -O0 -Wno-unused-local-typedefs -std=c++11 -MT tests/mesos_tests-paths_tests.o -MD -MP -MF tests/.deps/mesos_tests-paths_tests.Tpo -c -o tests/mesos_tests-paths_tests.o `test -f 'tests/paths_tests.cpp' || echo '../../src/'`tests/paths_tests.cpp
mv -f tests/.deps/mesos_tests-master_slave_reconciliation_tests.Tpo tests/.deps/mesos_tests-master_slave_reconciliation_tests.Po
g++ -DPACKAGE_NAME=\"mesos\" -DPACKAGE_TARNAME=\"mesos\" -DPACKAGE_VERSION=\"0.29.0\" -DPACKAGE_STRING=\"mesos\ 0.29.0\" -DPACKAGE_BUGREPORT=\"\" -DPACKAGE_URL=\"\" -DPACKAGE=\"mesos\" -DVERSION=\"0.29.0\" -DSTDC_HEADERS=1 -DHAVE_SYS_TYPES_H=1 -DHAVE_SYS_STAT_H=1 -DHAVE_STDLIB_H=1 -DHAVE_STRING_H=1 -DHAVE_MEMORY_H=1 -DHAVE_STRINGS_H=1 -DHAVE_INTTYPES_H=1 -DHAVE_STDINT_H=1 -DHAVE_UNISTD_H=1 -DHAVE_DLFCN_H=1 -DLT_OBJDIR=\".libs/\" -DHAVE_CXX11=1 -DHAVE_PTHREAD_PRIO_INHERIT=1 -DHAVE_PTHREAD=1 -DHAVE_LIBZ=1 -DHAVE_LIBCURL=1 -DHAVE_APR_POOLS_H=1 -DHAVE_LIBAPR_1=1 -DHAVE_SVN_VERSION_H=1 -DHAVE_LIBSVN_SUBR_1=1 -DHAVE_SVN_DELTA_H=1 -DHAVE_LIBSVN_DELTA_1=1 -DHAVE_LIBSASL2=1 -DMESOS_HAS_JAVA=1 -DHAVE_PYTHON=\"2.7\" -DMESOS_HAS_PYTHON=1 -I. -I../../src   -Wall -Werror -DLIBDIR=\"<https://builds.apache.org/job/mesos-reviewbot/ws/mesos-0.29.0/_inst/lib\"> -DPKGLIBEXECDIR=\"<https://builds.apache.org/job/mesos-reviewbot/ws/mesos-0.29.0/_inst/libexec/mesos\"> -DPKGDATADIR=\"<https://builds.apache.org/job/mesos-reviewbot/ws/mesos-0.29.0/_inst/share/mesos\"> -DPKGMODULEDIR=\"<https://builds.apache.org/job/mesos-reviewbot/ws/mesos-0.29.0/_inst/lib/mesos/modules\"> -I../../include -I../../3rdparty/libprocess/include -I../../3rdparty/libprocess/3rdparty/stout/include -I../include -I../include/mesos -isystem ../3rdparty/libprocess/3rdparty/boost-1.53.0 -I../3rdparty/libprocess/3rdparty/picojson-1.3.0 -DPICOJSON_USE_INT64 -D__STDC_FORMAT_MACROS -I../3rdparty/libprocess/3rdparty/protobuf-2.5.0/src -I../3rdparty/libprocess/3rdparty/glog-0.3.3/src -I../3rdparty/libprocess/3rdparty/glog-0.3.3/src -I../3rdparty/leveldb-1.4/include -I../3rdparty/zookeeper-3.4.5/src/c/include -I../3rdparty/zookeeper-3.4.5/src/c/generated -I../3rdparty/libprocess/3rdparty/protobuf-2.5.0/src -DSOURCE_DIR=\"<https://builds.apache.org/job/mesos-reviewbot/ws/mesos-0.29.0/_build/..\"> -DBUILD_DIR=\"<https://builds.apache.org/job/mesos-reviewbot/ws/mesos-0.29.0/_build\"> -I../3rdparty/libprocess/3rdparty/gmock-1.7.0/gtest/include -I../3rdparty/libprocess/3rdparty/gmock-1.7.0/include -DTESTLIBEXECDIR=\"<https://builds.apache.org/job/mesos-reviewbot/ws/mesos-0.29.0/_inst/libexec/mesos/tests\"> -DSBINDIR=\"<https://builds.apache.org/job/mesos-reviewbot/ws/mesos-0.29.0/_inst/sbin\"> -I/home/jenkins/tools/java/jdk1.6.0_20-64/include -I/home/jenkins/tools/java/jdk1.6.0_20-64/include/linux -DZOOKEEPER_VERSION=\"3.4.5\" -I/usr/include/subversion-1 -I/usr/include/apr-1 -I/usr/include/apr-1.0  -pthread -g1 -O0 -Wno-unused-local-typedefs -std=c++11 -MT tests/mesos_tests-persistent_volume_endpoints_tests.o -MD -MP -MF tests/.deps/mesos_tests-persistent_volume_endpoints_tests.Tpo -c -o tests/mesos_tests-persistent_volume_endpoints_tests.o `test -f 'tests/persistent_volume_endpoints_tests.cpp' || echo '../../src/'`tests/persistent_volume_endpoints_tests.cpp
mv -f tests/.deps/mesos_tests-metrics_tests.Tpo tests/.deps/mesos_tests-metrics_tests.Po
g++ -DPACKAGE_NAME=\"mesos\" -DPACKAGE_TARNAME=\"mesos\" -DPACKAGE_VERSION=\"0.29.0\" -DPACKAGE_STRING=\"mesos\ 0.29.0\" -DPACKAGE_BUGREPORT=\"\" -DPACKAGE_URL=\"\" -DPACKAGE=\"mesos\" -DVERSION=\"0.29.0\" -DSTDC_HEADERS=1 -DHAVE_SYS_TYPES_H=1 -DHAVE_SYS_STAT_H=1 -DHAVE_STDLIB_H=1 -DHAVE_STRING_H=1 -DHAVE_MEMORY_H=1 -DHAVE_STRINGS_H=1 -DHAVE_INTTYPES_H=1 -DHAVE_STDINT_H=1 -DHAVE_UNISTD_H=1 -DHAVE_DLFCN_H=1 -DLT_OBJDIR=\".libs/\" -DHAVE_CXX11=1 -DHAVE_PTHREAD_PRIO_INHERIT=1 -DHAVE_PTHREAD=1 -DHAVE_LIBZ=1 -DHAVE_LIBCURL=1 -DHAVE_APR_POOLS_H=1 -DHAVE_LIBAPR_1=1 -DHAVE_SVN_VERSION_H=1 -DHAVE_LIBSVN_SUBR_1=1 -DHAVE_SVN_DELTA_H=1 -DHAVE_LIBSVN_DELTA_1=1 -DHAVE_LIBSASL2=1 -DMESOS_HAS_JAVA=1 -DHAVE_PYTHON=\"2.7\" -DMESOS_HAS_PYTHON=1 -I. -I../../src   -Wall -Werror -DLIBDIR=\"<https://builds.apache.org/job/mesos-reviewbot/ws/mesos-0.29.0/_inst/lib\"> -DPKGLIBEXECDIR=\"<https://builds.apache.org/job/mesos-reviewbot/ws/mesos-0.29.0/_inst/libexec/mesos\"> -DPKGDATADIR=\"<https://builds.apache.org/job/mesos-reviewbot/ws/mesos-0.29.0/_inst/share/mesos\"> -DPKGMODULEDIR=\"<https://builds.apache.org/job/mesos-reviewbot/ws/mesos-0.29.0/_inst/lib/mesos/modules\"> -I../../include -I../../3rdparty/libprocess/include -I../../3rdparty/libprocess/3rdparty/stout/include -I../include -I../include/mesos -isystem ../3rdparty/libprocess/3rdparty/boost-1.53.0 -I../3rdparty/libprocess/3rdparty/picojson-1.3.0 -DPICOJSON_USE_INT64 -D__STDC_FORMAT_MACROS -I../3rdparty/libprocess/3rdparty/protobuf-2.5.0/src -I../3rdparty/libprocess/3rdparty/glog-0.3.3/src -I../3rdparty/libprocess/3rdparty/glog-0.3.3/src -I../3rdparty/leveldb-1.4/include -I../3rdparty/zookeeper-3.4.5/src/c/include -I../3rdparty/zookeeper-3.4.5/src/c/generated -I../3rdparty/libprocess/3rdparty/protobuf-2.5.0/src -DSOURCE_DIR=\"<https://builds.apache.org/job/mesos-reviewbot/ws/mesos-0.29.0/_build/..\"> -DBUILD_DIR=\"<https://builds.apache.org/job/mesos-reviewbot/ws/mesos-0.29.0/_build\"> -I../3rdparty/libprocess/3rdparty/gmock-1.7.0/gtest/include -I../3rdparty/libprocess/3rdparty/gmock-1.7.0/include -DTESTLIBEXECDIR=\"<https://builds.apache.org/job/mesos-reviewbot/ws/mesos-0.29.0/_inst/libexec/mesos/tests\"> -DSBINDIR=\"<https://builds.apache.org/job/mesos-reviewbot/ws/mesos-0.29.0/_inst/sbin\"> -I/home/jenkins/tools/java/jdk1.6.0_20-64/include -I/home/jenkins/tools/java/jdk1.6.0_20-64/include/linux -DZOOKEEPER_VERSION=\"3.4.5\" -I/usr/include/subversion-1 -I/usr/include/apr-1 -I/usr/include/apr-1.0  -pthread -g1 -O0 -Wno-unused-local-typedefs -std=c++11 -MT tests/mesos_tests-persistent_volume_tests.o -MD -MP -MF tests/.deps/mesos_tests-persistent_volume_tests.Tpo -c -o tests/mesos_tests-persistent_volume_tests.o `test -f 'tests/persistent_volume_tests.cpp' || echo '../../src/'`tests/persistent_volume_tests.cpp
mv -f tests/.deps/mesos_tests-module.Tpo tests/.deps/mesos_tests-module.Po
g++ -DPACKAGE_NAME=\"mesos\" -DPACKAGE_TARNAME=\"mesos\" -DPACKAGE_VERSION=\"0.29.0\" -DPACKAGE_STRING=\"mesos\ 0.29.0\" -DPACKAGE_BUGREPORT=\"\" -DPACKAGE_URL=\"\" -DPACKAGE=\"mesos\" -DVERSION=\"0.29.0\" -DSTDC_HEADERS=1 -DHAVE_SYS_TYPES_H=1 -DHAVE_SYS_STAT_H=1 -DHAVE_STDLIB_H=1 -DHAVE_STRING_H=1 -DHAVE_MEMORY_H=1 -DHAVE_STRINGS_H=1 -DHAVE_INTTYPES_H=1 -DHAVE_STDINT_H=1 -DHAVE_UNISTD_H=1 -DHAVE_DLFCN_H=1 -DLT_OBJDIR=\".libs/\" -DHAVE_CXX11=1 -DHAVE_PTHREAD_PRIO_INHERIT=1 -DHAVE_PTHREAD=1 -DHAVE_LIBZ=1 -DHAVE_LIBCURL=1 -DHAVE_APR_POOLS_H=1 -DHAVE_LIBAPR_1=1 -DHAVE_SVN_VERSION_H=1 -DHAVE_LIBSVN_SUBR_1=1 -DHAVE_SVN_DELTA_H=1 -DHAVE_LIBSVN_DELTA_1=1 -DHAVE_LIBSASL2=1 -DMESOS_HAS_JAVA=1 -DHAVE_PYTHON=\"2.7\" -DMESOS_HAS_PYTHON=1 -I. -I../../src   -Wall -Werror -DLIBDIR=\"<https://builds.apache.org/job/mesos-reviewbot/ws/mesos-0.29.0/_inst/lib\"> -DPKGLIBEXECDIR=\"<https://builds.apache.org/job/mesos-reviewbot/ws/mesos-0.29.0/_inst/libexec/mesos\"> -DPKGDATADIR=\"<https://builds.apache.org/job/mesos-reviewbot/ws/mesos-0.29.0/_inst/share/mesos\"> -DPKGMODULEDIR=\"<https://builds.apache.org/job/mesos-reviewbot/ws/mesos-0.29.0/_inst/lib/mesos/modules\"> -I../../include -I../../3rdparty/libprocess/include -I../../3rdparty/libprocess/3rdparty/stout/include -I../include -I../include/mesos -isystem ../3rdparty/libprocess/3rdparty/boost-1.53.0 -I../3rdparty/libprocess/3rdparty/picojson-1.3.0 -DPICOJSON_USE_INT64 -D__STDC_FORMAT_MACROS -I../3rdparty/libprocess/3rdparty/protobuf-2.5.0/src -I../3rdparty/libprocess/3rdparty/glog-0.3.3/src -I../3rdparty/libprocess/3rdparty/glog-0.3.3/src -I../3rdparty/leveldb-1.4/include -I../3rdparty/zookeeper-3.4.5/src/c/include -I../3rdparty/zookeeper-3.4.5/src/c/generated -I../3rdparty/libprocess/3rdparty/protobuf-2.5.0/src -DSOURCE_DIR=\"<https://builds.apache.org/job/mesos-reviewbot/ws/mesos-0.29.0/_build/..\"> -DBUILD_DIR=\"<https://builds.apache.org/job/mesos-reviewbot/ws/mesos-0.29.0/_build\"> -I../3rdparty/libprocess/3rdparty/gmock-1.7.0/gtest/include -I../3rdparty/libprocess/3rdparty/gmock-1.7.0/include -DTESTLIBEXECDIR=\"<https://builds.apache.org/job/mesos-reviewbot/ws/mesos-0.29.0/_inst/libexec/mesos/tests\"> -DSBINDIR=\"<https://builds.apache.org/job/mesos-reviewbot/ws/mesos-0.29.0/_inst/sbin\"> -I/home/jenkins/tools/java/jdk1.6.0_20-64/include -I/home/jenkins/tools/java/jdk1.6.0_20-64/include/linux -DZOOKEEPER_VERSION=\"3.4.5\" -I/usr/include/subversion-1 -I/usr/include/apr-1 -I/usr/include/apr-1.0  -pthread -g1 -O0 -Wno-unused-local-typedefs -std=c++11 -MT tests/mesos_tests-protobuf_io_tests.o -MD -MP -MF tests/.deps/mesos_tests-protobuf_io_tests.Tpo -c -o tests/mesos_tests-protobuf_io_tests.o `test -f 'tests/protobuf_io_tests.cpp' || echo '../../src/'`tests/protobuf_io_tests.cpp
mv -f tests/.deps/mesos_tests-module_tests.Tpo tests/.deps/mesos_tests-module_tests.Po
g++ -DPACKAGE_NAME=\"mesos\" -DPACKAGE_TARNAME=\"mesos\" -DPACKAGE_VERSION=\"0.29.0\" -DPACKAGE_STRING=\"mesos\ 0.29.0\" -DPACKAGE_BUGREPORT=\"\" -DPACKAGE_URL=\"\" -DPACKAGE=\"mesos\" -DVERSION=\"0.29.0\" -DSTDC_HEADERS=1 -DHAVE_SYS_TYPES_H=1 -DHAVE_SYS_STAT_H=1 -DHAVE_STDLIB_H=1 -DHAVE_STRING_H=1 -DHAVE_MEMORY_H=1 -DHAVE_STRINGS_H=1 -DHAVE_INTTYPES_H=1 -DHAVE_STDINT_H=1 -DHAVE_UNISTD_H=1 -DHAVE_DLFCN_H=1 -DLT_OBJDIR=\".libs/\" -DHAVE_CXX11=1 -DHAVE_PTHREAD_PRIO_INHERIT=1 -DHAVE_PTHREAD=1 -DHAVE_LIBZ=1 -DHAVE_LIBCURL=1 -DHAVE_APR_POOLS_H=1 -DHAVE_LIBAPR_1=1 -DHAVE_SVN_VERSION_H=1 -DHAVE_LIBSVN_SUBR_1=1 -DHAVE_SVN_DELTA_H=1 -DHAVE_LIBSVN_DELTA_1=1 -DHAVE_LIBSASL2=1 -DMESOS_HAS_JAVA=1 -DHAVE_PYTHON=\"2.7\" -DMESOS_HAS_PYTHON=1 -I. -I../../src   -Wall -Werror -DLIBDIR=\"<https://builds.apache.org/job/mesos-reviewbot/ws/mesos-0.29.0/_inst/lib\"> -DPKGLIBEXECDIR=\"<https://builds.apache.org/job/mesos-reviewbot/ws/mesos-0.29.0/_inst/libexec/mesos\"> -DPKGDATADIR=\"<https://builds.apache.org/job/mesos-reviewbot/ws/mesos-0.29.0/_inst/share/mesos\"> -DPKGMODULEDIR=\"<https://builds.apache.org/job/mesos-reviewbot/ws/mesos-0.29.0/_inst/lib/mesos/modules\"> -I../../include -I../../3rdparty/libprocess/include -I../../3rdparty/libprocess/3rdparty/stout/include -I../include -I../include/mesos -isystem ../3rdparty/libprocess/3rdparty/boost-1.53.0 -I../3rdparty/libprocess/3rdparty/picojson-1.3.0 -DPICOJSON_USE_INT64 -D__STDC_FORMAT_MACROS -I../3rdparty/libprocess/3rdparty/protobuf-2.5.0/src -I../3rdparty/libprocess/3rdparty/glog-0.3.3/src -I../3rdparty/libprocess/3rdparty/glog-0.3.3/src -I../3rdparty/leveldb-1.4/include -I../3rdparty/zookeeper-3.4.5/src/c/include -I../3rdparty/zookeeper-3.4.5/src/c/generated -I../3rdparty/libprocess/3rdparty/protobuf-2.5.0/src -DSOURCE_DIR=\"<https://builds.apache.org/job/mesos-reviewbot/ws/mesos-0.29.0/_build/..\"> -DBUILD_DIR=\"<https://builds.apache.org/job/mesos-reviewbot/ws/mesos-0.29.0/_build\"> -I../3rdparty/libprocess/3rdparty/gmock-1.7.0/gtest/include -I../3rdparty/libprocess/3rdparty/gmock-1.7.0/include -DTESTLIBEXECDIR=\"<https://builds.apache.org/job/mesos-reviewbot/ws/mesos-0.29.0/_inst/libexec/mesos/tests\"> -DSBINDIR=\"<https://builds.apache.org/job/mesos-reviewbot/ws/mesos-0.29.0/_inst/sbin\"> -I/home/jenkins/tools/java/jdk1.6.0_20-64/include -I/home/jenkins/tools/java/jdk1.6.0_20-64/include/linux -DZOOKEEPER_VERSION=\"3.4.5\" -I/usr/include/subversion-1 -I/usr/include/apr-1 -I/usr/include/apr-1.0  -pthread -g1 -O0 -Wno-unused-local-typedefs -std=c++11 -MT tests/mesos_tests-rate_limiting_tests.o -MD -MP -MF tests/.deps/mesos_tests-rate_limiting_tests.Tpo -c -o tests/mesos_tests-rate_limiting_tests.o `test -f 'tests/rate_limiting_tests.cpp' || echo '../../src/'`tests/rate_limiting_tests.cpp
mv -f tests/.deps/mesos_tests-mesos.Tpo tests/.deps/mesos_tests-mesos.Po
g++ -DPACKAGE_NAME=\"mesos\" -DPACKAGE_TARNAME=\"mesos\" -DPACKAGE_VERSION=\"0.29.0\" -DPACKAGE_STRING=\"mesos\ 0.29.0\" -DPACKAGE_BUGREPORT=\"\" -DPACKAGE_URL=\"\" -DPACKAGE=\"mesos\" -DVERSION=\"0.29.0\" -DSTDC_HEADERS=1 -DHAVE_SYS_TYPES_H=1 -DHAVE_SYS_STAT_H=1 -DHAVE_STDLIB_H=1 -DHAVE_STRING_H=1 -DHAVE_MEMORY_H=1 -DHAVE_STRINGS_H=1 -DHAVE_INTTYPES_H=1 -DHAVE_STDINT_H=1 -DHAVE_UNISTD_H=1 -DHAVE_DLFCN_H=1 -DLT_OBJDIR=\".libs/\" -DHAVE_CXX11=1 -DHAVE_PTHREAD_PRIO_INHERIT=1 -DHAVE_PTHREAD=1 -DHAVE_LIBZ=1 -DHAVE_LIBCURL=1 -DHAVE_APR_POOLS_H=1 -DHAVE_LIBAPR_1=1 -DHAVE_SVN_VERSION_H=1 -DHAVE_LIBSVN_SUBR_1=1 -DHAVE_SVN_DELTA_H=1 -DHAVE_LIBSVN_DELTA_1=1 -DHAVE_LIBSASL2=1 -DMESOS_HAS_JAVA=1 -DHAVE_PYTHON=\"2.7\" -DMESOS_HAS_PYTHON=1 -I. -I../../src   -Wall -Werror -DLIBDIR=\"<https://builds.apache.org/job/mesos-reviewbot/ws/mesos-0.29.0/_inst/lib\"> -DPKGLIBEXECDIR=\"<https://builds.apache.org/job/mesos-reviewbot/ws/mesos-0.29.0/_inst/libexec/mesos\"> -DPKGDATADIR=\"<https://builds.apache.org/job/mesos-reviewbot/ws/mesos-0.29.0/_inst/share/mesos\"> -DPKGMODULEDIR=\"<https://builds.apache.org/job/mesos-reviewbot/ws/mesos-0.29.0/_inst/lib/mesos/modules\"> -I../../include -I../../3rdparty/libprocess/include -I../../3rdparty/libprocess/3rdparty/stout/include -I../include -I../include/mesos -isystem ../3rdparty/libprocess/3rdparty/boost-1.53.0 -I../3rdparty/libprocess/3rdparty/picojson-1.3.0 -DPICOJSON_USE_INT64 -D__STDC_FORMAT_MACROS -I../3rdparty/libprocess/3rdparty/protobuf-2.5.0/src -I../3rdparty/libprocess/3rdparty/glog-0.3.3/src -I../3rdparty/libprocess/3rdparty/glog-0.3.3/src -I../3rdparty/leveldb-1.4/include -I../3rdparty/zookeeper-3.4.5/src/c/include -I../3rdparty/zookeeper-3.4.5/src/c/generated -I../3rdparty/libprocess/3rdparty/protobuf-2.5.0/src -DSOURCE_DIR=\"<https://builds.apache.org/job/mesos-reviewbot/ws/mesos-0.29.0/_build/..\"> -DBUILD_DIR=\"<https://builds.apache.org/job/mesos-reviewbot/ws/mesos-0.29.0/_build\"> -I../3rdparty/libprocess/3rdparty/gmock-1.7.0/gtest/include -I../3rdparty/libprocess/3rdparty/gmock-1.7.0/include -DTESTLIBEXECDIR=\"<https://builds.apache.org/job/mesos-reviewbot/ws/mesos-0.29.0/_inst/libexec/mesos/tests\"> -DSBINDIR=\"<https://builds.apache.org/job/mesos-reviewbot/ws/mesos-0.29.0/_inst/sbin\"> -I/home/jenkins/tools/java/jdk1.6.0_20-64/include -I/home/jenkins/tools/java/jdk1.6.0_20-64/include/linux -DZOOKEEPER_VERSION=\"3.4.5\" -I/usr/include/subversion-1 -I/usr/include/apr-1 -I/usr/include/apr-1.0  -pthread -g1 -O0 -Wno-unused-local-typedefs -std=c++11 -MT tests/mesos_tests-reconciliation_tests.o -MD -MP -MF tests/.deps/mesos_tests-reconciliation_tests.Tpo -c -o tests/mesos_tests-reconciliation_tests.o `test -f 'tests/reconciliation_tests.cpp' || echo '../../src/'`tests/reconciliation_tests.cpp
mv -f tests/.deps/mesos_tests-protobuf_io_tests.Tpo tests/.deps/mesos_tests-protobuf_io_tests.Po
g++ -DPACKAGE_NAME=\"mesos\" -DPACKAGE_TARNAME=\"mesos\" -DPACKAGE_VERSION=\"0.29.0\" -DPACKAGE_STRING=\"mesos\ 0.29.0\" -DPACKAGE_BUGREPORT=\"\" -DPACKAGE_URL=\"\" -DPACKAGE=\"mesos\" -DVERSION=\"0.29.0\" -DSTDC_HEADERS=1 -DHAVE_SYS_TYPES_H=1 -DHAVE_SYS_STAT_H=1 -DHAVE_STDLIB_H=1 -DHAVE_STRING_H=1 -DHAVE_MEMORY_H=1 -DHAVE_STRINGS_H=1 -DHAVE_INTTYPES_H=1 -DHAVE_STDINT_H=1 -DHAVE_UNISTD_H=1 -DHAVE_DLFCN_H=1 -DLT_OBJDIR=\".libs/\" -DHAVE_CXX11=1 -DHAVE_PTHREAD_PRIO_INHERIT=1 -DHAVE_PTHREAD=1 -DHAVE_LIBZ=1 -DHAVE_LIBCURL=1 -DHAVE_APR_POOLS_H=1 -DHAVE_LIBAPR_1=1 -DHAVE_SVN_VERSION_H=1 -DHAVE_LIBSVN_SUBR_1=1 -DHAVE_SVN_DELTA_H=1 -DHAVE_LIBSVN_DELTA_1=1 -DHAVE_LIBSASL2=1 -DMESOS_HAS_JAVA=1 -DHAVE_PYTHON=\"2.7\" -DMESOS_HAS_PYTHON=1 -I. -I../../src   -Wall -Werror -DLIBDIR=\"<https://builds.apache.org/job/mesos-reviewbot/ws/mesos-0.29.0/_inst/lib\"> -DPKGLIBEXECDIR=\"<https://builds.apache.org/job/mesos-reviewbot/ws/mesos-0.29.0/_inst/libexec/mesos\"> -DPKGDATADIR=\"<https://builds.apache.org/job/mesos-reviewbot/ws/mesos-0.29.0/_inst/share/mesos\"> -DPKGMODULEDIR=\"<https://builds.apache.org/job/mesos-reviewbot/ws/mesos-0.29.0/_inst/lib/mesos/modules\"> -I../../include -I../../3rdparty/libprocess/include -I../../3rdparty/libprocess/3rdparty/stout/include -I../include -I../include/mesos -isystem ../3rdparty/libprocess/3rdparty/boost-1.53.0 -I../3rdparty/libprocess/3rdparty/picojson-1.3.0 -DPICOJSON_USE_INT64 -D__STDC_FORMAT_MACROS -I../3rdparty/libprocess/3rdparty/protobuf-2.5.0/src -I../3rdparty/libprocess/3rdparty/glog-0.3.3/src -I../3rdparty/libprocess/3rdparty/glog-0.3.3/src -I../3rdparty/leveldb-1.4/include -I../3rdparty/zookeeper-3.4.5/src/c/include -I../3rdparty/zookeeper-3.4.5/src/c/generated -I../3rdparty/libprocess/3rdparty/protobuf-2.5.0/src -DSOURCE_DIR=\"<https://builds.apache.org/job/mesos-reviewbot/ws/mesos-0.29.0/_build/..\"> -DBUILD_DIR=\"<https://builds.apache.org/job/mesos-reviewbot/ws/mesos-0.29.0/_build\"> -I../3rdparty/libprocess/3rdparty/gmock-1.7.0/gtest/include -I../3rdparty/libprocess/3rdparty/gmock-1.7.0/include -DTESTLIBEXECDIR=\"<https://builds.apache.org/job/mesos-reviewbot/ws/mesos-0.29.0/_inst/libexec/mesos/tests\"> -DSBINDIR=\"<https://builds.apache.org/job/mesos-reviewbot/ws/mesos-0.29.0/_inst/sbin\"> -I/home/jenkins/tools/java/jdk1.6.0_20-64/include -I/home/jenkins/tools/java/jdk1.6.0_20-64/include/linux -DZOOKEEPER_VERSION=\"3.4.5\" -I/usr/include/subversion-1 -I/usr/include/apr-1 -I/usr/include/apr-1.0  -pthread -g1 -O0 -Wno-unused-local-typedefs -std=c++11 -MT tests/mesos_tests-registrar_tests.o -MD -MP -MF tests/.deps/mesos_tests-registrar_tests.Tpo -c -o tests/mesos_tests-registrar_tests.o `test -f 'tests/registrar_tests.cpp' || echo '../../src/'`tests/registrar_tests.cpp
mv -f tests/.deps/mesos_tests-master_tests.Tpo tests/.deps/mesos_tests-master_tests.Po
g++ -DPACKAGE_NAME=\"mesos\" -DPACKAGE_TARNAME=\"mesos\" -DPACKAGE_VERSION=\"0.29.0\" -DPACKAGE_STRING=\"mesos\ 0.29.0\" -DPACKAGE_BUGREPORT=\"\" -DPACKAGE_URL=\"\" -DPACKAGE=\"mesos\" -DVERSION=\"0.29.0\" -DSTDC_HEADERS=1 -DHAVE_SYS_TYPES_H=1 -DHAVE_SYS_STAT_H=1 -DHAVE_STDLIB_H=1 -DHAVE_STRING_H=1 -DHAVE_MEMORY_H=1 -DHAVE_STRINGS_H=1 -DHAVE_INTTYPES_H=1 -DHAVE_STDINT_H=1 -DHAVE_UNISTD_H=1 -DHAVE_DLFCN_H=1 -DLT_OBJDIR=\".libs/\" -DHAVE_CXX11=1 -DHAVE_PTHREAD_PRIO_INHERIT=1 -DHAVE_PTHREAD=1 -DHAVE_LIBZ=1 -DHAVE_LIBCURL=1 -DHAVE_APR_POOLS_H=1 -DHAVE_LIBAPR_1=1 -DHAVE_SVN_VERSION_H=1 -DHAVE_LIBSVN_SUBR_1=1 -DHAVE_SVN_DELTA_H=1 -DHAVE_LIBSVN_DELTA_1=1 -DHAVE_LIBSASL2=1 -DMESOS_HAS_JAVA=1 -DHAVE_PYTHON=\"2.7\" -DMESOS_HAS_PYTHON=1 -I. -I../../src   -Wall -Werror -DLIBDIR=\"<https://builds.apache.org/job/mesos-reviewbot/ws/mesos-0.29.0/_inst/lib\"> -DPKGLIBEXECDIR=\"<https://builds.apache.org/job/mesos-reviewbot/ws/mesos-0.29.0/_inst/libexec/mesos\"> -DPKGDATADIR=\"<https://builds.apache.org/job/mesos-reviewbot/ws/mesos-0.29.0/_inst/share/mesos\"> -DPKGMODULEDIR=\"<https://builds.apache.org/job/mesos-reviewbot/ws/mesos-0.29.0/_inst/lib/mesos/modules\"> -I../../include -I../../3rdparty/libprocess/include -I../../3rdparty/libprocess/3rdparty/stout/include -I../include -I../include/mesos -isystem ../3rdparty/libprocess/3rdparty/boost-1.53.0 -I../3rdparty/libprocess/3rdparty/picojson-1.3.0 -DPICOJSON_USE_INT64 -D__STDC_FORMAT_MACROS -I../3rdparty/libprocess/3rdparty/protobuf-2.5.0/src -I../3rdparty/libprocess/3rdparty/glog-0.3.3/src -I../3rdparty/libprocess/3rdparty/glog-0.3.3/src -I../3rdparty/leveldb-1.4/include -I../3rdparty/zookeeper-3.4.5/src/c/include -I../3rdparty/zookeeper-3.4.5/src/c/generated -I../3rdparty/libprocess/3rdparty/protobuf-2.5.0/src -DSOURCE_DIR=\"<https://builds.apache.org/job/mesos-reviewbot/ws/mesos-0.29.0/_build/..\"> -DBUILD_DIR=\"<https://builds.apache.org/job/mesos-reviewbot/ws/mesos-0.29.0/_build\"> -I../3rdparty/libprocess/3rdparty/gmock-1.7.0/gtest/include -I../3rdparty/libprocess/3rdparty/gmock-1.7.0/include -DTESTLIBEXECDIR=\"<https://builds.apache.org/job/mesos-reviewbot/ws/mesos-0.29.0/_inst/libexec/mesos/tests\"> -DSBINDIR=\"<https://builds.apache.org/job/mesos-reviewbot/ws/mesos-0.29.0/_inst/sbin\"> -I/home/jenkins/tools/java/jdk1.6.0_20-64/include -I/home/jenkins/tools/java/jdk1.6.0_20-64/include/linux -DZOOKEEPER_VERSION=\"3.4.5\" -I/usr/include/subversion-1 -I/usr/include/apr-1 -I/usr/include/apr-1.0  -pthread -g1 -O0 -Wno-unused-local-typedefs -std=c++11 -MT tests/mesos_tests-repair_tests.o -MD -MP -MF tests/.deps/mesos_tests-repair_tests.Tpo -c -o tests/mesos_tests-repair_tests.o `test -f 'tests/repair_tests.cpp' || echo '../../src/'`tests/repair_tests.cpp
../../src/tests/persistent_volume_tests.cpp: In member function 'virtual void mesos::internal::tests::PersistentVolumeTest_CreateAndDestroyPersistentVolumes_Test::TestBody()':
../../src/tests/persistent_volume_tests.cpp:391:31: error: 'list' is not a member of 'mesos::internal::fs'
     Try<list<string>> files = fs::list(path::join(volume1Path, "*"));
                               ^
../../src/tests/persistent_volume_tests.cpp:391:31: note: suggested alternatives:
In file included from /usr/include/c++/4.8/list:63:0,
                 from ../../src/tests/persistent_volume_tests.cpp:17:
/usr/include/c++/4.8/bits/stl_list.h:438:11: note:   'std::list'
     class list : protected _List_base<_Tp, _Alloc>
           ^
/usr/include/c++/4.8/bits/stl_list.h:438:11: note:   'std::list'
/usr/include/c++/4.8/bits/stl_list.h:438:11: note:   'std::list'
In file included from ../3rdparty/libprocess/3rdparty/boost-1.53.0/boost/mpl/aux_/include_preprocessed.hpp:37:0,
                 from ../3rdparty/libprocess/3rdparty/boost-1.53.0/boost/mpl/list.hpp:46,
                 from ../3rdparty/libprocess/3rdparty/boost-1.53.0/boost/math/policies/policy.hpp:9,
                 from ../3rdparty/libprocess/3rdparty/boost-1.53.0/boost/math/special_functions/math_fwd.hpp:28,
                 from ../3rdparty/libprocess/3rdparty/boost-1.53.0/boost/math/special_functions/sign.hpp:17,
                 from ../3rdparty/libprocess/3rdparty/boost-1.53.0/boost/lexical_cast.hpp:167,
                 from ../../3rdparty/libprocess/3rdparty/stout/include/stout/numify.hpp:19,
                 from ../../3rdparty/libprocess/3rdparty/stout/include/stout/bytes.hpp:24,
                 from ../../include/mesos/resources.hpp:32,
                 from ../../src/tests/persistent_volume_tests.cpp:24:
../3rdparty/libprocess/3rdparty/boost-1.53.0/boost/mpl/aux_/preprocessed/gcc/list.hpp:22:8: note:   'boost::mpl::list'
 struct list;
        ^
In file included from ../3rdparty/libprocess/3rdparty/boost-1.53.0/boost/lexical_cast.hpp:170:0,
                 from ../../3rdparty/libprocess/3rdparty/stout/include/stout/numify.hpp:19,
                 from ../../3rdparty/libprocess/3rdparty/stout/include/stout/bytes.hpp:24,
                 from ../../include/mesos/resources.hpp:32,
                 from ../../src/tests/persistent_volume_tests.cpp:24:
../3rdparty/libprocess/3rdparty/boost-1.53.0/boost/container/container_fwd.hpp:68:7: note:   'boost::container::list'
 class list;
       ^
In file included from ../../3rdparty/libprocess/3rdparty/stout/include/stout/fs.hpp:21:0,
                 from ../../src/tests/persistent_volume_tests.cpp:33:
../../3rdparty/libprocess/3rdparty/stout/include/stout/posix/fs.hpp:75:36: note:   'fs::list'
 inline Try<std::list<std::string>> list(const std::string& pattern)
                                    ^
../../src/tests/persistent_volume_tests.cpp: In member function 'virtual void mesos::internal::tests::PersistentVolumeTest_AccessPersistentVolume_Test::TestBody()':
../../src/tests/persistent_volume_tests.cpp:853:31: error: 'list' is not a member of 'mesos::internal::fs'
     Try<list<string>> files = fs::list(path::join(volumePath, "*"));
                               ^
../../src/tests/persistent_volume_tests.cpp:853:31: note: suggested alternatives:
In file included from /usr/include/c++/4.8/list:63:0,
                 from ../../src/tests/persistent_volume_tests.cpp:17:
/usr/include/c++/4.8/bits/stl_list.h:438:11: note:   'std::list'
     class list : protected _List_base<_Tp, _Alloc>
           ^
/usr/include/c++/4.8/bits/stl_list.h:438:11: note:   'std::list'
/usr/include/c++/4.8/bits/stl_list.h:438:11: note:   'std::list'
In file included from ../3rdparty/libprocess/3rdparty/boost-1.53.0/boost/mpl/aux_/include_preprocessed.hpp:37:0,
                 from ../3rdparty/libprocess/3rdparty/boost-1.53.0/boost/mpl/list.hpp:46,
                 from ../3rdparty/libprocess/3rdparty/boost-1.53.0/boost/math/policies/policy.hpp:9,
                 from ../3rdparty/libprocess/3rdparty/boost-1.53.0/boost/math/special_functions/math_fwd.hpp:28,
                 from ../3rdparty/libprocess/3rdparty/boost-1.53.0/boost/math/special_functions/sign.hpp:17,
                 from ../3rdparty/libprocess/3rdparty/boost-1.53.0/boost/lexical_cast.hpp:167,
                 from ../../3rdparty/libprocess/3rdparty/stout/include/stout/numify.hpp:19,
                 from ../../3rdparty/libprocess/3rdparty/stout/include/stout/bytes.hpp:24,
                 from ../../include/mesos/resources.hpp:32,
                 from ../../src/tests/persistent_volume_tests.cpp:24:
../3rdparty/libprocess/3rdparty/boost-1.53.0/boost/mpl/aux_/preprocessed/gcc/list.hpp:22:8: note:   'boost::mpl::list'
 struct list;
        ^
In file included from ../3rdparty/libprocess/3rdparty/boost-1.53.0/boost/lexical_cast.hpp:170:0,
                 from ../../3rdparty/libprocess/3rdparty/stout/include/stout/numify.hpp:19,
                 from ../../3rdparty/libprocess/3rdparty/stout/include/stout/bytes.hpp:24,
                 from ../../include/mesos/resources.hpp:32,
                 from ../../src/tests/persistent_volume_tests.cpp:24:
../3rdparty/libprocess/3rdparty/boost-1.53.0/boost/container/container_fwd.hpp:68:7: note:   'boost::container::list'
 class list;
       ^
In file included from ../../3rdparty/libprocess/3rdparty/stout/include/stout/fs.hpp:21:0,
                 from ../../src/tests/persistent_volume_tests.cpp:33:
../../3rdparty/libprocess/3rdparty/stout/include/stout/posix/fs.hpp:75:36: note:   'fs::list'
 inline Try<std::list<std::string>> list(const std::string& pattern)
                                    ^
mv -f tests/.deps/mesos_tests-paths_tests.Tpo tests/.deps/mesos_tests-paths_tests.Po
g++ -DPACKAGE_NAME=\"mesos\" -DPACKAGE_TARNAME=\"mesos\" -DPACKAGE_VERSION=\"0.29.0\" -DPACKAGE_STRING=\"mesos\ 0.29.0\" -DPACKAGE_BUGREPORT=\"\" -DPACKAGE_URL=\"\" -DPACKAGE=\"mesos\" -DVERSION=\"0.29.0\" -DSTDC_HEADERS=1 -DHAVE_SYS_TYPES_H=1 -DHAVE_SYS_STAT_H=1 -DHAVE_STDLIB_H=1 -DHAVE_STRING_H=1 -DHAVE_MEMORY_H=1 -DHAVE_STRINGS_H=1 -DHAVE_INTTYPES_H=1 -DHAVE_STDINT_H=1 -DHAVE_UNISTD_H=1 -DHAVE_DLFCN_H=1 -DLT_OBJDIR=\".libs/\" -DHAVE_CXX11=1 -DHAVE_PTHREAD_PRIO_INHERIT=1 -DHAVE_PTHREAD=1 -DHAVE_LIBZ=1 -DHAVE_LIBCURL=1 -DHAVE_APR_POOLS_H=1 -DHAVE_LIBAPR_1=1 -DHAVE_SVN_VERSION_H=1 -DHAVE_LIBSVN_SUBR_1=1 -DHAVE_SVN_DELTA_H=1 -DHAVE_LIBSVN_DELTA_1=1 -DHAVE_LIBSASL2=1 -DMESOS_HAS_JAVA=1 -DHAVE_PYTHON=\"2.7\" -DMESOS_HAS_PYTHON=1 -I. -I../../src   -Wall -Werror -DLIBDIR=\"<https://builds.apache.org/job/mesos-reviewbot/ws/mesos-0.29.0/_inst/lib\"> -DPKGLIBEXECDIR=\"<https://builds.apache.org/job/mesos-reviewbot/ws/mesos-0.29.0/_inst/libexec/mesos\"> -DPKGDATADIR=\"<https://builds.apache.org/job/mesos-reviewbot/ws/mesos-0.29.0/_inst/share/mesos\"> -DPKGMODULEDIR=\"<https://builds.apache.org/job/mesos-reviewbot/ws/mesos-0.29.0/_inst/lib/mesos/modules\"> -I../../include -I../../3rdparty/libprocess/include -I../../3rdparty/libprocess/3rdparty/stout/include -I../include -I../include/mesos -isystem ../3rdparty/libprocess/3rdparty/boost-1.53.0 -I../3rdparty/libprocess/3rdparty/picojson-1.3.0 -DPICOJSON_USE_INT64 -D__STDC_FORMAT_MACROS -I../3rdparty/libprocess/3rdparty/protobuf-2.5.0/src -I../3rdparty/libprocess/3rdparty/glog-0.3.3/src -I../3rdparty/libprocess/3rdparty/glog-0.3.3/src -I../3rdparty/leveldb-1.4/include -I../3rdparty/zookeeper-3.4.5/src/c/include -I../3rdparty/zookeeper-3.4.5/src/c/generated -I../3rdparty/libprocess/3rdparty/protobuf-2.5.0/src -DSOURCE_DIR=\"<https://builds.apache.org/job/mesos-reviewbot/ws/mesos-0.29.0/_build/..\"> -DBUILD_DIR=\"<https://builds.apache.org/job/mesos-reviewbot/ws/mesos-0.29.0/_build\"> -I../3rdparty/libprocess/3rdparty/gmock-1.7.0/gtest/include -I../3rdparty/libprocess/3rdparty/gmock-1.7.0/include -DTESTLIBEXECDIR=\"<https://builds.apache.org/job/mesos-reviewbot/ws/mesos-0.29.0/_inst/libexec/mesos/tests\"> -DSBINDIR=\"<https://builds.apache.org/job/mesos-reviewbot/ws/mesos-0.29.0/_inst/sbin\"> -I/home/jenkins/tools/java/jdk1.6.0_20-64/include -I/home/jenkins/tools/java/jdk1.6.0_20-64/include/linux -DZOOKEEPER_VERSION=\"3.4.5\" -I/usr/include/subversion-1 -I/usr/include/apr-1 -I/usr/include/apr-1.0  -pthread -g1 -O0 -Wno-unused-local-typedefs -std=c++11 -MT tests/mesos_tests-reservation_endpoints_tests.o -MD -MP -MF tests/.deps/mesos_tests-reservation_endpoints_tests.Tpo -c -o tests/mesos_tests-reservation_endpoints_tests.o `test -f 'tests/reservation_endpoints_tests.cpp' || echo '../../src/'`tests/reservation_endpoints_tests.cpp
mv -f tests/.deps/mesos_tests-monitor_tests.Tpo tests/.deps/mesos_tests-monitor_tests.Po
g++ -DPACKAGE_NAME=\"mesos\" -DPACKAGE_TARNAME=\"mesos\" -DPACKAGE_VERSION=\"0.29.0\" -DPACKAGE_STRING=\"mesos\ 0.29.0\" -DPACKAGE_BUGREPORT=\"\" -DPACKAGE_URL=\"\" -DPACKAGE=\"mesos\" -DVERSION=\"0.29.0\" -DSTDC_HEADERS=1 -DHAVE_SYS_TYPES_H=1 -DHAVE_SYS_STAT_H=1 -DHAVE_STDLIB_H=1 -DHAVE_STRING_H=1 -DHAVE_MEMORY_H=1 -DHAVE_STRINGS_H=1 -DHAVE_INTTYPES_H=1 -DHAVE_STDINT_H=1 -DHAVE_UNISTD_H=1 -DHAVE_DLFCN_H=1 -DLT_OBJDIR=\".libs/\" -DHAVE_CXX11=1 -DHAVE_PTHREAD_PRIO_INHERIT=1 -DHAVE_PTHREAD=1 -DHAVE_LIBZ=1 -DHAVE_LIBCURL=1 -DHAVE_APR_POOLS_H=1 -DHAVE_LIBAPR_1=1 -DHAVE_SVN_VERSION_H=1 -DHAVE_LIBSVN_SUBR_1=1 -DHAVE_SVN_DELTA_H=1 -DHAVE_LIBSVN_DELTA_1=1 -DHAVE_LIBSASL2=1 -DMESOS_HAS_JAVA=1 -DHAVE_PYTHON=\"2.7\" -DMESOS_HAS_PYTHON=1 -I. -I../../src   -Wall -Werror -DLIBDIR=\"<https://builds.apache.org/job/mesos-reviewbot/ws/mesos-0.29.0/_inst/lib\"> -DPKGLIBEXECDIR=\"<https://builds.apache.org/job/mesos-reviewbot/ws/mesos-0.29.0/_inst/libexec/mesos\"> -DPKGDATADIR=\"<https://builds.apache.org/job/mesos-reviewbot/ws/mesos-0.29.0/_inst/share/mesos\"> -DPKGMODULEDIR=\"<https://builds.apache.org/job/mesos-reviewbot/ws/mesos-0.29.0/_inst/lib/mesos/modules\"> -I../../include -I../../3rdparty/libprocess/include -I../../3rdparty/libprocess/3rdparty/stout/include -I../include -I../include/mesos -isystem ../3rdparty/libprocess/3rdparty/boost-1.53.0 -I../3rdparty/libprocess/3rdparty/picojson-1.3.0 -DPICOJSON_USE_INT64 -D__STDC_FORMAT_MACROS -I../3rdparty/libprocess/3rdparty/protobuf-2.5.0/src -I../3rdparty/libprocess/3rdparty/glog-0.3.3/src -I../3rdparty/libprocess/3rdparty/glog-0.3.3/src -I../3rdparty/leveldb-1.4/include -I../3rdparty/zookeeper-3.4.5/src/c/include -I../3rdparty/zookeeper-3.4.5/src/c/generated -I../3rdparty/libprocess/3rdparty/protobuf-2.5.0/src -DSOURCE_DIR=\"<https://builds.apache.org/job/mesos-reviewbot/ws/mesos-0.29.0/_build/..\"> -DBUILD_DIR=\"<https://builds.apache.org/job/mesos-reviewbot/ws/mesos-0.29.0/_build\"> -I../3rdparty/libprocess/3rdparty/gmock-1.7.0/gtest/include -I../3rdparty/libprocess/3rdparty/gmock-1.7.0/include -DTESTLIBEXECDIR=\"<https://builds.apache.org/job/mesos-reviewbot/ws/mesos-0.29.0/_inst/libexec/mesos/tests\"> -DSBINDIR=\"<https://builds.apache.org/job/mesos-reviewbot/ws/mesos-0.29.0/_inst/sbin\"> -I/home/jenkins/tools/java/jdk1.6.0_20-64/include -I/home/jenkins/tools/java/jdk1.6.0_20-64/include/linux -DZOOKEEPER_VERSION=\"3.4.5\" -I/usr/include/subversion-1 -I/usr/include/apr-1 -I/usr/include/apr-1.0  -pthread -g1 -O0 -Wno-unused-local-typedefs -std=c++11 -MT tests/mesos_tests-reservation_tests.o -MD -MP -MF tests/.deps/mesos_tests-reservation_tests.Tpo -c -o tests/mesos_tests-reservation_tests.o `test -f 'tests/reservation_tests.cpp' || echo '../../src/'`tests/reservation_tests.cpp
mv -f tests/.deps/mesos_tests-partition_tests.Tpo tests/.deps/mesos_tests-partition_tests.Po
g++ -DPACKAGE_NAME=\"mesos\" -DPACKAGE_TARNAME=\"mesos\" -DPACKAGE_VERSION=\"0.29.0\" -DPACKAGE_STRING=\"mesos\ 0.29.0\" -DPACKAGE_BUGREPORT=\"\" -DPACKAGE_URL=\"\" -DPACKAGE=\"mesos\" -DVERSION=\"0.29.0\" -DSTDC_HEADERS=1 -DHAVE_SYS_TYPES_H=1 -DHAVE_SYS_STAT_H=1 -DHAVE_STDLIB_H=1 -DHAVE_STRING_H=1 -DHAVE_MEMORY_H=1 -DHAVE_STRINGS_H=1 -DHAVE_INTTYPES_H=1 -DHAVE_STDINT_H=1 -DHAVE_UNISTD_H=1 -DHAVE_DLFCN_H=1 -DLT_OBJDIR=\".libs/\" -DHAVE_CXX11=1 -DHAVE_PTHREAD_PRIO_INHERIT=1 -DHAVE_PTHREAD=1 -DHAVE_LIBZ=1 -DHAVE_LIBCURL=1 -DHAVE_APR_POOLS_H=1 -DHAVE_LIBAPR_1=1 -DHAVE_SVN_VERSION_H=1 -DHAVE_LIBSVN_SUBR_1=1 -DHAVE_SVN_DELTA_H=1 -DHAVE_LIBSVN_DELTA_1=1 -DHAVE_LIBSASL2=1 -DMESOS_HAS_JAVA=1 -DHAVE_PYTHON=\"2.7\" -DMESOS_HAS_PYTHON=1 -I. -I../../src   -Wall -Werror -DLIBDIR=\"<https://builds.apache.org/job/mesos-reviewbot/ws/mesos-0.29.0/_inst/lib\"> -DPKGLIBEXECDIR=\"<https://builds.apache.org/job/mesos-reviewbot/ws/mesos-0.29.0/_inst/libexec/mesos\"> -DPKGDATADIR=\"<https://builds.apache.org/job/mesos-reviewbot/ws/mesos-0.29.0/_inst/share/mesos\"> -DPKGMODULEDIR=\"<https://builds.apache.org/job/mesos-reviewbot/ws/mesos-0.29.0/_inst/lib/mesos/modules\"> -I../../include -I../../3rdparty/libprocess/include -I../../3rdparty/libprocess/3rdparty/stout/include -I../include -I../include/mesos -isystem ../3rdparty/libprocess/3rdparty/boost-1.53.0 -I../3rdparty/libprocess/3rdparty/picojson-1.3.0 -DPICOJSON_USE_INT64 -D__STDC_FORMAT_MACROS -I../3rdparty/libprocess/3rdparty/protobuf-2.5.0/src -I../3rdparty/libprocess/3rdparty/glog-0.3.3/src -I../3rdparty/libprocess/3rdparty/glog-0.3.3/src -I../3rdparty/leveldb-1.4/include -I../3rdparty/zookeeper-3.4.5/src/c/include -I../3rdparty/zookeeper-3.4.5/src/c/generated -I../3rdparty/libprocess/3rdparty/protobuf-2.5.0/src -DSOURCE_DIR=\"<https://builds.apache.org/job/mesos-reviewbot/ws/mesos-0.29.0/_build/..\"> -DBUILD_DIR=\"<https://builds.apache.org/job/mesos-reviewbot/ws/mesos-0.29.0/_build\"> -I../3rdparty/libprocess/3rdparty/gmock-1.7.0/gtest/include -I../3rdparty/libprocess/3rdparty/gmock-1.7.0/include -DTESTLIBEXECDIR=\"<https://builds.apache.org/job/mesos-reviewbot/ws/mesos-0.29.0/_inst/libexec/mesos/tests\"> -DSBINDIR=\"<https://builds.apache.org/job/mesos-reviewbot/ws/mesos-0.29.0/_inst/sbin\"> -I/home/jenkins/tools/java/jdk1.6.0_20-64/include -I/home/jenkins/tools/java/jdk1.6.0_20-64/include/linux -DZOOKEEPER_VERSION=\"3.4.5\" -I/usr/include/subversion-1 -I/usr/include/apr-1 -I/usr/include/apr-1.0  -pthread -g1 -O0 -Wno-unused-local-typedefs -std=c++11 -MT tests/mesos_tests-resource_offers_tests.o -MD -MP -MF tests/.deps/mesos_tests-resource_offers_tests.Tpo -c -o tests/mesos_tests-resource_offers_tests.o `test -f 'tests/resource_offers_tests.cpp' || echo '../../src/'`tests/resource_offers_tests.cpp
make[4]: *** [tests/mesos_tests-persistent_volume_tests.o] Error 1
make[4]: *** Waiting for unfinished jobs....
mv -f tests/.deps/mesos_tests-oversubscription_tests.Tpo tests/.deps/mesos_tests-oversubscription_tests.Po
mv -f tests/.deps/mesos_tests-registrar_tests.Tpo tests/.deps/mesos_tests-registrar_tests.Po
mv -f tests/.deps/mesos_tests-rate_limiting_tests.Tpo tests/.deps/mesos_tests-rate_limiting_tests.Po
mv -f tests/.deps/mesos_tests-persistent_volume_endpoints_tests.Tpo tests/.deps/mesos_tests-persistent_volume_endpoints_tests.Po
mv -f tests/.deps/mesos_tests-repair_tests.Tpo tests/.deps/mesos_tests-repair_tests.Po
mv -f tests/.deps/mesos_tests-reconciliation_tests.Tpo tests/.deps/mesos_tests-reconciliation_tests.Po
mv -f tests/.deps/mesos_tests-reservation_endpoints_tests.Tpo tests/.deps/mesos_tests-reservation_endpoints_tests.Po
mv -f tests/.deps/mesos_tests-resource_offers_tests.Tpo tests/.deps/mesos_tests-resource_offers_tests.Po
mv -f tests/.deps/mesos_tests-reservation_tests.Tpo tests/.deps/mesos_tests-reservation_tests.Po
make[4]: Leaving directory `<https://builds.apache.org/job/mesos-reviewbot/ws/mesos-0.29.0/_build/src'>
make[3]: *** [check-am] Error 2
make[3]: Leaving directory `<https://builds.apache.org/job/mesos-reviewbot/ws/mesos-0.29.0/_build/src'>
make[2]: *** [check] Error 2
make[2]: Leaving directory `<https://builds.apache.org/job/mesos-reviewbot/ws/mesos-0.29.0/_build/src'>
make[1]: *** [check-recursive] Error 1
make[1]: Leaving directory `<https://builds.apache.org/job/mesos-reviewbot/ws/mesos-0.29.0/_build'>
make: *** [distcheck] Error 1
Build step 'Execute shell' marked build as failure

Mime
View raw message