mesos-builds mailing list archives

Site index · List index
Message view « Date » · « Thread »
Top « Date » · « Thread »
From Apache Jenkins Server <jenk...@builds.apache.org>
Subject Build failed in Jenkins: Mesos » gcc,--verbose,GLOG_v=1 MESOS_VERBOSE=1,centos:7,(docker||Hadoop)&&(!ubuntu-us1) #1831
Date Fri, 18 Mar 2016 03:15:31 GMT
See <https://builds.apache.org/job/Mesos/COMPILER=gcc,CONFIGURATION=--verbose,ENVIRONMENT=GLOG_v=1%20MESOS_VERBOSE=1,OS=centos%3A7,label_exp=(docker%7C%7CHadoop)&&(!ubuntu-us1)/1831/changes>

Changes:

[joris.van.remoortere] Fixed how we detect C++11 compiler support in libprocess.

[joris.van.remoortere] Fixed how we detect C++11 compiler support.

[joris.van.remoortere] Fixed m4 macro to enable strict C++11 conformance.

[joris.van.remoortere] Fixed m4 macro to enable strict C++11 conformance in libprocess.

------------------------------------------
[...truncated 16394 lines...]
creating build/lib/mesos/native
copying src/mesos/native/__init__.py -> build/lib/mesos/native
creating build
creating build/lib
creating build/lib/mesos
copying src/mesos/futures.py -> build/lib/mesos
creating build/bdist.linux-x86_64
creating build/bdist.linux-x86_64/egg
reading manifest file 'src/mesos.scheduler.egg-info/SOURCES.txt'
creating build/bdist.linux-x86_64/egg/mesos
reading manifest file 'src/mesos.executor.egg-info/SOURCES.txt'
creating build/bdist.linux-x86_64/egg/mesos/native
copying build/lib/mesos/native/__init__.py -> build/bdist.linux-x86_64/egg/mesos/native
copying build/lib/mesos/__init__.py -> build/bdist.linux-x86_64/egg/mesos
creating build/bdist.linux-x86_64/egg/EGG-INFO
copying src/mesos.egg-info/PKG-INFO -> build/bdist.linux-x86_64/egg/EGG-INFO
byte-compiling build/bdist.linux-x86_64/egg/mesos/native/__init__.py to __init__.pyc
copying src/mesos.egg-info/SOURCES.txt -> build/bdist.linux-x86_64/egg/EGG-INFO
copying src/mesos.egg-info/dependency_links.txt -> build/bdist.linux-x86_64/egg/EGG-INFO
copying src/mesos.egg-info/requires.txt -> build/bdist.linux-x86_64/egg/EGG-INFO
writing manifest file 'src/mesos.scheduler.egg-info/SOURCES.txt'
copying src/mesos.egg-info/top_level.txt -> build/bdist.linux-x86_64/egg/EGG-INFO
installing library code to build/bdist.linux-x86_64/egg
zip_safe flag not set; analyzing archive contents...
mesos.__init__: module references __path__
writing manifest file 'src/mesos.executor.egg-info/SOURCES.txt'
copying src/mesos/interface/mesos_pb2.py -> build/lib/mesos/interface
running install_lib
creating /mesos/mesos-0.29.0/_build/src/python/dist
running build_py
creating '/mesos/mesos-0.29.0/_build/src/python/dist/mesos-0.29.0-py2.7.egg' and adding 'build/bdist.linux-x86_64/egg'
to it
installing library code to build/bdist.linux-x86_64/egg
creating build
creating build/lib.linux-x86_64-2.7
creating build/lib.linux-x86_64-2.7/mesos
copying src/mesos/__init__.py -> build/lib.linux-x86_64-2.7/mesos
running install_lib
running build_py
byte-compiling build/bdist.linux-x86_64/egg/mesos/__init__.py to __init__.pyc
creating build/lib.linux-x86_64-2.7/mesos/scheduler
creating build
copying src/mesos/scheduler/__init__.py -> build/lib.linux-x86_64-2.7/mesos/scheduler
creating build/lib.linux-x86_64-2.7
creating build/lib.linux-x86_64-2.7/mesos
copying src/mesos/__init__.py -> build/lib.linux-x86_64-2.7/mesos
copying src/mesos/http.py -> build/lib/mesos
running build_ext
creating build/bdist.linux-x86_64/egg/EGG-INFO
creating build/lib.linux-x86_64-2.7/mesos/executor
copying src/mesos.native.egg-info/PKG-INFO -> build/bdist.linux-x86_64/egg/EGG-INFO
copying src/mesos/executor/__init__.py -> build/lib.linux-x86_64-2.7/mesos/executor
copying src/mesos.native.egg-info/SOURCES.txt -> build/bdist.linux-x86_64/egg/EGG-INFO
copying src/mesos/cli.py -> build/lib/mesos
copying src/mesos.native.egg-info/dependency_links.txt -> build/bdist.linux-x86_64/egg/EGG-INFO
removing 'build/bdist.linux-x86_64/egg' (and everything under it)
copying src/mesos/__init__.py -> build/lib/mesos
running build_ext
copying src/mesos.native.egg-info/namespace_packages.txt -> build/bdist.linux-x86_64/egg/EGG-INFO
copying src/mesos.native.egg-info/requires.txt -> build/bdist.linux-x86_64/egg/EGG-INFO
copying src/mesos.native.egg-info/top_level.txt -> build/bdist.linux-x86_64/egg/EGG-INFO
running bdist_wheel
creating build/bdist.linux-x86_64
building 'mesos.scheduler._scheduler' extension
creating build/bdist.linux-x86_64/egg
creating build/temp.linux-x86_64-2.7
creating build/temp.linux-x86_64-2.7/src
creating build/bdist.linux-x86_64/egg/mesos
creating build/temp.linux-x86_64-2.7/src/mesos
creating build/temp.linux-x86_64-2.7/src/mesos/scheduler
copying build/lib/mesos/futures.py -> build/bdist.linux-x86_64/egg/mesos
gcc -fno-strict-aliasing -O2 -g -pipe -Wall -Wp,-D_FORTIFY_SOURCE=2 -fexceptions -fstack-protector-strong
--param=ssp-buffer-size=4 -grecord-gcc-switches -m64 -mtune=generic -D_GNU_SOURCE -fPIC -fwrapv
-DNDEBUG -O2 -g -pipe -Wall -Wp,-D_FORTIFY_SOURCE=2 -fexceptions -fstack-protector-strong
--param=ssp-buffer-size=4 -grecord-gcc-switches -m64 -mtune=generic -D_GNU_SOURCE -fPIC -fwrapv
-g1 -O0 -Wno-unused-local-typedefs -g1 -O0 -Wno-unused-local-typedefs -I/usr/include/subversion-1
-I/usr/include/apr-1 -I/usr/include/apr-1.0 -fPIC -I/mesos/mesos-0.29.0/_build/../include
-I/mesos/mesos-0.29.0/_build/include -I/mesos/mesos-0.29.0/_build/include/mesos -I/mesos/mesos-0.29.0/_build/src
-I/mesos/mesos-0.29.0/_build/src/python/scheduler/src/mesos/scheduler -I/mesos/mesos-0.29.0/_build/src/python/native_common
-I/mesos/mesos-0.29.0/_build/3rdparty/libprocess/3rdparty/protobuf-2.5.0/src -I/usr/include/python2.7
-c src/mesos/scheduler/mesos_scheduler_driver_impl.cpp -o build/temp.linux-x86_64-2.7/src/mesos/scheduler/mesos_scheduler_driver_impl.o
zip_safe flag not set; analyzing archive contents...
creating '/mesos/mesos-0.29.0/_build/src/python/dist/mesos.native-0.29.0-py2.7.egg' and adding
'build/bdist.linux-x86_64/egg' to it
mesos.__init__: module references __path__
building 'mesos.executor._executor' extension
creating build/temp.linux-x86_64-2.7
copying build/lib/mesos/http.py -> build/bdist.linux-x86_64/egg/mesos
creating build/temp.linux-x86_64-2.7/src
creating build/temp.linux-x86_64-2.7/src/mesos
creating build/temp.linux-x86_64-2.7/src/mesos/executor
copying build/lib/mesos/cli.py -> build/bdist.linux-x86_64/egg/mesos
gcc -fno-strict-aliasing -O2 -g -pipe -Wall -Wp,-D_FORTIFY_SOURCE=2 -fexceptions -fstack-protector-strong
--param=ssp-buffer-size=4 -grecord-gcc-switches -m64 -mtune=generic -D_GNU_SOURCE -fPIC -fwrapv
-DNDEBUG -O2 -g -pipe -Wall -Wp,-D_FORTIFY_SOURCE=2 -fexceptions -fstack-protector-strong
--param=ssp-buffer-size=4 -grecord-gcc-switches -m64 -mtune=generic -D_GNU_SOURCE -fPIC -fwrapv
-g1 -O0 -Wno-unused-local-typedefs -g1 -O0 -Wno-unused-local-typedefs -I/usr/include/subversion-1
-I/usr/include/apr-1 -I/usr/include/apr-1.0 -fPIC -I/mesos/mesos-0.29.0/_build/../include
-I/mesos/mesos-0.29.0/_build/include -I/mesos/mesos-0.29.0/_build/include/mesos -I/mesos/mesos-0.29.0/_build/src
-I/mesos/mesos-0.29.0/_build/src/python/executor/src/mesos/executor -I/mesos/mesos-0.29.0/_build/src/python/native_common
-I/mesos/mesos-0.29.0/_build/3rdparty/libprocess/3rdparty/protobuf-2.5.0/src -I/usr/include/python2.7
-c src/mesos/executor/proxy_executor.cpp -o build/temp.linux-x86_64-2.7/src/mesos/executor/proxy_executor.o
copying build/lib/mesos/__init__.py -> build/bdist.linux-x86_64/egg/mesos
byte-compiling build/bdist.linux-x86_64/egg/mesos/futures.py to futures.pyc
removing 'build/bdist.linux-x86_64/egg' (and everything under it)
running bdist_wheel
byte-compiling build/bdist.linux-x86_64/egg/mesos/http.py to http.pyc
running build
byte-compiling build/bdist.linux-x86_64/egg/mesos/cli.py to cli.pyc
running build
byte-compiling build/bdist.linux-x86_64/egg/mesos/__init__.py to __init__.pyc
creating build/bdist.linux-x86_64/egg/EGG-INFO
creating build/bdist.linux-x86_64
copying src/mesos.cli.egg-info/PKG-INFO -> build/bdist.linux-x86_64/egg/EGG-INFO
creating build/bdist.linux-x86_64/egg
creating build/bdist.linux-x86_64/egg/mesos
copying src/mesos.cli.egg-info/SOURCES.txt -> build/bdist.linux-x86_64/egg/EGG-INFO
creating build/bdist.linux-x86_64/egg/mesos/interface
copying src/mesos.cli.egg-info/dependency_links.txt -> build/bdist.linux-x86_64/egg/EGG-INFO
copying build/lib/mesos/interface/containerizer_pb2.py -> build/bdist.linux-x86_64/egg/mesos/interface
copying src/mesos.cli.egg-info/namespace_packages.txt -> build/bdist.linux-x86_64/egg/EGG-INFO
copying build/lib/mesos/interface/__init__.py -> build/bdist.linux-x86_64/egg/mesos/interface
copying src/mesos.cli.egg-info/top_level.txt -> build/bdist.linux-x86_64/egg/EGG-INFO
zip_safe flag not set; analyzing archive contents...
copying build/lib/mesos/interface/mesos_pb2.py -> build/bdist.linux-x86_64/egg/mesos/interface
mesos.__init__: module references __path__
copying build/lib/mesos/__init__.py -> build/bdist.linux-x86_64/egg/mesos
byte-compiling build/bdist.linux-x86_64/egg/mesos/interface/containerizer_pb2.py to containerizer_pb2.pyc
creating '/mesos/mesos-0.29.0/_build/src/python/dist/mesos.cli-0.29.0-py2.7.egg' and adding
'build/bdist.linux-x86_64/egg' to it
byte-compiling build/bdist.linux-x86_64/egg/mesos/interface/__init__.py to __init__.pyc
removing 'build/bdist.linux-x86_64/egg' (and everything under it)
byte-compiling build/bdist.linux-x86_64/egg/mesos/interface/mesos_pb2.py to mesos_pb2.pyc
In file included from /usr/include/limits.h:26:0,
                 from /usr/lib/gcc/x86_64-redhat-linux/4.8.5/include/limits.h:168,
                 from /usr/lib/gcc/x86_64-redhat-linux/4.8.5/include/syslimits.h:7,
                 from /usr/lib/gcc/x86_64-redhat-linux/4.8.5/include/limits.h:34,
                 from /usr/include/python2.7/Python.h:19,
                 from src/mesos/scheduler/mesos_scheduler_driver_impl.cpp:19:
/usr/include/features.h:330:4: warning: #warning _FORTIFY_SOURCE requires compiling with optimization
(-O) [-Wcpp]
 #  warning _FORTIFY_SOURCE requires compiling with optimization (-O)
    ^
running bdist_wheel
running build
In file included from /usr/include/limits.h:26:0,
                 from /usr/lib/gcc/x86_64-redhat-linux/4.8.5/include/limits.h:168,
                 from /usr/lib/gcc/x86_64-redhat-linux/4.8.5/include/syslimits.h:7,
                 from /usr/lib/gcc/x86_64-redhat-linux/4.8.5/include/limits.h:34,
                 from /usr/include/python2.7/Python.h:19,
                 from src/mesos/executor/proxy_executor.cpp:19:
/usr/include/features.h:330:4: warning: #warning _FORTIFY_SOURCE requires compiling with optimization
(-O) [-Wcpp]
 #  warning _FORTIFY_SOURCE requires compiling with optimization (-O)
    ^
installing to build/bdist.linux-x86_64/wheel
running install
running install_lib
installing to build/bdist.linux-x86_64/wheel
running install
copying mesos/futures.py -> build/bdist.linux-x86_64/wheel/mesos
installing to build/bdist.linux-x86_64/wheel
running install_lib
running install
creating build/bdist.linux-x86_64/wheel
running install_lib
copying mesos/http.py -> build/bdist.linux-x86_64/wheel/mesos
creating build/bdist.linux-x86_64/wheel/mesos
copying mesos/cli.py -> build/bdist.linux-x86_64/wheel/mesos
copying build/lib/mesos/__init__.py -> build/bdist.linux-x86_64/wheel/mesos
Skipping installation of build/bdist.linux-x86_64/wheel/mesos/__init__.py (namespace package)
running install_egg_info
running install_egg_info
Skipping installation of build/bdist.linux-x86_64/wheel/mesos/__init__.py (namespace package)
Copying src/mesos.egg-info to build/bdist.linux-x86_64/wheel/mesos-0.29.0-py2.7.egg-info
copying mesos/native/__init__.py -> build/bdist.linux-x86_64/wheel/mesos/native
Copying src/mesos.cli.egg-info to build/bdist.linux-x86_64/wheel/mesos.cli-0.29.0-py2.7.egg-info
running install_egg_info
Installing build/bdist.linux-x86_64/wheel/mesos.cli-0.29.0-py2.7-nspkg.pth
Copying src/mesos.native.egg-info to build/bdist.linux-x86_64/wheel/mesos.native-0.29.0-py2.7.egg-info
running install_scripts
running install_scripts
Installing build/bdist.linux-x86_64/wheel/mesos.native-0.29.0-py2.7-nspkg.pth
running install_scripts
byte-compiling build/bdist.linux-x86_64/egg/mesos/__init__.py to __init__.pyc
creating build/bdist.linux-x86_64/egg/EGG-INFO
copying src/mesos.interface.egg-info/PKG-INFO -> build/bdist.linux-x86_64/egg/EGG-INFO
copying src/mesos.interface.egg-info/SOURCES.txt -> build/bdist.linux-x86_64/egg/EGG-INFO
copying src/mesos.interface.egg-info/dependency_links.txt -> build/bdist.linux-x86_64/egg/EGG-INFO
copying src/mesos.interface.egg-info/namespace_packages.txt -> build/bdist.linux-x86_64/egg/EGG-INFO
copying src/mesos.interface.egg-info/requires.txt -> build/bdist.linux-x86_64/egg/EGG-INFO
copying src/mesos.interface.egg-info/top_level.txt -> build/bdist.linux-x86_64/egg/EGG-INFO
zip_safe flag not set; analyzing archive contents...
mesos.__init__: module references __path__
creating '/mesos/mesos-0.29.0/_build/src/python/dist/mesos.interface-0.29.0-py2.7.egg' and
adding 'build/bdist.linux-x86_64/egg' to it
creating build/bdist.linux-x86_64/wheel/mesos-0.29.0.dist-info/WHEEL
creating build/bdist.linux-x86_64/wheel/mesos.native-0.29.0.dist-info/WHEEL
creating build/bdist.linux-x86_64/wheel/mesos.cli-0.29.0.dist-info/WHEEL
removing 'build/bdist.linux-x86_64/egg' (and everything under it)
running bdist_wheel
running build
installing to build/bdist.linux-x86_64/wheel
running install
running install_lib
Skipping installation of build/bdist.linux-x86_64/wheel/mesos/__init__.py (namespace package)
copying mesos/interface/containerizer_pb2.py -> build/bdist.linux-x86_64/wheel/mesos/interface
copying mesos/interface/__init__.py -> build/bdist.linux-x86_64/wheel/mesos/interface
copying mesos/interface/mesos_pb2.py -> build/bdist.linux-x86_64/wheel/mesos/interface
running install_egg_info
Copying src/mesos.interface.egg-info to build/bdist.linux-x86_64/wheel/mesos.interface-0.29.0-py2.7.egg-info
Installing build/bdist.linux-x86_64/wheel/mesos.interface-0.29.0-py2.7-nspkg.pth
running install_scripts
creating build/bdist.linux-x86_64/wheel/mesos.interface-0.29.0.dist-info/WHEEL
In file included from /usr/include/c++/4.8.2/mutex:35:0,
                 from /mesos/mesos-0.29.0/_build/../include/mesos/executor.hpp:20,
                 from src/mesos/executor/mesos_executor_driver_impl.hpp:20,
                 from src/mesos/executor/proxy_executor.cpp:24:
/usr/include/c++/4.8.2/bits/c++0x_warning.h:32:2: error: #error This file requires compiler
and library support for the ISO C++ 2011 standard. This support is currently experimental,
and must be enabled with the -std=c++11 or -std=gnu++11 compiler options.
 #error This file requires compiler and library support for the \
  ^
In file included from /usr/include/c++/4.8.2/mutex:35:0,
                 from /mesos/mesos-0.29.0/_build/../include/mesos/scheduler.hpp:21,
                 from src/mesos/scheduler/mesos_scheduler_driver_impl.hpp:20,
                 from src/mesos/scheduler/mesos_scheduler_driver_impl.cpp:24:
/usr/include/c++/4.8.2/bits/c++0x_warning.h:32:2: error: #error This file requires compiler
and library support for the ISO C++ 2011 standard. This support is currently experimental,
and must be enabled with the -std=c++11 or -std=gnu++11 compiler options.
 #error This file requires compiler and library support for the \
  ^
In file included from src/mesos/executor/mesos_executor_driver_impl.hpp:20:0,
                 from src/mesos/executor/proxy_executor.cpp:24:
/mesos/mesos-0.29.0/_build/../include/mesos/executor.hpp:242:3: error: 'recursive_mutex' in
namespace 'std' does not name a type
   std::recursive_mutex mutex;
   ^
In file included from src/mesos/scheduler/mesos_scheduler_driver_impl.hpp:20:0,
                 from src/mesos/scheduler/mesos_scheduler_driver_impl.cpp:24:
/mesos/mesos-0.29.0/_build/../include/mesos/scheduler.hpp:438:3: error: 'shared_ptr' in namespace
'std' does not name a type
   std::shared_ptr<internal::MasterDetector> detector;
   ^
/mesos/mesos-0.29.0/_build/../include/mesos/scheduler.hpp:454:3: error: 'recursive_mutex'
in namespace 'std' does not name a type
   std::recursive_mutex mutex;
   ^
error: command 'gcc' failed with exit status 1
make[3]: *** [python/dist/mesos.executor-0.29.0-py2.7-linux-x86_64.egg] Error 1
make[3]: *** Waiting for unfinished jobs....
error: command 'gcc' failed with exit status 1
make[3]: *** [python/dist/mesos.scheduler-0.29.0-py2.7-linux-x86_64.egg] Error 1
libtool: link: (cd ".libs" && rm -f "libmesos.so" && ln -s "libmesos-0.29.0.so"
"libmesos.so")
libtool: link: ( cd ".libs" && rm -f "libmesos.la" && ln -s "../libmesos.la"
"libmesos.la" )
make[3]: Leaving directory `/mesos/mesos-0.29.0/_build/src'
make[2]: *** [all] Error 2
make[2]: Leaving directory `/mesos/mesos-0.29.0/_build/src'
make[1]: *** [all-recursive] Error 1
make[1]: Leaving directory `/mesos/mesos-0.29.0/_build'
make: *** [distcheck] Error 1
+ docker rmi mesos-1458270109-27875
Untagged: mesos-1458270109-27875:latest
Deleted: 8198aedc3d691f007c7c22916eb808c42b30a10259cb6ee23851e1b27c119873
Deleted: e513275cbb1ccd48e52d2d97c9bc76af96134b854e36f67684af3361b64d1ddd
Deleted: 1af49af7f372586b0bc8f247ef3d35a9abc184b92dae45e0641da36b944cc84a
Deleted: ce32d7e8016569a882b6f6f261dec118cddf7e4daacf2820d68e07a03fb592b6
Deleted: 70315e87c11953c195bc7026c7450d3336622a8ec54078698ac74594e30a8dcc
Deleted: d359052d399efd6d785b6fbe60f6fb204cbe1e8b7f2f4ae0c3ebceb2dcdec327
Deleted: 6282a528f3a07299643b275b044caa20c5db772d0a7eff3699c55de993897740
Deleted: d63355d79e110ae30cd55a567bdedc19288781c39640f3945f858073b952c507
Deleted: d63cc1fcdc0a3c00badc37c65539cd53aa78a66e7ceed766c67a97fddfe1c00b
Deleted: c3d9cc355dae7a69b7e20959493d0a1839be05545b5dd2b81652e0c49d4271cc
Deleted: 6dbead4da553638edfb1129df925b16b0f0a2b97f35b3610396ed0588fc8d215
Deleted: 251444d012d3d309a15c351d55cda19aa0467d41a34fb4dbc2f11df11dad3920
Deleted: a69572baa10daf8705e42df0e3a2d81e233522f1b0344e535e4ab0ea6d44c44b
Deleted: 4afb0e4760a434bfc2600987db5a07ce7dd06893e4abc64c1b8f3ac549dba525
Deleted: a3fe284dc5a27b5634301119ce3faf2d3aeaa1f5803378cfb1ab73fad696aac5
Deleted: 8f68d6b1117b96df7c253e24e073a3e284fb2e0e15bc763066ed4c941572da23
Build step 'Execute shell' marked build as failure

Mime
View raw message