mesos-builds mailing list archives

Site index · List index
Message view « Date » · « Thread »
Top « Date » · « Thread »
From Apache Jenkins Server <jenk...@builds.apache.org>
Subject Build failed in Jenkins: Mesos » clang,--verbose --enable-libevent --enable-ssl,GLOG_v=1 MESOS_VERBOSE=1,ubuntu:14.04,(docker||Hadoop)&&(!ubuntu-us1) #1894
Date Tue, 29 Mar 2016 19:11:04 GMT
See <https://builds.apache.org/job/Mesos/COMPILER=clang,CONFIGURATION=--verbose%20--enable-libevent%20--enable-ssl,ENVIRONMENT=GLOG_v=1%20MESOS_VERBOSE=1,OS=ubuntu%3A14.04,label_exp=(docker%7C%7CHadoop)&&(!ubuntu-us1)/1894/changes>

Changes:

[bmahler] Cleaned up resources library to use the new -> operators.

[bmahler] Added a flag parser for vector<unsigned int> to src/common/parse.hpp.

------------------------------------------
[...truncated 19169 lines...]
[       OK ] ProcessTest.FirewallUninstall (8 ms)
[----------] 30 tests from ProcessTest (88 ms total)

[----------] 3 tests from QueueTest
[ RUN      ] QueueTest.Block
[       OK ] QueueTest.Block (0 ms)
[ RUN      ] QueueTest.Noblock
[       OK ] QueueTest.Noblock (0 ms)
[ RUN      ] QueueTest.Queue
[       OK ] QueueTest.Queue (0 ms)
[----------] 3 tests from QueueTest (0 ms total)

[----------] 3 tests from ReapTest
[ RUN      ] ReapTest.NonChildProcess
[       OK ] ReapTest.NonChildProcess (43 ms)
[ RUN      ] ReapTest.ChildProcess
[       OK ] ReapTest.ChildProcess (31 ms)
[ RUN      ] ReapTest.TerminatedChildProcess
[       OK ] ReapTest.TerminatedChildProcess (24 ms)
[----------] 3 tests from ReapTest (99 ms total)

[----------] 4 tests from SequenceTest
[ RUN      ] SequenceTest.Serialize
[       OK ] SequenceTest.Serialize (11 ms)
[ RUN      ] SequenceTest.DiscardOne
[       OK ] SequenceTest.DiscardOne (11 ms)
[ RUN      ] SequenceTest.DiscardAll
[       OK ] SequenceTest.DiscardAll (12 ms)
[ RUN      ] SequenceTest.Random
[       OK ] SequenceTest.Random (11 ms)
[----------] 4 tests from SequenceTest (45 ms total)

[----------] 4 tests from SharedTest
[ RUN      ] SharedTest.ConstAccess
[       OK ] SharedTest.ConstAccess (0 ms)
[ RUN      ] SharedTest.Null
[       OK ] SharedTest.Null (0 ms)
[ RUN      ] SharedTest.Reset
[       OK ] SharedTest.Reset (0 ms)
[ RUN      ] SharedTest.Own
[       OK ] SharedTest.Own (0 ms)
[----------] 4 tests from SharedTest (1 ms total)

[----------] 3 tests from StatisticsTest
[ RUN      ] StatisticsTest.Empty
[       OK ] StatisticsTest.Empty (0 ms)
[ RUN      ] StatisticsTest.Single
[       OK ] StatisticsTest.Single (0 ms)
[ RUN      ] StatisticsTest.Statistics
[       OK ] StatisticsTest.Statistics (0 ms)
[----------] 3 tests from StatisticsTest (0 ms total)

[----------] 14 tests from SubprocessTest
[ RUN      ] SubprocessTest.Status
[       OK ] SubprocessTest.Status (85 ms)
[ RUN      ] SubprocessTest.PipeOutput
[       OK ] SubprocessTest.PipeOutput (27 ms)
[ RUN      ] SubprocessTest.PipeInput
[       OK ] SubprocessTest.PipeInput (13 ms)
[ RUN      ] SubprocessTest.PipeRedirect
[       OK ] SubprocessTest.PipeRedirect (13 ms)
[ RUN      ] SubprocessTest.PathOutput
[       OK ] SubprocessTest.PathOutput (43 ms)
[ RUN      ] SubprocessTest.PathInput
[       OK ] SubprocessTest.PathInput (14 ms)
[ RUN      ] SubprocessTest.FdOutput
[       OK ] SubprocessTest.FdOutput (43 ms)
[ RUN      ] SubprocessTest.FdInput
[       OK ] SubprocessTest.FdInput (14 ms)
[ RUN      ] SubprocessTest.Default
hello world
[       OK ] SubprocessTest.Default (21 ms)
[ RUN      ] SubprocessTest.Flags
[       OK ] SubprocessTest.Flags (43 ms)
[ RUN      ] SubprocessTest.Environment
[       OK ] SubprocessTest.Environment (26 ms)
[ RUN      ] SubprocessTest.EnvironmentWithSpaces
[       OK ] SubprocessTest.EnvironmentWithSpaces (13 ms)
[ RUN      ] SubprocessTest.EnvironmentWithSpacesAndQuotes
[       OK ] SubprocessTest.EnvironmentWithSpacesAndQuotes (14 ms)
[ RUN      ] SubprocessTest.EnvironmentOverride
[       OK ] SubprocessTest.EnvironmentOverride (13 ms)
[----------] 14 tests from SubprocessTest (382 ms total)

[----------] 3 tests from TimeSeriesTest
[ RUN      ] TimeSeriesTest.Set
[       OK ] TimeSeriesTest.Set (0 ms)
[ RUN      ] TimeSeriesTest.Sparsify
[       OK ] TimeSeriesTest.Sparsify (0 ms)
[ RUN      ] TimeSeriesTest.Truncate
[       OK ] TimeSeriesTest.Truncate (1 ms)
[----------] 3 tests from TimeSeriesTest (1 ms total)

[----------] 5 tests from TimeTest
[ RUN      ] TimeTest.Arithmetic
[       OK ] TimeTest.Arithmetic (0 ms)
[ RUN      ] TimeTest.Now
[       OK ] TimeTest.Now (0 ms)
[ RUN      ] TimeTest.RFC1123Output
[       OK ] TimeTest.RFC1123Output (0 ms)
[ RUN      ] TimeTest.RFC3339Output
[       OK ] TimeTest.RFC3339Output (0 ms)
[ RUN      ] TimeTest.Output
[       OK ] TimeTest.Output (0 ms)
[----------] 5 tests from TimeTest (0 ms total)

[----------] 1 test from SSL
[ RUN      ] SSL.Disabled
[       OK ] SSL.Disabled (0 ms)
[----------] 1 test from SSL (0 ms total)

[----------] 16 tests from SSLTest
[ RUN      ] SSLTest.BasicSameProcess
[       OK ] SSLTest.BasicSameProcess (527 ms)
[ RUN      ] SSLTest.SSLSocket
[       OK ] SSLTest.SSLSocket (580 ms)
[ RUN      ] SSLTest.NonSSLSocket
I0329 19:10:54.251368 30021 libevent_ssl_socket.cpp:1066] Socket error: error:140760FC:SSL
routines:SSL23_GET_CLIENT_HELLO:unknown protocol
[       OK ] SSLTest.NonSSLSocket (402 ms)
[ RUN      ] SSLTest.NoVerifyBadCA
[       OK ] SSLTest.NoVerifyBadCA (603 ms)
[ RUN      ] SSLTest.RequireBadCA
W0329 19:10:55.418995 30021 openssl.cpp:250] Error with certificate at depth: 0
Issuer: /C=US/O=Test/CN=5a252ffeafeb
Subject: /C=US/O=Test/CN=5a252ffeafeb
Error (18): self signed certificate
I0329 19:10:55.419133 30021 libevent_ssl_socket.cpp:1066] Socket error: error:140890B2:SSL
routines:SSL3_GET_CLIENT_CERTIFICATE:no certificate returned
[       OK ] SSLTest.RequireBadCA (603 ms)
[ RUN      ] SSLTest.VerifyBadCA
W0329 19:10:55.835649 30021 openssl.cpp:250] Error with certificate at depth: 0
Issuer: /C=US/O=Test/CN=5a252ffeafeb
Subject: /C=US/O=Test/CN=5a252ffeafeb
Error (18): self signed certificate
I0329 19:10:55.835750 30021 libevent_ssl_socket.cpp:1066] Socket error: error:140890B2:SSL
routines:SSL3_GET_CLIENT_CERTIFICATE:no certificate returned
[       OK ] SSLTest.VerifyBadCA (402 ms)
[ RUN      ] SSLTest.VerifyCertificate
[       OK ] SSLTest.VerifyCertificate (604 ms)
[ RUN      ] SSLTest.RequireCertificate
[       OK ] SSLTest.RequireCertificate (703 ms)
[ RUN      ] SSLTest.ProtocolMismatch
I0329 19:10:57.605046 30004 ssl_tests.cpp:390] Testing server protocol 'SSL_ENABLE_SSL_V3'
with client protocol 'SSL_ENABLE_SSL_V3'
I0329 19:10:57.713872 30004 ssl_tests.cpp:390] Testing server protocol 'SSL_ENABLE_SSL_V3'
with client protocol 'SSL_ENABLE_TLS_V1_0'
I0329 19:10:57.734992 30021 libevent_ssl_socket.cpp:1066] Socket error: Connection reset by
peer
I0329 19:10:57.814947 30004 ssl_tests.cpp:390] Testing server protocol 'SSL_ENABLE_SSL_V3'
with client protocol 'SSL_ENABLE_TLS_V1_1'
I0329 19:10:57.835089 30021 libevent_ssl_socket.cpp:1066] Socket error: Connection reset by
peer
I0329 19:10:57.916492 30004 ssl_tests.cpp:390] Testing server protocol 'SSL_ENABLE_SSL_V3'
with client protocol 'SSL_ENABLE_TLS_V1_2'
I0329 19:10:57.934005 30021 libevent_ssl_socket.cpp:1066] Socket error: Connection reset by
peer
I0329 19:10:58.016715 30004 ssl_tests.cpp:390] Testing server protocol 'SSL_ENABLE_TLS_V1_0'
with client protocol 'SSL_ENABLE_SSL_V3'
I0329 19:10:58.033061 30021 libevent_ssl_socket.cpp:1066] Socket error: error:1408A10B:SSL
routines:SSL3_GET_CLIENT_HELLO:wrong version number
I0329 19:10:58.118068 30004 ssl_tests.cpp:390] Testing server protocol 'SSL_ENABLE_TLS_V1_0'
with client protocol 'SSL_ENABLE_TLS_V1_0'
I0329 19:10:58.218868 30004 ssl_tests.cpp:390] Testing server protocol 'SSL_ENABLE_TLS_V1_0'
with client protocol 'SSL_ENABLE_TLS_V1_1'
I0329 19:10:58.238301 30021 libevent_ssl_socket.cpp:1066] Socket error: Connection reset by
peer
I0329 19:10:58.319138 30004 ssl_tests.cpp:390] Testing server protocol 'SSL_ENABLE_TLS_V1_0'
with client protocol 'SSL_ENABLE_TLS_V1_2'
I0329 19:10:58.339915 30021 libevent_ssl_socket.cpp:1066] Socket error: Connection reset by
peer
I0329 19:10:58.419749 30004 ssl_tests.cpp:390] Testing server protocol 'SSL_ENABLE_TLS_V1_1'
with client protocol 'SSL_ENABLE_SSL_V3'
I0329 19:10:58.436074 30021 libevent_ssl_socket.cpp:1066] Socket error: error:140760FC:SSL
routines:SSL23_GET_CLIENT_HELLO:unknown protocol
I0329 19:10:58.521004 30004 ssl_tests.cpp:390] Testing server protocol 'SSL_ENABLE_TLS_V1_1'
with client protocol 'SSL_ENABLE_TLS_V1_0'
I0329 19:10:58.537941 30021 libevent_ssl_socket.cpp:1066] Socket error: error:140760FC:SSL
routines:SSL23_GET_CLIENT_HELLO:unknown protocol
I0329 19:10:58.621799 30004 ssl_tests.cpp:390] Testing server protocol 'SSL_ENABLE_TLS_V1_1'
with client protocol 'SSL_ENABLE_TLS_V1_1'
I0329 19:10:58.723553 30004 ssl_tests.cpp:390] Testing server protocol 'SSL_ENABLE_TLS_V1_1'
with client protocol 'SSL_ENABLE_TLS_V1_2'
I0329 19:10:58.742717 30021 libevent_ssl_socket.cpp:1066] Socket error: Connection reset by
peer
I0329 19:10:58.823459 30004 ssl_tests.cpp:390] Testing server protocol 'SSL_ENABLE_TLS_V1_2'
with client protocol 'SSL_ENABLE_SSL_V3'
I0329 19:10:58.840404 30021 libevent_ssl_socket.cpp:1066] Socket error: error:140760FC:SSL
routines:SSL23_GET_CLIENT_HELLO:unknown protocol
I0329 19:10:58.924533 30004 ssl_tests.cpp:390] Testing server protocol 'SSL_ENABLE_TLS_V1_2'
with client protocol 'SSL_ENABLE_TLS_V1_0'
I0329 19:10:58.941596 30021 libevent_ssl_socket.cpp:1066] Socket error: error:140760FC:SSL
routines:SSL23_GET_CLIENT_HELLO:unknown protocol
I0329 19:10:59.025826 30004 ssl_tests.cpp:390] Testing server protocol 'SSL_ENABLE_TLS_V1_2'
with client protocol 'SSL_ENABLE_TLS_V1_1'
I0329 19:10:59.042531 30021 libevent_ssl_socket.cpp:1066] Socket error: error:140760FC:SSL
routines:SSL23_GET_CLIENT_HELLO:unknown protocol
I0329 19:10:59.126261 30004 ssl_tests.cpp:390] Testing server protocol 'SSL_ENABLE_TLS_V1_2'
with client protocol 'SSL_ENABLE_TLS_V1_2'
[       OK ] SSLTest.ProtocolMismatch (2015 ms)
[ RUN      ] SSLTest.ValidDowngrade
W0329 19:10:59.517519 30004 openssl.cpp:363] Failed SSL connections will be downgraded to
a non-SSL socket
[       OK ] SSLTest.ValidDowngrade (403 ms)
[ RUN      ] SSLTest.NoValidDowngrade
I0329 19:10:59.942535 30021 libevent_ssl_socket.cpp:1066] Socket error: error:140760FC:SSL
routines:SSL23_GET_CLIENT_HELLO:unknown protocol
[       OK ] SSLTest.NoValidDowngrade (402 ms)
[ RUN      ] SSLTest.ValidDowngradeEachProtocol
I0329 19:11:00.455610 30004 ssl_tests.cpp:509] Testing server protocol 'SSL_ENABLE_SSL_V3'
W0329 19:11:00.455994 30004 openssl.cpp:363] Failed SSL connections will be downgraded to
a non-SSL socket
I0329 19:11:00.535101 30004 ssl_tests.cpp:509] Testing server protocol 'SSL_ENABLE_TLS_V1_0'
W0329 19:11:00.535671 30004 openssl.cpp:363] Failed SSL connections will be downgraded to
a non-SSL socket
I0329 19:11:00.635785 30004 ssl_tests.cpp:509] Testing server protocol 'SSL_ENABLE_TLS_V1_1'
W0329 19:11:00.636431 30004 openssl.cpp:363] Failed SSL connections will be downgraded to
a non-SSL socket
I0329 19:11:00.736322 30004 ssl_tests.cpp:509] Testing server protocol 'SSL_ENABLE_TLS_V1_2'
W0329 19:11:00.736877 30004 openssl.cpp:363] Failed SSL connections will be downgraded to
a non-SSL socket
[       OK ] SSLTest.ValidDowngradeEachProtocol (805 ms)
[ RUN      ] SSLTest.NoValidDowngradeEachProtocol
I0329 19:11:01.073698 30004 ssl_tests.cpp:556] Testing server protocol 'SSL_ENABLE_SSL_V3'
I0329 19:11:01.088002 30021 libevent_ssl_socket.cpp:1066] Socket error: error:140760FC:SSL
routines:SSL23_GET_CLIENT_HELLO:unknown protocol
I0329 19:11:01.138654 30004 ssl_tests.cpp:556] Testing server protocol 'SSL_ENABLE_TLS_V1_0'
I0329 19:11:01.151886 30021 libevent_ssl_socket.cpp:1066] Socket error: error:140760FC:SSL
routines:SSL23_GET_CLIENT_HELLO:unknown protocol
I0329 19:11:01.239601 30004 ssl_tests.cpp:556] Testing server protocol 'SSL_ENABLE_TLS_V1_1'
I0329 19:11:01.252208 30021 libevent_ssl_socket.cpp:1066] Socket error: error:140760FC:SSL
routines:SSL23_GET_CLIENT_HELLO:unknown protocol
I0329 19:11:01.340270 30004 ssl_tests.cpp:556] Testing server protocol 'SSL_ENABLE_TLS_V1_2'
I0329 19:11:01.356173 30021 libevent_ssl_socket.cpp:1066] Socket error: error:140760FC:SSL
routines:SSL23_GET_CLIENT_HELLO:unknown protocol
[       OK ] SSLTest.NoValidDowngradeEachProtocol (604 ms)
[ RUN      ] SSLTest.PeerAddress
[       OK ] SSLTest.PeerAddress (221 ms)
[ RUN      ] SSLTest.HTTPSGet
../../../3rdparty/libprocess/src/tests/ssl_tests.cpp:663: Failure
(response).failure(): Failed to decode response
[  FAILED  ] SSLTest.HTTPSGet (270 ms)
[ RUN      ] SSLTest.HTTPSPost
../../../3rdparty/libprocess/src/tests/ssl_tests.cpp:704: Failure
(response).failure(): Failed to decode response
[  FAILED  ] SSLTest.HTTPSPost (338 ms)
[----------] 16 tests from SSLTest (9482 ms total)

[----------] Global test environment tear-down
[==========] 172 tests from 25 test cases ran. (10702 ms total)
[  PASSED  ] 170 tests.
[  FAILED  ] 2 tests, listed below:
[  FAILED  ] SSLTest.HTTPSGet
[  FAILED  ] SSLTest.HTTPSPost

 2 FAILED TESTS
  YOU HAVE 2 DISABLED TESTS

make[6]: *** [check-local] Error 1
make[6]: Leaving directory `/mesos/mesos-0.29.0/_build/3rdparty/libprocess'
make[5]: *** [check-am] Error 2
make[5]: Leaving directory `/mesos/mesos-0.29.0/_build/3rdparty/libprocess'
make[4]: *** [check-recursive] Error 1
make[4]: Leaving directory `/mesos/mesos-0.29.0/_build/3rdparty/libprocess'
make[3]: *** [check-recursive] Error 1
make[3]: Leaving directory `/mesos/mesos-0.29.0/_build/3rdparty'
make[2]: Leaving directory `/mesos/mesos-0.29.0/_build/3rdparty'
make[2]: *** [check] Error 2
make[1]: *** [check-recursive] Error 1
make[1]: Leaving directory `/mesos/mesos-0.29.0/_build'
make: *** [distcheck] Error 1
+ docker rmi mesos-1459277607-27115
Untagged: mesos-1459277607-27115:latest
Deleted: 8718b2929932e160b9d727e52300207c7400c87c43fd7cc81dff9d22ccdf1110
Deleted: 8faeb68689227bf8e63f055601e12a5f0b87d6cf59167220d62c6d6e745fe421
Deleted: b062c7a7ce4b5e38622bb580e4958a706b5998d0d00a44c22c7f6d2d2c9ea0a2
Deleted: f4256888bacc33e65a58fb9a9453b82e5e88bc6183364e1d16ba8dae961a9a56
Deleted: 8f876f0d7b94e65e986213b17349a7377f0c4008e0d4f2fa19e2a22aa7d64d99
Deleted: 9a63032a86507080433765f09c62ee7522a1138022fa0a71e0ca0274a77e1794
Deleted: d3d0caf889dd0ab1f39967948c9e9d446225c489a9a2aa5e9f3c4a3d3568c624
Deleted: 9b7f9eaf4bb8a1b15f508aeb89c132633c2f7a1f24b42dc44f649b853b387d26
Deleted: 78f4e48044301aaf2a925745d0b771ab93842c572f0977576002f6fd38b45617
Deleted: 36e9ab27d9a12353624c47b3cb3678a6165526b83061da821f210cbe12f8512e
Deleted: d15b07f38f36f5c110f431ebec626e33546ff5bb32c1250d728cb0ef0c5d0eae
Deleted: 6b9a5e7d7affab883d579efca83dfc156b41cd26908d60c8a07751d5ed8f8ade
Deleted: e84e2141dcbe7ab277d64bc8d16ada1051fbddec2ea7e089ad6a932d412454a0
Deleted: 2639890e8ba9835ea8da4497a6727fb73ecf087b2949460c5964abd8c549f81a
Deleted: 9862e2903b03d03b29977f8741f534d4b7f7fbd3d606ffc011f7561641860123
Deleted: c8dd136a78ff7e7b9e58fd50c99d1f41a139047e816b26f1ce0d1a4b4074d286
Build step 'Execute shell' marked build as failure

Mime
View raw message