mesos-builds mailing list archives

Site index · List index
Message view « Date » · « Thread »
Top « Date » · « Thread »
From Apache Jenkins Server <jenk...@builds.apache.org>
Subject Build failed in Jenkins: mesos-reviewbot #12029
Date Fri, 18 Mar 2016 03:17:20 GMT
See <https://builds.apache.org/job/mesos-reviewbot/12029/>

------------------------------------------
[...truncated 5150 lines...]
writing namespace_packages to src/mesos.cli.egg-info/namespace_packages.txt
writing top-level names to src/mesos.cli.egg-info/top_level.txt
writing dependency_links to src/mesos.cli.egg-info/dependency_links.txt
writing manifest file 'src/mesos.cli.egg-info/SOURCES.txt'
In file included from /usr/include/c++/4.8/mutex:35:0,
                 from <https://builds.apache.org/job/mesos-reviewbot/ws/mesos-0.29.0/_build/../include/mesos/executor.hpp>:20,
                 from src/mesos/executor/mesos_executor_driver_impl.hpp:20,
                 from src/mesos/executor/proxy_executor.cpp:24:
/usr/include/c++/4.8/bits/c++0x_warning.h:32:2: error: #error This file requires compiler
and library support for the ISO C++ 2011 standard. This support is currently experimental,
and must be enabled with the -std=c++11 or -std=gnu++11 compiler options.
 #error This file requires compiler and library support for the \
  ^
reading manifest file 'src/mesos.cli.egg-info/SOURCES.txt'
writing manifest file 'src/mesos.cli.egg-info/SOURCES.txt'
installing library code to build/bdist.linux-x86_64/egg
running install_lib
running build_py
creating build
creating build/lib.linux-x86_64-2.7
running bdist_egg
creating build/lib.linux-x86_64-2.7/mesos
copying src/mesos/http.py -> build/lib.linux-x86_64-2.7/mesos
copying src/mesos/cli.py -> build/lib.linux-x86_64-2.7/mesos
copying src/mesos/__init__.py -> build/lib.linux-x86_64-2.7/mesos
copying src/mesos/futures.py -> build/lib.linux-x86_64-2.7/mesos
creating build/bdist.linux-x86_64
creating build/bdist.linux-x86_64/egg
creating build/bdist.linux-x86_64/egg/mesos
copying build/lib.linux-x86_64-2.7/mesos/http.py -> build/bdist.linux-x86_64/egg/mesos
copying build/lib.linux-x86_64-2.7/mesos/cli.py -> build/bdist.linux-x86_64/egg/mesos
copying build/lib.linux-x86_64-2.7/mesos/__init__.py -> build/bdist.linux-x86_64/egg/mesos
copying build/lib.linux-x86_64-2.7/mesos/futures.py -> build/bdist.linux-x86_64/egg/mesos
byte-compiling build/bdist.linux-x86_64/egg/mesos/http.py to http.pyc
byte-compiling build/bdist.linux-x86_64/egg/mesos/cli.py to cli.pyc
byte-compiling build/bdist.linux-x86_64/egg/mesos/__init__.py to __init__.pyc
byte-compiling build/bdist.linux-x86_64/egg/mesos/futures.py to futures.pyc
creating build/bdist.linux-x86_64/egg/EGG-INFO
copying src/mesos.cli.egg-info/PKG-INFO -> build/bdist.linux-x86_64/egg/EGG-INFO
copying src/mesos.cli.egg-info/SOURCES.txt -> build/bdist.linux-x86_64/egg/EGG-INFO
copying src/mesos.cli.egg-info/dependency_links.txt -> build/bdist.linux-x86_64/egg/EGG-INFO
copying src/mesos.cli.egg-info/namespace_packages.txt -> build/bdist.linux-x86_64/egg/EGG-INFO
copying src/mesos.cli.egg-info/top_level.txt -> build/bdist.linux-x86_64/egg/EGG-INFO
zip_safe flag not set; analyzing archive contents...
mesos.__init__: module references __path__
creating '<https://builds.apache.org/job/mesos-reviewbot/ws/mesos-0.29.0/_build/src/python/dist/mesos.cli-0.29.0-py2.7.egg'>
and adding 'build/bdist.linux-x86_64/egg' to it
removing 'build/bdist.linux-x86_64/egg' (and everything under it)
running bdist_egg
running bdist_wheel
running bdist_egg
running egg_info
creating src/mesos.native.egg-info
writing requirements to src/mesos.native.egg-info/requires.txt
writing src/mesos.native.egg-info/PKG-INFO
writing namespace_packages to src/mesos.native.egg-info/namespace_packages.txt
writing top-level names to src/mesos.native.egg-info/top_level.txt
running build
writing dependency_links to src/mesos.native.egg-info/dependency_links.txt
writing requirements to src/mesos.native.egg-info/requires.txt
writing src/mesos.native.egg-info/PKG-INFO
writing namespace_packages to src/mesos.native.egg-info/namespace_packages.txt
writing top-level names to src/mesos.native.egg-info/top_level.txt
writing dependency_links to src/mesos.native.egg-info/dependency_links.txt
writing manifest file 'src/mesos.native.egg-info/SOURCES.txt'
installing to build/bdist.linux-x86_64/wheel
running install
running install_lib
copying mesos/http.py -> build/bdist.linux-x86_64/wheel/mesos
copying mesos/cli.py -> build/bdist.linux-x86_64/wheel/mesos
Skipping installation of build/bdist.linux-x86_64/wheel/mesos/__init__.py (namespace package)
copying mesos/futures.py -> build/bdist.linux-x86_64/wheel/mesos
running install_egg_info
Copying src/mesos.cli.egg-info to build/bdist.linux-x86_64/wheel/mesos.cli-0.29.0.egg-info
Installing build/bdist.linux-x86_64/wheel/mesos.cli-0.29.0-nspkg.pth
running install_scripts
creating build/bdist.linux-x86_64/wheel/mesos.cli-0.29.0.dist-info/WHEEL
reading manifest file 'src/mesos.native.egg-info/SOURCES.txt'
running egg_info
creating src/mesos.scheduler.egg-info
writing manifest file 'src/mesos.native.egg-info/SOURCES.txt'
installing library code to build/bdist.linux-x86_64/egg
running install_lib
running build_py
creating build
creating build/lib.linux-x86_64-2.7
running egg_info
creating build/lib.linux-x86_64-2.7/mesos
copying src/mesos/__init__.py -> build/lib.linux-x86_64-2.7/mesos
creating build/lib.linux-x86_64-2.7/mesos/native
copying src/mesos/native/__init__.py -> build/lib.linux-x86_64-2.7/mesos/native
writing requirements to src/mesos.scheduler.egg-info/requires.txt
writing src/mesos.scheduler.egg-info/PKG-INFO
creating build/bdist.linux-x86_64
writing namespace_packages to src/mesos.scheduler.egg-info/namespace_packages.txt
writing top-level names to src/mesos.scheduler.egg-info/top_level.txt
writing dependency_links to src/mesos.scheduler.egg-info/dependency_links.txt
creating build/bdist.linux-x86_64/egg
creating build/bdist.linux-x86_64/egg/mesos
copying build/lib.linux-x86_64-2.7/mesos/__init__.py -> build/bdist.linux-x86_64/egg/mesos
creating build/bdist.linux-x86_64/egg/mesos/native
copying build/lib.linux-x86_64-2.7/mesos/native/__init__.py -> build/bdist.linux-x86_64/egg/mesos/native
byte-compiling build/bdist.linux-x86_64/egg/mesos/__init__.py to __init__.pyc
creating src/mesos.interface.egg-info
writing requirements to src/mesos.interface.egg-info/requires.txt
writing src/mesos.interface.egg-info/PKG-INFO
writing namespace_packages to src/mesos.interface.egg-info/namespace_packages.txt
writing top-level names to src/mesos.interface.egg-info/top_level.txt
writing requirements to src/mesos.scheduler.egg-info/requires.txt
writing src/mesos.scheduler.egg-info/PKG-INFO
byte-compiling build/bdist.linux-x86_64/egg/mesos/native/__init__.py to __init__.pyc
writing dependency_links to src/mesos.interface.egg-info/dependency_links.txt
creating build/bdist.linux-x86_64/egg/EGG-INFO
writing requirements to src/mesos.interface.egg-info/requires.txt
writing namespace_packages to src/mesos.scheduler.egg-info/namespace_packages.txt
copying src/mesos.native.egg-info/PKG-INFO -> build/bdist.linux-x86_64/egg/EGG-INFO
copying src/mesos.native.egg-info/SOURCES.txt -> build/bdist.linux-x86_64/egg/EGG-INFO
writing src/mesos.interface.egg-info/PKG-INFO
writing top-level names to src/mesos.scheduler.egg-info/top_level.txt
writing dependency_links to src/mesos.scheduler.egg-info/dependency_links.txt
copying src/mesos.native.egg-info/dependency_links.txt -> build/bdist.linux-x86_64/egg/EGG-INFO
writing manifest file 'src/mesos.scheduler.egg-info/SOURCES.txt'
copying src/mesos.native.egg-info/namespace_packages.txt -> build/bdist.linux-x86_64/egg/EGG-INFO
writing namespace_packages to src/mesos.interface.egg-info/namespace_packages.txt
writing top-level names to src/mesos.interface.egg-info/top_level.txt
copying src/mesos.native.egg-info/requires.txt -> build/bdist.linux-x86_64/egg/EGG-INFO
copying src/mesos.native.egg-info/top_level.txt -> build/bdist.linux-x86_64/egg/EGG-INFO
writing dependency_links to src/mesos.interface.egg-info/dependency_links.txt
zip_safe flag not set; analyzing archive contents...
writing manifest file 'src/mesos.interface.egg-info/SOURCES.txt'
mesos.__init__: module references __path__
creating '<https://builds.apache.org/job/mesos-reviewbot/ws/mesos-0.29.0/_build/src/python/dist/mesos.native-0.29.0-py2.7.egg'>
and adding 'build/bdist.linux-x86_64/egg' to it
removing 'build/bdist.linux-x86_64/egg' (and everything under it)
running bdist_wheel
running build
installing to build/bdist.linux-x86_64/wheel
running install
running install_lib
Skipping installation of build/bdist.linux-x86_64/wheel/mesos/__init__.py (namespace package)
copying mesos/native/__init__.py -> build/bdist.linux-x86_64/wheel/mesos/native
running install_egg_info
Copying src/mesos.native.egg-info to build/bdist.linux-x86_64/wheel/mesos.native-0.29.0.egg-info
Installing build/bdist.linux-x86_64/wheel/mesos.native-0.29.0-nspkg.pth
running install_scripts
creating build/bdist.linux-x86_64/wheel/mesos.native-0.29.0.dist-info/WHEEL
reading manifest file 'src/mesos.scheduler.egg-info/SOURCES.txt'
writing manifest file 'src/mesos.scheduler.egg-info/SOURCES.txt'
installing library code to build/bdist.linux-x86_64/egg
running install_lib
running build_py
creating build
creating build/lib.linux-x86_64-2.7
creating build/lib.linux-x86_64-2.7/mesos
copying src/mesos/__init__.py -> build/lib.linux-x86_64-2.7/mesos
creating build/lib.linux-x86_64-2.7/mesos/scheduler
copying src/mesos/scheduler/__init__.py -> build/lib.linux-x86_64-2.7/mesos/scheduler
running build_ext
building 'mesos.scheduler._scheduler' extension
creating build/temp.linux-x86_64-2.7
creating build/temp.linux-x86_64-2.7/src
creating build/temp.linux-x86_64-2.7/src/mesos
creating build/temp.linux-x86_64-2.7/src/mesos/scheduler
gcc -fno-strict-aliasing -DNDEBUG -g -fwrapv -O2 -Wall -Wstrict-prototypes -g1 -O0 -Wno-unused-local-typedefs
-g1 -O0 -Wno-unused-local-typedefs -I/usr/include/subversion-1 -I/usr/include/apr-1 -I/usr/include/apr-1.0
-fPIC -I<https://builds.apache.org/job/mesos-reviewbot/ws/mesos-0.29.0/_build/../include>
-I<https://builds.apache.org/job/mesos-reviewbot/ws/mesos-0.29.0/_build/include> -I<https://builds.apache.org/job/mesos-reviewbot/ws/mesos-0.29.0/_build/include/mesos>
-I<https://builds.apache.org/job/mesos-reviewbot/ws/mesos-0.29.0/_build/src> -I<https://builds.apache.org/job/mesos-reviewbot/ws/mesos-0.29.0/_build/src/python/scheduler/src/mesos/scheduler>
-I<https://builds.apache.org/job/mesos-reviewbot/ws/mesos-0.29.0/_build/src/python/native_common>
-I<https://builds.apache.org/job/mesos-reviewbot/ws/mesos-0.29.0/_build/3rdparty/libprocess/3rdparty/protobuf-2.5.0/src>
-I/usr/include/python2.7 -c src/mesos/scheduler/proxy_scheduler.cpp -o build/temp.linux-x86_64-2.7/src/mesos/scheduler/proxy_scheduler.o
cc1plus: warning: command line option '-Wstrict-prototypes' is valid for C/ObjC but not for
C++ [enabled by default]
reading manifest file 'src/mesos.interface.egg-info/SOURCES.txt'
writing manifest file 'src/mesos.interface.egg-info/SOURCES.txt'
installing library code to build/bdist.linux-x86_64/egg
running install_lib
running build_py
creating build
creating build/lib.linux-x86_64-2.7
creating build/lib.linux-x86_64-2.7/mesos
copying src/mesos/__init__.py -> build/lib.linux-x86_64-2.7/mesos
creating build/lib.linux-x86_64-2.7/mesos/interface
copying src/mesos/interface/containerizer_pb2.py -> build/lib.linux-x86_64-2.7/mesos/interface
copying src/mesos/interface/__init__.py -> build/lib.linux-x86_64-2.7/mesos/interface
copying src/mesos/interface/mesos_pb2.py -> build/lib.linux-x86_64-2.7/mesos/interface
creating build/bdist.linux-x86_64
creating build/bdist.linux-x86_64/egg
creating build/bdist.linux-x86_64/egg/mesos
creating build/bdist.linux-x86_64/egg/mesos/interface
copying build/lib.linux-x86_64-2.7/mesos/interface/containerizer_pb2.py -> build/bdist.linux-x86_64/egg/mesos/interface
copying build/lib.linux-x86_64-2.7/mesos/interface/__init__.py -> build/bdist.linux-x86_64/egg/mesos/interface
copying build/lib.linux-x86_64-2.7/mesos/interface/mesos_pb2.py -> build/bdist.linux-x86_64/egg/mesos/interface
copying build/lib.linux-x86_64-2.7/mesos/__init__.py -> build/bdist.linux-x86_64/egg/mesos
byte-compiling build/bdist.linux-x86_64/egg/mesos/interface/containerizer_pb2.py to containerizer_pb2.pyc
byte-compiling build/bdist.linux-x86_64/egg/mesos/interface/__init__.py to __init__.pyc
byte-compiling build/bdist.linux-x86_64/egg/mesos/interface/mesos_pb2.py to mesos_pb2.pyc

*** Warning: Linking the shared library libmesos.la against the
*** static library ../3rdparty/leveldb-1.4/libleveldb.a is not portable!
In file included from /usr/include/c++/4.8/mutex:35:0,
                 from <https://builds.apache.org/job/mesos-reviewbot/ws/mesos-0.29.0/_build/../include/mesos/scheduler.hpp>:21,
                 from src/mesos/scheduler/mesos_scheduler_driver_impl.hpp:20,
                 from src/mesos/scheduler/proxy_scheduler.cpp:24:
/usr/include/c++/4.8/bits/c++0x_warning.h:32:2: error: #error This file requires compiler
and library support for the ISO C++ 2011 standard. This support is currently experimental,
and must be enabled with the -std=c++11 or -std=gnu++11 compiler options.
 #error This file requires compiler and library support for the \
  ^
byte-compiling build/bdist.linux-x86_64/egg/mesos/__init__.py to __init__.pyc
creating build/bdist.linux-x86_64/egg/EGG-INFO
copying src/mesos.interface.egg-info/PKG-INFO -> build/bdist.linux-x86_64/egg/EGG-INFO
copying src/mesos.interface.egg-info/SOURCES.txt -> build/bdist.linux-x86_64/egg/EGG-INFO
copying src/mesos.interface.egg-info/dependency_links.txt -> build/bdist.linux-x86_64/egg/EGG-INFO
copying src/mesos.interface.egg-info/namespace_packages.txt -> build/bdist.linux-x86_64/egg/EGG-INFO
copying src/mesos.interface.egg-info/requires.txt -> build/bdist.linux-x86_64/egg/EGG-INFO
copying src/mesos.interface.egg-info/top_level.txt -> build/bdist.linux-x86_64/egg/EGG-INFO
zip_safe flag not set; analyzing archive contents...
mesos.__init__: module references __path__
creating '<https://builds.apache.org/job/mesos-reviewbot/ws/mesos-0.29.0/_build/src/python/dist/mesos.interface-0.29.0-py2.7.egg'>
and adding 'build/bdist.linux-x86_64/egg' to it
removing 'build/bdist.linux-x86_64/egg' (and everything under it)
running bdist_wheel
running build
installing to build/bdist.linux-x86_64/wheel
running install
running install_lib
Skipping installation of build/bdist.linux-x86_64/wheel/mesos/__init__.py (namespace package)
copying mesos/interface/containerizer_pb2.py -> build/bdist.linux-x86_64/wheel/mesos/interface
copying mesos/interface/__init__.py -> build/bdist.linux-x86_64/wheel/mesos/interface
copying mesos/interface/mesos_pb2.py -> build/bdist.linux-x86_64/wheel/mesos/interface
running install_egg_info
Copying src/mesos.interface.egg-info to build/bdist.linux-x86_64/wheel/mesos.interface-0.29.0.egg-info
Installing build/bdist.linux-x86_64/wheel/mesos.interface-0.29.0-nspkg.pth
running install_scripts
creating build/bdist.linux-x86_64/wheel/mesos.interface-0.29.0.dist-info/WHEEL
libtool: link: g++  -fPIC -DPIC -shared -nostdlib /usr/lib/gcc/x86_64-linux-gnu/4.8/../../../x86_64-linux-gnu/crti.o
/usr/lib/gcc/x86_64-linux-gnu/4.8/crtbeginS.o  -Wl,--whole-archive ./.libs/libmesos_no_3rdparty.a
../3rdparty/libprocess/.libs/libprocess.a ./.libs/libjava.a -Wl,--no-whole-archive  <https://builds.apache.org/job/mesos-reviewbot/ws/mesos-0.29.0/_build/3rdparty/libprocess/3rdparty/glog-0.3.3/.libs/libglog.a>
-lpthread <https://builds.apache.org/job/mesos-reviewbot/ws/mesos-0.29.0/_build/3rdparty/libprocess/3rdparty/libev-4.15/.libs/libev.a>
-ldl ../3rdparty/libprocess/3rdparty/glog-0.3.3/.libs/libglog.a ../3rdparty/leveldb-1.4/libleveldb.a
../3rdparty/zookeeper-3.4.5/src/c/.libs/libzookeeper_mt.a ../3rdparty/libprocess/3rdparty/protobuf-2.5.0/src/.libs/libprotobuf.a
-lsasl2 /usr/lib/x86_64-linux-gnu/libsvn_delta-1.so /usr/lib/x86_64-linux-gnu/libsvn_subr-1.so
/usr/lib/x86_64-linux-gnu/libapr-1.so /usr/lib/x86_64-linux-gnu/libcurl.so -lz -lrt -L/usr/lib/gcc/x86_64-linux-gnu/4.8
-L/usr/lib/gcc/x86_64-linux-gnu/4.8/../../../x86_64-linux-gnu -L/usr/lib/gcc/x86_64-linux-gnu/4.8/../../../../lib
-L/lib/x86_64-linux-gnu -L/lib/../lib -L/usr/lib/x86_64-linux-gnu -L/usr/lib/../lib -L/usr/lib/gcc/x86_64-linux-gnu/4.8/../../..
-lstdc++ -lm -lc -lgcc_s /usr/lib/gcc/x86_64-linux-gnu/4.8/crtendS.o /usr/lib/gcc/x86_64-linux-gnu/4.8/../../../x86_64-linux-gnu/crtn.o
 -O0   -pthread -Wl,-soname -Wl,libmesos-0.29.0.so -o .libs/libmesos-0.29.0.so
In file included from src/mesos/executor/mesos_executor_driver_impl.hpp:20:0,
                 from src/mesos/executor/proxy_executor.cpp:24:
<https://builds.apache.org/job/mesos-reviewbot/ws/mesos-0.29.0/_build/../include/mesos/executor.hpp>:242:3:
error: 'recursive_mutex' in namespace 'std' does not name a type
   std::recursive_mutex mutex;
   ^
error: command 'gcc' failed with exit status 1
make[3]: *** [python/dist/mesos.executor-0.29.0-py2.7-linux-x86_64.egg] Error 1
make[3]: *** Waiting for unfinished jobs....
In file included from src/mesos/scheduler/mesos_scheduler_driver_impl.hpp:20:0,
                 from src/mesos/scheduler/proxy_scheduler.cpp:24:
<https://builds.apache.org/job/mesos-reviewbot/ws/mesos-0.29.0/_build/../include/mesos/scheduler.hpp>:438:3:
error: 'shared_ptr' in namespace 'std' does not name a type
   std::shared_ptr<internal::MasterDetector> detector;
   ^
<https://builds.apache.org/job/mesos-reviewbot/ws/mesos-0.29.0/_build/../include/mesos/scheduler.hpp>:454:3:
error: 'recursive_mutex' in namespace 'std' does not name a type
   std::recursive_mutex mutex;
   ^
error: command 'gcc' failed with exit status 1
make[3]: *** [python/dist/mesos.scheduler-0.29.0-py2.7-linux-x86_64.egg] Error 1
libtool: link: (cd ".libs" && rm -f "libmesos.so" && ln -s "libmesos-0.29.0.so"
"libmesos.so")
libtool: link: ( cd ".libs" && rm -f "libmesos.la" && ln -s "../libmesos.la"
"libmesos.la" )
make[3]: Leaving directory `<https://builds.apache.org/job/mesos-reviewbot/ws/mesos-0.29.0/_build/src'>
make[2]: *** [all] Error 2
make[2]: Leaving directory `<https://builds.apache.org/job/mesos-reviewbot/ws/mesos-0.29.0/_build/src'>
make[1]: *** [all-recursive] Error 1
make[1]: Leaving directory `<https://builds.apache.org/job/mesos-reviewbot/ws/mesos-0.29.0/_build'>
make: *** [distcheck] Error 1
Build step 'Execute shell' marked build as failure

Mime
View raw message