mesos-builds mailing list archives

Site index · List index
Message view « Date » · « Thread »
Top « Date » · « Thread »
From Apache Jenkins Server <jenk...@builds.apache.org>
Subject Build failed in Jenkins: Mesos » gcc,--verbose,GLOG_v=1 MESOS_VERBOSE=1,ubuntu:14.04,docker||Hadoop #1634
Date Sat, 06 Feb 2016 04:15:07 GMT
See <https://builds.apache.org/job/Mesos/COMPILER=gcc,CONFIGURATION=--verbose,ENVIRONMENT=GLOG_v=1%20MESOS_VERBOSE=1,OS=ubuntu%3A14.04,label_exp=docker%7C%7CHadoop/1634/changes>

Changes:

[yujie.jay] Modified the cgroup net_cls isolator to use NetClsHandleManager.

------------------------------------------
[...truncated 168633 lines...]
I0206 04:15:07.582831 32537 status_update_manager.cpp:528] Cleaning up status update stream
for task af0e770e-7e95-451c-b4f3-1cf0e8bfdcd0 of framework f690922e-544f-4f6c-ae05-3e364035310d-0000
[       OK ] ContentType/SchedulerTest.Message/1 (621 ms)
[ RUN      ] ContentType/SchedulerTest.Request/0
I0206 04:15:07.718607 32514 leveldb.cpp:174] Opened db in 130.061163ms
I0206 04:15:07.768882 32514 leveldb.cpp:181] Compacted db in 50.183351ms
I0206 04:15:07.768985 32514 leveldb.cpp:196] Created db iterator in 27197ns
I0206 04:15:07.769009 32514 leveldb.cpp:202] Seeked to beginning of db in 3277ns
I0206 04:15:07.769023 32514 leveldb.cpp:271] Iterated through 0 keys in the db in 362ns
I0206 04:15:07.769080 32514 replica.cpp:779] Replica recovered with log positions 0 ->
0 with 1 holes and 0 unlearned
I0206 04:15:07.770159 32548 recover.cpp:447] Starting replica recovery
I0206 04:15:07.770519 32548 recover.cpp:473] Replica is in EMPTY status
I0206 04:15:07.772299 32544 replica.cpp:673] Replica in EMPTY status received a broadcasted
recover request from (14358)@172.17.0.3:34620
I0206 04:15:07.773329 32548 recover.cpp:193] Received a recover response from a replica in
EMPTY status
I0206 04:15:07.774358 32538 recover.cpp:564] Updating replica status to STARTING
I0206 04:15:07.776962 32545 master.cpp:376] Master 901dd994-e81c-4a97-b4bc-1a84498c765f (a1296f6b9d56)
started on 172.17.0.3:34620
I0206 04:15:07.776999 32545 master.cpp:378] Flags at startup: --acls="" --allocation_interval="1secs"
--allocator="HierarchicalDRF" --authenticate="false" --authenticate_http="true" --authenticate_slaves="true"
--authenticators="crammd5" --authorizers="local" --credentials="/tmp/y7RFvE/credentials" --framework_sorter="drf"
--help="false" --hostname_lookup="true" --http_authenticators="basic" --initialize_driver_logging="true"
--log_auto_initialize="true" --logbufsecs="0" --logging_level="INFO" --max_completed_frameworks="50"
--max_completed_tasks_per_framework="1000" --max_slave_ping_timeouts="5" --quiet="false" --recovery_slave_removal_limit="100%"
--registry="replicated_log" --registry_fetch_timeout="1mins" --registry_store_timeout="100secs"
--registry_strict="true" --root_submissions="true" --slave_ping_timeout="15secs" --slave_reregister_timeout="10mins"
--user_sorter="drf" --version="false" --webui_dir="/mesos/mesos-0.28.0/_inst/share/mesos/webui"
--work_dir="/tmp/y7RFvE/master" --zk_session_timeout="10secs"
I0206 04:15:07.777573 32545 master.cpp:425] Master allowing unauthenticated frameworks to
register
I0206 04:15:07.777585 32545 master.cpp:428] Master only allowing authenticated slaves to register
I0206 04:15:07.777595 32545 credentials.hpp:35] Loading credentials for authentication from
'/tmp/y7RFvE/credentials'
I0206 04:15:07.778009 32545 master.cpp:468] Using default 'crammd5' authenticator
I0206 04:15:07.778177 32545 master.cpp:537] Using default 'basic' HTTP authenticator
I0206 04:15:07.778350 32545 master.cpp:571] Authorization enabled
I0206 04:15:07.778625 32534 hierarchical.cpp:144] Initialized hierarchical allocator process
I0206 04:15:07.779247 32534 whitelist_watcher.cpp:77] No whitelist given
I0206 04:15:07.782412 32542 master.cpp:1712] The newly elected leader is master@172.17.0.3:34620
with id 901dd994-e81c-4a97-b4bc-1a84498c765f
I0206 04:15:07.782626 32542 master.cpp:1725] Elected as the leading master!
I0206 04:15:07.782788 32542 master.cpp:1470] Recovering from registrar
I0206 04:15:07.783215 32542 registrar.cpp:307] Recovering registrar
I0206 04:15:07.811322 32546 leveldb.cpp:304] Persisting metadata (8 bytes) to leveldb took
36.660694ms
I0206 04:15:07.811424 32546 replica.cpp:320] Persisted replica status to STARTING
I0206 04:15:07.811815 32546 recover.cpp:473] Replica is in STARTING status
I0206 04:15:07.814189 32543 replica.cpp:673] Replica in STARTING status received a broadcasted
recover request from (14360)@172.17.0.3:34620
I0206 04:15:07.814551 32538 recover.cpp:193] Received a recover response from a replica in
STARTING status
I0206 04:15:07.815286 32538 recover.cpp:564] Updating replica status to VOTING
I0206 04:15:07.853322 32537 leveldb.cpp:304] Persisting metadata (8 bytes) to leveldb took
37.714509ms
I0206 04:15:07.853420 32537 replica.cpp:320] Persisted replica status to VOTING
I0206 04:15:07.853679 32537 recover.cpp:578] Successfully joined the Paxos group
I0206 04:15:07.853900 32537 recover.cpp:462] Recover process terminated
I0206 04:15:07.855065 32537 log.cpp:659] Attempting to start the writer
I0206 04:15:07.857095 32538 replica.cpp:493] Replica received implicit promise request from
(14361)@172.17.0.3:34620 with proposal 1
I0206 04:15:07.894098 32538 leveldb.cpp:304] Persisting metadata (8 bytes) to leveldb took
36.805318ms
I0206 04:15:07.894197 32538 replica.cpp:342] Persisted promised to 1
I0206 04:15:07.895653 32538 coordinator.cpp:238] Coordinator attempting to fill missing positions
I0206 04:15:07.897639 32546 replica.cpp:388] Replica received explicit promise request from
(14362)@172.17.0.3:34620 for position 0 with proposal 2
I0206 04:15:07.936679 32546 leveldb.cpp:341] Persisting action (8 bytes) to leveldb took 38.872107ms
I0206 04:15:07.936776 32546 replica.cpp:712] Persisted action at 0
I0206 04:15:07.938341 32538 replica.cpp:537] Replica received write request for position 0
from (14363)@172.17.0.3:34620
I0206 04:15:07.938428 32538 leveldb.cpp:436] Reading position from leveldb took 42982ns
I0206 04:15:07.970317 32538 leveldb.cpp:341] Persisting action (14 bytes) to leveldb took
31.814958ms
I0206 04:15:07.970412 32538 replica.cpp:712] Persisted action at 0
I0206 04:15:07.971492 32544 replica.cpp:691] Replica received learned notice for position
0 from @0.0.0.0:0
I0206 04:15:07.995164 32544 leveldb.cpp:341] Persisting action (16 bytes) to leveldb took
23.615152ms
I0206 04:15:07.995268 32544 replica.cpp:712] Persisted action at 0
I0206 04:15:07.995304 32544 replica.cpp:697] Replica learned NOP action at position 0
I0206 04:15:08.006350 32547 log.cpp:675] Writer started with ending position 0
I0206 04:15:08.008163 32547 leveldb.cpp:436] Reading position from leveldb took 63748ns
I0206 04:15:08.009717 32547 registrar.cpp:340] Successfully fetched the registry (0B) in 226.356992ms
I0206 04:15:08.010035 32547 registrar.cpp:439] Applied 1 operations in 112555ns; attempting
to update the 'registry'
I0206 04:15:08.011580 32547 log.cpp:683] Attempting to append 170 bytes to the log
I0206 04:15:08.012020 32547 coordinator.cpp:348] Coordinator attempting to write APPEND action
at position 1
I0206 04:15:08.013435 32541 replica.cpp:537] Replica received write request for position 1
from (14364)@172.17.0.3:34620
I0206 04:15:08.037314 32541 leveldb.cpp:341] Persisting action (189 bytes) to leveldb took
23.720628ms
I0206 04:15:08.037407 32541 replica.cpp:712] Persisted action at 1
I0206 04:15:08.038811 32541 replica.cpp:691] Replica received learned notice for position
1 from @0.0.0.0:0
I0206 04:15:08.062211 32541 leveldb.cpp:341] Persisting action (191 bytes) to leveldb took
23.347984ms
I0206 04:15:08.062309 32541 replica.cpp:712] Persisted action at 1
I0206 04:15:08.062341 32541 replica.cpp:697] Replica learned APPEND action at position 1
I0206 04:15:08.064571 32533 registrar.cpp:484] Successfully updated the 'registry' in 54.272768ms
I0206 04:15:08.064898 32547 log.cpp:702] Attempting to truncate the log to 1
I0206 04:15:08.065012 32533 registrar.cpp:370] Successfully recovered registrar
I0206 04:15:08.065506 32547 coordinator.cpp:348] Coordinator attempting to write TRUNCATE
action at position 2
I0206 04:15:08.066515 32547 hierarchical.cpp:171] Skipping recovery of hierarchical allocator:
nothing to recover
I0206 04:15:08.065969 32533 master.cpp:1522] Recovered 0 slaves from the Registry (131B) ;
allowing 10mins for slaves to re-register
I0206 04:15:08.067842 32547 replica.cpp:537] Replica received write request for position 2
from (14365)@172.17.0.3:34620
I0206 04:15:08.092304 32547 leveldb.cpp:341] Persisting action (16 bytes) to leveldb took
23.973146ms
I0206 04:15:08.092396 32547 replica.cpp:712] Persisted action at 2
I0206 04:15:08.093789 32547 replica.cpp:691] Replica received learned notice for position
2 from @0.0.0.0:0
I0206 04:15:08.120635 32547 leveldb.cpp:341] Persisting action (18 bytes) to leveldb took
26.793564ms
I0206 04:15:08.120800 32547 leveldb.cpp:399] Deleting ~1 keys from leveldb took 76581ns
I0206 04:15:08.120826 32547 replica.cpp:712] Persisted action at 2
I0206 04:15:08.120862 32547 replica.cpp:697] Replica learned TRUNCATE action at position 2
I0206 04:15:08.131206 32514 scheduler.cpp:154] Version: 0.28.0
I0206 04:15:08.132498 32538 scheduler.cpp:236] New master detected at master@172.17.0.3:34620
I0206 04:15:08.134646 32546 scheduler.cpp:298] Sending SUBSCRIBE call to master@172.17.0.3:34620
I0206 04:15:08.138147 32542 process.cpp:3141] Handling HTTP event for process 'master' with
path: '/master/api/v1/scheduler'
I0206 04:15:08.138953 32542 http.cpp:503] HTTP POST for /master/api/v1/scheduler from 172.17.0.3:50062
I0206 04:15:08.139305 32542 master.cpp:1974] Received subscription request for HTTP framework
'default'
I0206 04:15:08.139477 32542 master.cpp:1751] Authorizing framework principal 'test-principal'
to receive offers for role '*'
I0206 04:15:08.140328 32542 master.cpp:2065] Subscribing framework 'default' with checkpointing
disabled and capabilities [  ]
I0206 04:15:08.140955 32542 hierarchical.cpp:265] Added framework 901dd994-e81c-4a97-b4bc-1a84498c765f-0000
I0206 04:15:08.141042 32542 hierarchical.cpp:1403] No resources available to allocate!
I0206 04:15:08.141085 32542 hierarchical.cpp:1498] No inverse offers to send out!
I0206 04:15:08.141114 32542 hierarchical.cpp:1096] Performed allocation for 0 slaves in 131781ns
I0206 04:15:08.141307 32540 master.hpp:1658] Sending heartbeat to 901dd994-e81c-4a97-b4bc-1a84498c765f-0000
I0206 04:15:08.144217 32548 scheduler.cpp:457] Enqueuing event SUBSCRIBED received from master@172.17.0.3:34620
I0206 04:15:08.144793 32548 scheduler.cpp:457] Enqueuing event HEARTBEAT received from master@172.17.0.3:34620
I0206 04:15:08.146498 32548 scheduler.cpp:298] Sending REQUEST call to master@172.17.0.3:34620
I0206 04:15:08.147008 32536 master_maintenance_tests.cpp:177] Ignoring HEARTBEAT event
I0206 04:15:08.148743 32541 process.cpp:3141] Handling HTTP event for process 'master' with
path: '/master/api/v1/scheduler'
I0206 04:15:08.149164 32536 http.cpp:503] HTTP POST for /master/api/v1/scheduler from 172.17.0.3:50063
I0206 04:15:08.149294 32536 master.cpp:2719] Processing REQUEST call for framework 901dd994-e81c-4a97-b4bc-1a84498c765f-0000
(default)
I0206 04:15:08.149453 32534 hierarchical.cpp:589] Received resource request from framework
901dd994-e81c-4a97-b4bc-1a84498c765f-0000
I0206 04:15:08.150401 32548 master.cpp:1027] Master terminating
I0206 04:15:08.152338 32546 hierarchical.cpp:326] Removed framework 901dd994-e81c-4a97-b4bc-1a84498c765f-0000
E0206 04:15:08.154515 32546 scheduler.cpp:431] End-Of-File received from master. The master
closed the event stream
[       OK ] ContentType/SchedulerTest.Request/0 (596 ms)
[ RUN      ] ContentType/SchedulerTest.Request/1
I0206 04:15:08.301722 32514 leveldb.cpp:174] Opened db in 115.940994ms
I0206 04:15:08.320974 32514 leveldb.cpp:181] Compacted db in 19.167017ms
I0206 04:15:08.321074 32514 leveldb.cpp:196] Created db iterator in 25507ns
I0206 04:15:08.321097 32514 leveldb.cpp:202] Seeked to beginning of db in 3012ns
I0206 04:15:08.321112 32514 leveldb.cpp:271] Iterated through 0 keys in the db in 420ns
I0206 04:15:08.321169 32514 replica.cpp:779] Replica recovered with log positions 0 ->
0 with 1 holes and 0 unlearned
I0206 04:15:08.322095 32545 recover.cpp:447] Starting replica recovery
I0206 04:15:08.322403 32545 recover.cpp:473] Replica is in EMPTY status
I0206 04:15:08.324281 32538 replica.cpp:673] Replica in EMPTY status received a broadcasted
recover request from (14372)@172.17.0.3:34620
I0206 04:15:08.325141 32537 recover.cpp:193] Received a recover response from a replica in
EMPTY status
I0206 04:15:08.326277 32538 recover.cpp:564] Updating replica status to STARTING
I0206 04:15:08.338328 32543 master.cpp:376] Master 25c72ea7-92cb-41c7-a1aa-cd552106c5b5 (a1296f6b9d56)
started on 172.17.0.3:34620
I0206 04:15:08.338768 32543 master.cpp:378] Flags at startup: --acls="" --allocation_interval="1secs"
--allocator="HierarchicalDRF" --authenticate="false" --authenticate_http="true" --authenticate_slaves="true"
--authenticators="crammd5" --authorizers="local" --credentials="/tmp/ftCPqz/credentials" --framework_sorter="drf"
--help="false" --hostname_lookup="true" --http_authenticators="basic" --initialize_driver_logging="true"
--log_auto_initialize="true" --logbufsecs="0" --logging_level="INFO" --max_completed_frameworks="50"
--max_completed_tasks_per_framework="1000" --max_slave_ping_timeouts="5" --quiet="false" --recovery_slave_removal_limit="100%"
--registry="replicated_log" --registry_fetch_timeout="1mins" --registry_store_timeout="100secs"
--registry_strict="true" --root_submissions="true" --slave_ping_timeout="15secs" --slave_reregister_timeout="10mins"
--user_sorter="drf" --version="false" --webui_dir="/mesos/mesos-0.28.0/_inst/share/mesos/webui"
--work_dir="/tmp/ftCPqz/master" --zk_session_timeout="10secs"
I0206 04:15:08.339481 32543 master.cpp:425] Master allowing unauthenticated frameworks to
register
I0206 04:15:08.339582 32543 master.cpp:428] Master only allowing authenticated slaves to register
I0206 04:15:08.339722 32543 credentials.hpp:35] Loading credentials for authentication from
'/tmp/ftCPqz/credentials'
I0206 04:15:08.340364 32543 master.cpp:468] Using default 'crammd5' authenticator
I0206 04:15:08.340806 32543 master.cpp:537] Using default 'basic' HTTP authenticator
I0206 04:15:08.341373 32543 master.cpp:571] Authorization enabled
I0206 04:15:08.341795 32534 hierarchical.cpp:144] Initialized hierarchical allocator process
I0206 04:15:08.342133 32541 whitelist_watcher.cpp:77] No whitelist given
I0206 04:15:08.349493 32543 master.cpp:1712] The newly elected leader is master@172.17.0.3:34620
with id 25c72ea7-92cb-41c7-a1aa-cd552106c5b5
I0206 04:15:08.349997 32543 master.cpp:1725] Elected as the leading master!
I0206 04:15:08.350095 32543 master.cpp:1470] Recovering from registrar
I0206 04:15:08.350504 32539 registrar.cpp:307] Recovering registrar
I0206 04:15:08.368705 32538 leveldb.cpp:304] Persisting metadata (8 bytes) to leveldb took
38.957768ms
I0206 04:15:08.368994 32538 replica.cpp:320] Persisted replica status to STARTING
I0206 04:15:08.369645 32538 recover.cpp:473] Replica is in STARTING status
I0206 04:15:08.371863 32538 replica.cpp:673] Replica in STARTING status received a broadcasted
recover request from (14375)@172.17.0.3:34620
I0206 04:15:08.372489 32538 recover.cpp:193] Received a recover response from a replica in
STARTING status
I0206 04:15:08.373493 32538 recover.cpp:564] Updating replica status to VOTING
I0206 04:15:08.410468 32538 leveldb.cpp:304] Persisting metadata (8 bytes) to leveldb took
36.537491ms
I0206 04:15:08.410555 32538 replica.cpp:320] Persisted replica status to VOTING
I0206 04:15:08.410784 32538 recover.cpp:578] Successfully joined the Paxos group
I0206 04:15:08.410966 32538 recover.cpp:462] Recover process terminated
I0206 04:15:08.411659 32538 log.cpp:659] Attempting to start the writer
I0206 04:15:08.413594 32540 replica.cpp:493] Replica received implicit promise request from
(14376)@172.17.0.3:34620 with proposal 1
I0206 04:15:08.452244 32540 leveldb.cpp:304] Persisting metadata (8 bytes) to leveldb took
38.48417ms
I0206 04:15:08.452330 32540 replica.cpp:342] Persisted promised to 1
I0206 04:15:08.453568 32540 coordinator.cpp:238] Coordinator attempting to fill missing positions
I0206 04:15:08.455142 32540 replica.cpp:388] Replica received explicit promise request from
(14377)@172.17.0.3:34620 for position 0 with proposal 2
I0206 04:15:08.494051 32540 leveldb.cpp:341] Persisting action (8 bytes) to leveldb took 38.846451ms
I0206 04:15:08.494143 32540 replica.cpp:712] Persisted action at 0
I0206 04:15:08.495862 32540 replica.cpp:537] Replica received write request for position 0
from (14378)@172.17.0.3:34620
I0206 04:15:08.495937 32540 leveldb.cpp:436] Reading position from leveldb took 38398ns
I0206 04:15:08.535823 32540 leveldb.cpp:341] Persisting action (14 bytes) to leveldb took
39.823387ms
I0206 04:15:08.535909 32540 replica.cpp:712] Persisted action at 0
I0206 04:15:08.540762 32547 replica.cpp:691] Replica received learned notice for position
0 from @0.0.0.0:0
I0206 04:15:08.577622 32547 leveldb.cpp:341] Persisting action (16 bytes) to leveldb took
35.852249ms
I0206 04:15:08.577714 32547 replica.cpp:712] Persisted action at 0
I0206 04:15:08.577749 32547 replica.cpp:697] Replica learned NOP action at position 0
I0206 04:15:08.578820 32547 log.cpp:675] Writer started with ending position 0
I0206 04:15:08.580049 32544 leveldb.cpp:436] Reading position from leveldb took 55026ns
I0206 04:15:08.581296 32544 registrar.cpp:340] Successfully fetched the registry (0B) in 230.649856ms
I0206 04:15:08.581434 32544 registrar.cpp:439] Applied 1 operations in 34954ns; attempting
to update the 'registry'
I0206 04:15:08.582190 32544 log.cpp:683] Attempting to append 170 bytes to the log
I0206 04:15:08.582316 32545 coordinator.cpp:348] Coordinator attempting to write APPEND action
at position 1
I0206 04:15:08.583432 32548 replica.cpp:537] Replica received write request for position 1
from (14379)@172.17.0.3:34620
I0206 04:15:08.619406 32548 leveldb.cpp:341] Persisting action (189 bytes) to leveldb took
35.90758ms
I0206 04:15:08.619498 32548 replica.cpp:712] Persisted action at 1
I0206 04:15:08.620841 32548 replica.cpp:691] Replica received learned notice for position
1 from @0.0.0.0:0
I0206 04:15:08.659966 32548 leveldb.cpp:341] Persisting action (191 bytes) to leveldb took
39.070484ms
I0206 04:15:08.660058 32548 replica.cpp:712] Persisted action at 1
I0206 04:15:08.660089 32548 replica.cpp:697] Replica learned APPEND action at position 1
I0206 04:15:08.661902 32545 registrar.cpp:484] Successfully updated the 'registry' in 80.400128ms
I0206 04:15:08.662045 32545 registrar.cpp:370] Successfully recovered registrar
I0206 04:15:08.662308 32545 log.cpp:702] Attempting to truncate the log to 1
I0206 04:15:08.662503 32545 coordinator.cpp:348] Coordinator attempting to write TRUNCATE
action at position 2
I0206 04:15:08.662590 32548 master.cpp:1522] Recovered 0 slaves from the Registry (131B) ;
allowing 10mins for slaves to re-register
I0206 04:15:08.662778 32548 hierarchical.cpp:171] Skipping recovery of hierarchical allocator:
nothing to recover
I0206 04:15:08.663667 32537 replica.cpp:537] Replica received write request for position 2
from (14380)@172.17.0.3:34620
I0206 04:15:08.693414 32537 leveldb.cpp:341] Persisting action (16 bytes) to leveldb took
29.589007ms
I0206 04:15:08.693511 32537 replica.cpp:712] Persisted action at 2
I0206 04:15:08.694702 32536 replica.cpp:691] Replica received learned notice for position
2 from @0.0.0.0:0
I0206 04:15:08.718515 32536 leveldb.cpp:341] Persisting action (18 bytes) to leveldb took
23.759991ms
I0206 04:15:08.718682 32536 leveldb.cpp:399] Deleting ~1 keys from leveldb took 78594ns
I0206 04:15:08.718708 32536 replica.cpp:712] Persisted action at 2
I0206 04:15:08.718742 32536 replica.cpp:697] Replica learned TRUNCATE action at position 2
I0206 04:15:08.727103 32514 scheduler.cpp:154] Version: 0.28.0
I0206 04:15:08.727928 32533 scheduler.cpp:236] New master detected at master@172.17.0.3:34620
I0206 04:15:08.730190 32533 scheduler.cpp:298] Sending SUBSCRIBE call to master@172.17.0.3:34620
I0206 04:15:08.733832 32534 process.cpp:3141] Handling HTTP event for process 'master' with
path: '/master/api/v1/scheduler'
I0206 04:15:08.734414 32534 http.cpp:503] HTTP POST for /master/api/v1/scheduler from 172.17.0.3:50064
I0206 04:15:08.734828 32534 master.cpp:1974] Received subscription request for HTTP framework
'default'
I0206 04:15:08.734894 32534 master.cpp:1751] Authorizing framework principal 'test-principal'
to receive offers for role '*'
I0206 04:15:08.735561 32534 master.cpp:2065] Subscribing framework 'default' with checkpointing
disabled and capabilities [  ]
I0206 04:15:08.736810 32534 hierarchical.cpp:265] Added framework 25c72ea7-92cb-41c7-a1aa-cd552106c5b5-0000
I0206 04:15:08.736949 32534 hierarchical.cpp:1403] No resources available to allocate!
I0206 04:15:08.737056 32534 hierarchical.cpp:1498] No inverse offers to send out!
I0206 04:15:08.737172 32534 hierarchical.cpp:1096] Performed allocation for 0 slaves in 278012ns
I0206 04:15:08.737498 32534 master.hpp:1658] Sending heartbeat to 25c72ea7-92cb-41c7-a1aa-cd552106c5b5-0000
I0206 04:15:08.738862 32534 scheduler.cpp:457] Enqueuing event SUBSCRIBED received from master@172.17.0.3:34620
I0206 04:15:08.739805 32534 scheduler.cpp:457] Enqueuing event HEARTBEAT received from master@172.17.0.3:34620
I0206 04:15:08.740701 32534 master_maintenance_tests.cpp:177] Ignoring HEARTBEAT event
I0206 04:15:08.741318 32537 scheduler.cpp:298] Sending REQUEST call to master@172.17.0.3:34620
I0206 04:15:08.743635 32538 process.cpp:3141] Handling HTTP event for process 'master' with
path: '/master/api/v1/scheduler'
I0206 04:15:08.744276 32538 http.cpp:503] HTTP POST for /master/api/v1/scheduler from 172.17.0.3:50065
I0206 04:15:08.744585 32538 master.cpp:2719] Processing REQUEST call for framework 25c72ea7-92cb-41c7-a1aa-cd552106c5b5-0000
(default)
I0206 04:15:08.744886 32538 hierarchical.cpp:589] Received resource request from framework
25c72ea7-92cb-41c7-a1aa-cd552106c5b5-0000
I0206 04:15:08.745664 32514 master.cpp:1027] Master terminating
I0206 04:15:08.745916 32537 hierarchical.cpp:326] Removed framework 25c72ea7-92cb-41c7-a1aa-cd552106c5b5-0000
E0206 04:15:08.754537 32546 scheduler.cpp:431] End-Of-File received from master. The master
closed the event stream
[       OK ] ContentType/SchedulerTest.Request/1 (606 ms)
[----------] 22 tests from ContentType/SchedulerTest (16752 ms total)

[----------] Global test environment tear-down
[==========] 968 tests from 126 test cases ran. (779348 ms total)
[  PASSED  ] 967 tests.
[  FAILED  ] 1 test, listed below:
[  FAILED  ] ContainerLoggerTest.DefaultToSandbox

 1 FAILED TEST
  YOU HAVE 8 DISABLED TESTS

make[4]: *** [check-local] Error 1
make[4]: Leaving directory `/mesos/mesos-0.28.0/_build/src'
make[3]: Leaving directory `/mesos/mesos-0.28.0/_build/src'
make[3]: *** [check-am] Error 2
make[2]: Leaving directory `/mesos/mesos-0.28.0/_build/src'
make[2]: *** [check] Error 2
make[1]: *** [check-recursive] Error 1
make[1]: Leaving directory `/mesos/mesos-0.28.0/_build'
make: *** [distcheck] Error 1
+ docker rmi mesos-1454728908-15600
Untagged: mesos-1454728908-15600:latest
Deleted: cf5edd14c1815b0ef0380a6d9476c18fc33db4c0b039ea13291b5dc46544d057
Deleted: 7a9f405e2dffdd0149e28b156fe5db0039a9a5161938a38b1f33bb6765363d05
Deleted: 02727b882e37c4ebfea017d62483e2144f7d5f2fb1a45406ae390cb0da603a9e
Deleted: c9986935da18cb55cd870eafa6358d5ba74001efcc4d63672662b3f695433c03
Deleted: 6b3db2df3faa73abac69452e7b51489f878986f3cf41ce132098cd06de7dab1b
Deleted: 6495c172b256f4f85d1df3ce3451acc0823ad01f6139f7e5b77aa8551aed4146
Deleted: e6c538d925e3954e68ae1df22ce9bb377503494fee34fc974fa374a727e541c3
Deleted: c728707e36a7fcd7b9423531849f72b6e5d43f83f28769520a15c53f90d22172
Deleted: 3485daa8a8c946ba9f3564a9ec504789ef32a82e74e5b84f366225721d35296a
Deleted: ade6412afaf5ef47b5f1264a6801b2c4b9b9125530588fbf299779388c49a40f
Deleted: 0804d7bd355e5b26b0feceba3282d8d8548522219345f22d9a226f64a682b126
Deleted: d9eb731d8f973e6af3dc89dd697ec4c5bfa9a1e1baec5478315cb9cf17ebcc78
Deleted: 1e6fed9d8b6116b80a0773d208e32b70b7abb4191da90eefa517f0abf7508ea9
Deleted: f966762f3ac6f2b33642f794ed37da07d6e567799a613bbebea6f348eb590f16
Deleted: 6fc3a7a16480d027279e943141d0bf86f1a881d888b0342437b370f549ba49ba
Deleted: 5827b714fd7feb01d28e561446966348a39dee71ee0ebb53f5b5cfcca2bc64ff
Build step 'Execute shell' marked build as failure

Mime
View raw message