mesos-builds mailing list archives

Site index · List index
Message view « Date » · « Thread »
Top « Date » · « Thread »
From Apache Jenkins Server <jenk...@builds.apache.org>
Subject Build failed in Jenkins: Mesos » gcc,--verbose,GLOG_v=1 MESOS_VERBOSE=1,ubuntu:14.04,(docker||Hadoop)&&(!ubuntu-us1) #1724
Date Fri, 26 Feb 2016 01:29:16 GMT
See <https://builds.apache.org/job/Mesos/COMPILER=gcc,CONFIGURATION=--verbose,ENVIRONMENT=GLOG_v=1%20MESOS_VERBOSE=1,OS=ubuntu%3A14.04,label_exp=(docker%7C%7CHadoop)&&(!ubuntu-us1)/1724/changes>

Changes:

[mpark] Windows: Added support for dynamic library loading.

[mpark] Windows: Added dynamic library loading tests to build.

------------------------------------------
[...truncated 16274 lines...]
g++ -DPACKAGE_NAME=\"mesos\" -DPACKAGE_TARNAME=\"mesos\" -DPACKAGE_VERSION=\"0.28.0\" -DPACKAGE_STRING=\"mesos\
0.28.0\" -DPACKAGE_BUGREPORT=\"\" -DPACKAGE_URL=\"\" -DPACKAGE=\"mesos\" -DVERSION=\"0.28.0\"
-DSTDC_HEADERS=1 -DHAVE_SYS_TYPES_H=1 -DHAVE_SYS_STAT_H=1 -DHAVE_STDLIB_H=1 -DHAVE_STRING_H=1
-DHAVE_MEMORY_H=1 -DHAVE_STRINGS_H=1 -DHAVE_INTTYPES_H=1 -DHAVE_STDINT_H=1 -DHAVE_UNISTD_H=1
-DHAVE_DLFCN_H=1 -DLT_OBJDIR=\".libs/\" -DHAVE_PTHREAD_PRIO_INHERIT=1 -DHAVE_PTHREAD=1 -DHAVE_LIBZ=1
-DHAVE_LIBCURL=1 -DHAVE_APR_POOLS_H=1 -DHAVE_LIBAPR_1=1 -DHAVE_SVN_VERSION_H=1 -DHAVE_LIBSVN_SUBR_1=1
-DHAVE_SVN_DELTA_H=1 -DHAVE_LIBSVN_DELTA_1=1 -DHAVE_LIBSASL2=1 -DMESOS_HAS_JAVA=1 -DHAVE_PYTHON=\"2.7\"
-DMESOS_HAS_PYTHON=1 -I. -I../../src   -Wall -Werror -DLIBDIR=\"/mesos/mesos-0.28.0/_inst/lib\"
-DPKGLIBEXECDIR=\"/mesos/mesos-0.28.0/_inst/libexec/mesos\" -DPKGDATADIR=\"/mesos/mesos-0.28.0/_inst/share/mesos\"
-DPKGMODULEDIR=\"/mesos/mesos-0.28.0/_inst/lib/mesos/modules\" -I../../include -I../../3rdparty/libprocess/include
-I../../3rdparty/libprocess/3rdparty/stout/include -I../include -I../include/mesos -isystem
../3rdparty/libprocess/3rdparty/boost-1.53.0 -I../3rdparty/libprocess/3rdparty/picojson-1.3.0
-DPICOJSON_USE_INT64 -D__STDC_FORMAT_MACROS -I../3rdparty/libprocess/3rdparty/protobuf-2.5.0/src
-I../3rdparty/libprocess/3rdparty/glog-0.3.3/src -I../3rdparty/libprocess/3rdparty/glog-0.3.3/src
-I../3rdparty/leveldb/include -I../3rdparty/zookeeper-3.4.5/src/c/include -I../3rdparty/zookeeper-3.4.5/src/c/generated
-I../3rdparty/libprocess/3rdparty/protobuf-2.5.0/src -I/usr/include/subversion-1 -I/usr/include/apr-1
-I/usr/include/apr-1.0  -pthread -g1 -O0 -Wno-unused-local-typedefs -std=c++11 -MT docker/mesos_docker_executor-executor.o
-MD -MP -MF docker/.deps/mesos_docker_executor-executor.Tpo -c -o docker/mesos_docker_executor-executor.o
`test -f 'docker/executor.cpp' || echo '../../src/'`docker/executor.cpp
mv -f slave/containerizer/mesos/.deps/libmesos_no_3rdparty_la-linux_launcher.Tpo slave/containerizer/mesos/.deps/libmesos_no_3rdparty_la-linux_launcher.Plo
g++ -DPACKAGE_NAME=\"mesos\" -DPACKAGE_TARNAME=\"mesos\" -DPACKAGE_VERSION=\"0.28.0\" -DPACKAGE_STRING=\"mesos\
0.28.0\" -DPACKAGE_BUGREPORT=\"\" -DPACKAGE_URL=\"\" -DPACKAGE=\"mesos\" -DVERSION=\"0.28.0\"
-DSTDC_HEADERS=1 -DHAVE_SYS_TYPES_H=1 -DHAVE_SYS_STAT_H=1 -DHAVE_STDLIB_H=1 -DHAVE_STRING_H=1
-DHAVE_MEMORY_H=1 -DHAVE_STRINGS_H=1 -DHAVE_INTTYPES_H=1 -DHAVE_STDINT_H=1 -DHAVE_UNISTD_H=1
-DHAVE_DLFCN_H=1 -DLT_OBJDIR=\".libs/\" -DHAVE_PTHREAD_PRIO_INHERIT=1 -DHAVE_PTHREAD=1 -DHAVE_LIBZ=1
-DHAVE_LIBCURL=1 -DHAVE_APR_POOLS_H=1 -DHAVE_LIBAPR_1=1 -DHAVE_SVN_VERSION_H=1 -DHAVE_LIBSVN_SUBR_1=1
-DHAVE_SVN_DELTA_H=1 -DHAVE_LIBSVN_DELTA_1=1 -DHAVE_LIBSASL2=1 -DMESOS_HAS_JAVA=1 -DHAVE_PYTHON=\"2.7\"
-DMESOS_HAS_PYTHON=1 -I. -I../../src   -Wall -Werror -DLIBDIR=\"/mesos/mesos-0.28.0/_inst/lib\"
-DPKGLIBEXECDIR=\"/mesos/mesos-0.28.0/_inst/libexec/mesos\" -DPKGDATADIR=\"/mesos/mesos-0.28.0/_inst/share/mesos\"
-DPKGMODULEDIR=\"/mesos/mesos-0.28.0/_inst/lib/mesos/modules\" -I../../include -I../../3rdparty/libprocess/include
-I../../3rdparty/libprocess/3rdparty/stout/include -I../include -I../include/mesos -isystem
../3rdparty/libprocess/3rdparty/boost-1.53.0 -I../3rdparty/libprocess/3rdparty/picojson-1.3.0
-DPICOJSON_USE_INT64 -D__STDC_FORMAT_MACROS -I../3rdparty/libprocess/3rdparty/protobuf-2.5.0/src
-I../3rdparty/libprocess/3rdparty/glog-0.3.3/src -I../3rdparty/libprocess/3rdparty/glog-0.3.3/src
-I../3rdparty/leveldb/include -I../3rdparty/zookeeper-3.4.5/src/c/include -I../3rdparty/zookeeper-3.4.5/src/c/generated
-I../3rdparty/libprocess/3rdparty/protobuf-2.5.0/src -I/usr/include/subversion-1 -I/usr/include/apr-1
-I/usr/include/apr-1.0  -pthread -g1 -O0 -Wno-unused-local-typedefs -std=c++11 -MT master/mesos_master-main.o
-MD -MP -MF master/.deps/mesos_master-main.Tpo -c -o master/mesos_master-main.o `test -f 'master/main.cpp'
|| echo '../../src/'`master/main.cpp
mv -f log/.deps/mesos_log-main.Tpo log/.deps/mesos_log-main.Po
g++ -DPACKAGE_NAME=\"mesos\" -DPACKAGE_TARNAME=\"mesos\" -DPACKAGE_VERSION=\"0.28.0\" -DPACKAGE_STRING=\"mesos\
0.28.0\" -DPACKAGE_BUGREPORT=\"\" -DPACKAGE_URL=\"\" -DPACKAGE=\"mesos\" -DVERSION=\"0.28.0\"
-DSTDC_HEADERS=1 -DHAVE_SYS_TYPES_H=1 -DHAVE_SYS_STAT_H=1 -DHAVE_STDLIB_H=1 -DHAVE_STRING_H=1
-DHAVE_MEMORY_H=1 -DHAVE_STRINGS_H=1 -DHAVE_INTTYPES_H=1 -DHAVE_STDINT_H=1 -DHAVE_UNISTD_H=1
-DHAVE_DLFCN_H=1 -DLT_OBJDIR=\".libs/\" -DHAVE_PTHREAD_PRIO_INHERIT=1 -DHAVE_PTHREAD=1 -DHAVE_LIBZ=1
-DHAVE_LIBCURL=1 -DHAVE_APR_POOLS_H=1 -DHAVE_LIBAPR_1=1 -DHAVE_SVN_VERSION_H=1 -DHAVE_LIBSVN_SUBR_1=1
-DHAVE_SVN_DELTA_H=1 -DHAVE_LIBSVN_DELTA_1=1 -DHAVE_LIBSASL2=1 -DMESOS_HAS_JAVA=1 -DHAVE_PYTHON=\"2.7\"
-DMESOS_HAS_PYTHON=1 -I. -I../../src   -Wall -Werror -DLIBDIR=\"/mesos/mesos-0.28.0/_inst/lib\"
-DPKGLIBEXECDIR=\"/mesos/mesos-0.28.0/_inst/libexec/mesos\" -DPKGDATADIR=\"/mesos/mesos-0.28.0/_inst/share/mesos\"
-DPKGMODULEDIR=\"/mesos/mesos-0.28.0/_inst/lib/mesos/modules\" -I../../include -I../../3rdparty/libprocess/include
-I../../3rdparty/libprocess/3rdparty/stout/include -I../include -I../include/mesos -isystem
../3rdparty/libprocess/3rdparty/boost-1.53.0 -I../3rdparty/libprocess/3rdparty/picojson-1.3.0
-DPICOJSON_USE_INT64 -D__STDC_FORMAT_MACROS -I../3rdparty/libprocess/3rdparty/protobuf-2.5.0/src
-I../3rdparty/libprocess/3rdparty/glog-0.3.3/src -I../3rdparty/libprocess/3rdparty/glog-0.3.3/src
-I../3rdparty/leveldb/include -I../3rdparty/zookeeper-3.4.5/src/c/include -I../3rdparty/zookeeper-3.4.5/src/c/generated
-I../3rdparty/libprocess/3rdparty/protobuf-2.5.0/src -I/usr/include/subversion-1 -I/usr/include/apr-1
-I/usr/include/apr-1.0  -pthread -g1 -O0 -Wno-unused-local-typedefs -std=c++11 -MT slave/mesos_slave-main.o
-MD -MP -MF slave/.deps/mesos_slave-main.Tpo -c -o slave/mesos_slave-main.o `test -f 'slave/main.cpp'
|| echo '../../src/'`slave/main.cpp
mv -f slave/containerizer/mesos/.deps/mesos_containerizer-main.Tpo slave/containerizer/mesos/.deps/mesos_containerizer-main.Po
test "../.." = ".." ||			\
		(/bin/mkdir -p python/cli/src/mesos && cp -pf ../../src/python/cli/src/mesos/__init__.py
python/cli/src/mesos/__init__.py)
test "../.." = ".." ||			\
		(/bin/mkdir -p python/cli/src/mesos && cp -pf ../../src/python/cli/src/mesos/cli.py
python/cli/src/mesos/cli.py)
test "../.." = ".." ||			\
		(/bin/mkdir -p python/cli/src/mesos && cp -pf ../../src/python/cli/src/mesos/futures.py
python/cli/src/mesos/futures.py)
test "../.." = ".." ||			\
		(/bin/mkdir -p python/cli/src/mesos && cp -pf ../../src/python/cli/src/mesos/http.py
python/cli/src/mesos/http.py)
In file included from ../../src/module/manager.hpp:35:0,
                 from ../../src/master/main.cpp:66:
../../3rdparty/libprocess/3rdparty/stout/include/stout/dynamiclibrary.hpp:21:42: fatal error:
stout/posix/dynamiclibrary.hpp: No such file or directory
 #include <stout/posix/dynamiclibrary.hpp>
                                          ^
compilation terminated.
test "../.." = ".." ||			\
		(/bin/mkdir -p python/interface/src/mesos && cp -pf ../../src/python/interface/src/mesos/__init__.py
python/interface/src/mesos/__init__.py)
test "../.." = ".." ||			\
		(/bin/mkdir -p python/interface/src/mesos/interface && cp -pf ../../src/python/interface/src/mesos/interface/__init__.py
python/interface/src/mesos/interface/__init__.py)
test "../.." = ".." ||			\
		(/bin/mkdir -p python/interface/src/mesos/v1 && cp -pf ../../src/python/interface/src/mesos/v1/__init__.py
python/interface/src/mesos/v1/__init__.py)
test "../.." = ".." ||			\
		(/bin/mkdir -p python/interface/src/mesos/v1/interface && cp -pf ../../src/python/interface/src/mesos/v1/interface/__init__.py
python/interface/src/mesos/v1/interface/__init__.py)
test "../.." = ".." ||			\
		(/bin/mkdir -p python/native/src/mesos && cp -pf ../../src/python/native/src/mesos/__init__.py
python/native/src/mesos/__init__.py)
test "../.." = ".." ||			\
		(/bin/mkdir -p python/native/src/mesos/native && cp -pf ../../src/python/native/src/mesos/native/__init__.py
python/native/src/mesos/native/__init__.py)
test "../.." = ".." ||			\
		(/bin/mkdir -p python/native/src/mesos/native && cp -pf ../../src/python/native/src/mesos/native/mesos_executor_driver_impl.cpp
python/native/src/mesos/native/mesos_executor_driver_impl.cpp)
test "../.." = ".." ||			\
		(/bin/mkdir -p python/native/src/mesos/native && cp -pf ../../src/python/native/src/mesos/native/mesos_executor_driver_impl.hpp
python/native/src/mesos/native/mesos_executor_driver_impl.hpp)
test "../.." = ".." ||			\
		(/bin/mkdir -p python/native/src/mesos/native && cp -pf ../../src/python/native/src/mesos/native/mesos_scheduler_driver_impl.cpp
python/native/src/mesos/native/mesos_scheduler_driver_impl.cpp)
test "../.." = ".." ||			\
		(/bin/mkdir -p python/native/src/mesos/native && cp -pf ../../src/python/native/src/mesos/native/mesos_scheduler_driver_impl.hpp
python/native/src/mesos/native/mesos_scheduler_driver_impl.hpp)
test "../.." = ".." ||			\
		(/bin/mkdir -p python/native/src/mesos/native && cp -pf ../../src/python/native/src/mesos/native/module.cpp
python/native/src/mesos/native/module.cpp)
test "../.." = ".." ||			\
		(/bin/mkdir -p python/native/src/mesos/native && cp -pf ../../src/python/native/src/mesos/native/module.hpp
python/native/src/mesos/native/module.hpp)
test "../.." = ".." ||			\
		(/bin/mkdir -p python/native/src/mesos/native && cp -pf ../../src/python/native/src/mesos/native/proxy_executor.cpp
python/native/src/mesos/native/proxy_executor.cpp)
test "../.." = ".." ||			\
		(/bin/mkdir -p python/native/src/mesos/native && cp -pf ../../src/python/native/src/mesos/native/proxy_executor.hpp
python/native/src/mesos/native/proxy_executor.hpp)
test "../.." = ".." ||			\
		(/bin/mkdir -p python/native/src/mesos/native && cp -pf ../../src/python/native/src/mesos/native/proxy_scheduler.cpp
python/native/src/mesos/native/proxy_scheduler.cpp)
test "../.." = ".." ||			\
		(/bin/mkdir -p python/native/src/mesos/native && cp -pf ../../src/python/native/src/mesos/native/proxy_scheduler.hpp
python/native/src/mesos/native/proxy_scheduler.hpp)
test "../.." = ".." ||			\
		(/bin/mkdir -p python/src/mesos && cp -pf ../../src/python/src/mesos/__init__.py
python/src/mesos/__init__.py)
Building protobuf Python egg ...
cd ../3rdparty/libprocess/3rdparty/protobuf-2.5.0/python &&			\
	  CC="gcc"					\
	  CXX="g++"					\
	  CFLAGS="-g1 -O0 -Wno-unused-local-typedefs"				\
	  CXXFLAGS="-g1 -O0 -Wno-unused-local-typedefs -std=c++11"			\
	  PYTHONPATH=/mesos/mesos-0.28.0/_build/3rdparty/distribute-0.6.26	\
	  /usr/bin/python setup.py build bdist_egg
In file included from ../../src/module/manager.hpp:35:0,
                 from ../../src/slave/main.cpp:53:
../../3rdparty/libprocess/3rdparty/stout/include/stout/dynamiclibrary.hpp:21:42: fatal error:
stout/posix/dynamiclibrary.hpp: No such file or directory
 #include <stout/posix/dynamiclibrary.hpp>
                                          ^
compilation terminated.
running build
running build_py
Generating google/protobuf/descriptor_pb2.py...
Generating google/protobuf/compiler/plugin_pb2.py...
Generating google/protobuf/unittest_pb2.py...
Generating google/protobuf/unittest_custom_options_pb2.py...
Generating google/protobuf/unittest_import_pb2.py...
Generating google/protobuf/unittest_import_public_pb2.py...
Generating google/protobuf/unittest_mset_pb2.py...
Generating google/protobuf/unittest_no_generic_services_pb2.py...
Generating google/protobuf/internal/test_bad_identifiers_pb2.py...
Generating google/protobuf/internal/more_extensions_pb2.py...
Generating google/protobuf/internal/more_extensions_dynamic_pb2.py...
Generating google/protobuf/internal/more_messages_pb2.py...
Generating google/protobuf/internal/factory_test1_pb2.py...
Generating google/protobuf/internal/factory_test2_pb2.py...
creating build
creating build/lib.linux-x86_64-2.7
creating build/lib.linux-x86_64-2.7/google
creating build/lib.linux-x86_64-2.7/google/protobuf
creating build/lib.linux-x86_64-2.7/google/protobuf/internal
copying google/protobuf/internal/__init__.py -> build/lib.linux-x86_64-2.7/google/protobuf/internal
copying google/protobuf/internal/api_implementation.py -> build/lib.linux-x86_64-2.7/google/protobuf/internal
copying google/protobuf/internal/containers.py -> build/lib.linux-x86_64-2.7/google/protobuf/internal
copying google/protobuf/internal/cpp_message.py -> build/lib.linux-x86_64-2.7/google/protobuf/internal
copying google/protobuf/internal/decoder.py -> build/lib.linux-x86_64-2.7/google/protobuf/internal
copying google/protobuf/internal/encoder.py -> build/lib.linux-x86_64-2.7/google/protobuf/internal
copying google/protobuf/internal/enum_type_wrapper.py -> build/lib.linux-x86_64-2.7/google/protobuf/internal
copying google/protobuf/internal/message_listener.py -> build/lib.linux-x86_64-2.7/google/protobuf/internal
copying google/protobuf/internal/python_message.py -> build/lib.linux-x86_64-2.7/google/protobuf/internal
copying google/protobuf/internal/type_checkers.py -> build/lib.linux-x86_64-2.7/google/protobuf/internal
copying google/protobuf/internal/wire_format.py -> build/lib.linux-x86_64-2.7/google/protobuf/internal
copying google/protobuf/__init__.py -> build/lib.linux-x86_64-2.7/google/protobuf
copying google/protobuf/descriptor.py -> build/lib.linux-x86_64-2.7/google/protobuf
copying google/protobuf/descriptor_pb2.py -> build/lib.linux-x86_64-2.7/google/protobuf
creating build/lib.linux-x86_64-2.7/google/protobuf/compiler
copying google/protobuf/compiler/__init__.py -> build/lib.linux-x86_64-2.7/google/protobuf/compiler
copying google/protobuf/compiler/plugin_pb2.py -> build/lib.linux-x86_64-2.7/google/protobuf/compiler
copying google/protobuf/message.py -> build/lib.linux-x86_64-2.7/google/protobuf
copying google/protobuf/descriptor_database.py -> build/lib.linux-x86_64-2.7/google/protobuf
copying google/protobuf/descriptor_pool.py -> build/lib.linux-x86_64-2.7/google/protobuf
copying google/protobuf/message_factory.py -> build/lib.linux-x86_64-2.7/google/protobuf
copying google/protobuf/reflection.py -> build/lib.linux-x86_64-2.7/google/protobuf
copying google/protobuf/service.py -> build/lib.linux-x86_64-2.7/google/protobuf
copying google/protobuf/service_reflection.py -> build/lib.linux-x86_64-2.7/google/protobuf
copying google/protobuf/text_format.py -> build/lib.linux-x86_64-2.7/google/protobuf
copying google/__init__.py -> build/lib.linux-x86_64-2.7/google
running bdist_egg
running egg_info
creating protobuf.egg-info
writing requirements to protobuf.egg-info/requires.txt
writing protobuf.egg-info/PKG-INFO
writing namespace_packages to protobuf.egg-info/namespace_packages.txt
writing top-level names to protobuf.egg-info/top_level.txt
writing dependency_links to protobuf.egg-info/dependency_links.txt
writing manifest file 'protobuf.egg-info/SOURCES.txt'
reading manifest file 'protobuf.egg-info/SOURCES.txt'
writing manifest file 'protobuf.egg-info/SOURCES.txt'
installing library code to build/bdist.linux-x86_64/egg
running install_lib
creating build/bdist.linux-x86_64
creating build/bdist.linux-x86_64/egg
creating build/bdist.linux-x86_64/egg/google
copying build/lib.linux-x86_64-2.7/google/__init__.py -> build/bdist.linux-x86_64/egg/google
creating build/bdist.linux-x86_64/egg/google/protobuf
copying build/lib.linux-x86_64-2.7/google/protobuf/message_factory.py -> build/bdist.linux-x86_64/egg/google/protobuf
copying build/lib.linux-x86_64-2.7/google/protobuf/descriptor_pb2.py -> build/bdist.linux-x86_64/egg/google/protobuf
copying build/lib.linux-x86_64-2.7/google/protobuf/text_format.py -> build/bdist.linux-x86_64/egg/google/protobuf
copying build/lib.linux-x86_64-2.7/google/protobuf/service.py -> build/bdist.linux-x86_64/egg/google/protobuf
copying build/lib.linux-x86_64-2.7/google/protobuf/descriptor.py -> build/bdist.linux-x86_64/egg/google/protobuf
copying build/lib.linux-x86_64-2.7/google/protobuf/reflection.py -> build/bdist.linux-x86_64/egg/google/protobuf
copying build/lib.linux-x86_64-2.7/google/protobuf/service_reflection.py -> build/bdist.linux-x86_64/egg/google/protobuf
creating build/bdist.linux-x86_64/egg/google/protobuf/compiler
copying build/lib.linux-x86_64-2.7/google/protobuf/compiler/__init__.py -> build/bdist.linux-x86_64/egg/google/protobuf/compiler
copying build/lib.linux-x86_64-2.7/google/protobuf/compiler/plugin_pb2.py -> build/bdist.linux-x86_64/egg/google/protobuf/compiler
creating build/bdist.linux-x86_64/egg/google/protobuf/internal
copying build/lib.linux-x86_64-2.7/google/protobuf/internal/encoder.py -> build/bdist.linux-x86_64/egg/google/protobuf/internal
copying build/lib.linux-x86_64-2.7/google/protobuf/internal/type_checkers.py -> build/bdist.linux-x86_64/egg/google/protobuf/internal
copying build/lib.linux-x86_64-2.7/google/protobuf/internal/enum_type_wrapper.py -> build/bdist.linux-x86_64/egg/google/protobuf/internal
copying build/lib.linux-x86_64-2.7/google/protobuf/internal/decoder.py -> build/bdist.linux-x86_64/egg/google/protobuf/internal
copying build/lib.linux-x86_64-2.7/google/protobuf/internal/wire_format.py -> build/bdist.linux-x86_64/egg/google/protobuf/internal
copying build/lib.linux-x86_64-2.7/google/protobuf/internal/message_listener.py -> build/bdist.linux-x86_64/egg/google/protobuf/internal
copying build/lib.linux-x86_64-2.7/google/protobuf/internal/python_message.py -> build/bdist.linux-x86_64/egg/google/protobuf/internal
copying build/lib.linux-x86_64-2.7/google/protobuf/internal/__init__.py -> build/bdist.linux-x86_64/egg/google/protobuf/internal
copying build/lib.linux-x86_64-2.7/google/protobuf/internal/containers.py -> build/bdist.linux-x86_64/egg/google/protobuf/internal
copying build/lib.linux-x86_64-2.7/google/protobuf/internal/api_implementation.py -> build/bdist.linux-x86_64/egg/google/protobuf/internal
copying build/lib.linux-x86_64-2.7/google/protobuf/internal/cpp_message.py -> build/bdist.linux-x86_64/egg/google/protobuf/internal
copying build/lib.linux-x86_64-2.7/google/protobuf/__init__.py -> build/bdist.linux-x86_64/egg/google/protobuf
copying build/lib.linux-x86_64-2.7/google/protobuf/descriptor_pool.py -> build/bdist.linux-x86_64/egg/google/protobuf
copying build/lib.linux-x86_64-2.7/google/protobuf/message.py -> build/bdist.linux-x86_64/egg/google/protobuf
copying build/lib.linux-x86_64-2.7/google/protobuf/descriptor_database.py -> build/bdist.linux-x86_64/egg/google/protobuf
byte-compiling build/bdist.linux-x86_64/egg/google/__init__.py to __init__.pyc
byte-compiling build/bdist.linux-x86_64/egg/google/protobuf/message_factory.py to message_factory.pyc
byte-compiling build/bdist.linux-x86_64/egg/google/protobuf/descriptor_pb2.py to descriptor_pb2.pyc
byte-compiling build/bdist.linux-x86_64/egg/google/protobuf/text_format.py to text_format.pyc
byte-compiling build/bdist.linux-x86_64/egg/google/protobuf/service.py to service.pyc
byte-compiling build/bdist.linux-x86_64/egg/google/protobuf/descriptor.py to descriptor.pyc
byte-compiling build/bdist.linux-x86_64/egg/google/protobuf/reflection.py to reflection.pyc
byte-compiling build/bdist.linux-x86_64/egg/google/protobuf/service_reflection.py to service_reflection.pyc
byte-compiling build/bdist.linux-x86_64/egg/google/protobuf/compiler/__init__.py to __init__.pyc
byte-compiling build/bdist.linux-x86_64/egg/google/protobuf/compiler/plugin_pb2.py to plugin_pb2.pyc
byte-compiling build/bdist.linux-x86_64/egg/google/protobuf/internal/encoder.py to encoder.pyc
byte-compiling build/bdist.linux-x86_64/egg/google/protobuf/internal/type_checkers.py to type_checkers.pyc
byte-compiling build/bdist.linux-x86_64/egg/google/protobuf/internal/enum_type_wrapper.py
to enum_type_wrapper.pyc
byte-compiling build/bdist.linux-x86_64/egg/google/protobuf/internal/decoder.py to decoder.pyc
byte-compiling build/bdist.linux-x86_64/egg/google/protobuf/internal/wire_format.py to wire_format.pyc
byte-compiling build/bdist.linux-x86_64/egg/google/protobuf/internal/message_listener.py to
message_listener.pyc
byte-compiling build/bdist.linux-x86_64/egg/google/protobuf/internal/python_message.py to
python_message.pyc
byte-compiling build/bdist.linux-x86_64/egg/google/protobuf/internal/__init__.py to __init__.pyc
byte-compiling build/bdist.linux-x86_64/egg/google/protobuf/internal/containers.py to containers.pyc
byte-compiling build/bdist.linux-x86_64/egg/google/protobuf/internal/api_implementation.py
to api_implementation.pyc
byte-compiling build/bdist.linux-x86_64/egg/google/protobuf/internal/cpp_message.py to cpp_message.pyc
byte-compiling build/bdist.linux-x86_64/egg/google/protobuf/__init__.py to __init__.pyc
byte-compiling build/bdist.linux-x86_64/egg/google/protobuf/descriptor_pool.py to descriptor_pool.pyc
byte-compiling build/bdist.linux-x86_64/egg/google/protobuf/message.py to message.pyc
byte-compiling build/bdist.linux-x86_64/egg/google/protobuf/descriptor_database.py to descriptor_database.pyc
creating build/bdist.linux-x86_64/egg/EGG-INFO
copying protobuf.egg-info/PKG-INFO -> build/bdist.linux-x86_64/egg/EGG-INFO
copying protobuf.egg-info/SOURCES.txt -> build/bdist.linux-x86_64/egg/EGG-INFO
copying protobuf.egg-info/dependency_links.txt -> build/bdist.linux-x86_64/egg/EGG-INFO
copying protobuf.egg-info/namespace_packages.txt -> build/bdist.linux-x86_64/egg/EGG-INFO
copying protobuf.egg-info/requires.txt -> build/bdist.linux-x86_64/egg/EGG-INFO
copying protobuf.egg-info/top_level.txt -> build/bdist.linux-x86_64/egg/EGG-INFO
zip_safe flag not set; analyzing archive contents...
creating dist
creating 'dist/protobuf-2.5.0-py2.7.egg' and adding 'build/bdist.linux-x86_64/egg' to it
removing 'build/bdist.linux-x86_64/egg' (and everything under it)
/bin/bash ../libtool  --tag=CXX   --mode=compile g++ -DPACKAGE_NAME=\"mesos\" -DPACKAGE_TARNAME=\"mesos\"
-DPACKAGE_VERSION=\"0.28.0\" -DPACKAGE_STRING=\"mesos\ 0.28.0\" -DPACKAGE_BUGREPORT=\"\" -DPACKAGE_URL=\"\"
-DPACKAGE=\"mesos\" -DVERSION=\"0.28.0\" -DSTDC_HEADERS=1 -DHAVE_SYS_TYPES_H=1 -DHAVE_SYS_STAT_H=1
-DHAVE_STDLIB_H=1 -DHAVE_STRING_H=1 -DHAVE_MEMORY_H=1 -DHAVE_STRINGS_H=1 -DHAVE_INTTYPES_H=1
-DHAVE_STDINT_H=1 -DHAVE_UNISTD_H=1 -DHAVE_DLFCN_H=1 -DLT_OBJDIR=\".libs/\" -DHAVE_PTHREAD_PRIO_INHERIT=1
-DHAVE_PTHREAD=1 -DHAVE_LIBZ=1 -DHAVE_LIBCURL=1 -DHAVE_APR_POOLS_H=1 -DHAVE_LIBAPR_1=1 -DHAVE_SVN_VERSION_H=1
-DHAVE_LIBSVN_SUBR_1=1 -DHAVE_SVN_DELTA_H=1 -DHAVE_LIBSVN_DELTA_1=1 -DHAVE_LIBSASL2=1 -DMESOS_HAS_JAVA=1
-DHAVE_PYTHON=\"2.7\" -DMESOS_HAS_PYTHON=1 -I. -I../../src   -Wall -Werror -DLIBDIR=\"/mesos/mesos-0.28.0/_inst/lib\"
-DPKGLIBEXECDIR=\"/mesos/mesos-0.28.0/_inst/libexec/mesos\" -DPKGDATADIR=\"/mesos/mesos-0.28.0/_inst/share/mesos\"
-DPKGMODULEDIR=\"/mesos/mesos-0.28.0/_inst/lib/mesos/modules\" -I../../include -I../../3rdparty/libprocess/include
-I../../3rdparty/libprocess/3rdparty/stout/include -I../include -I../include/mesos -isystem
../3rdparty/libprocess/3rdparty/boost-1.53.0 -I../3rdparty/libprocess/3rdparty/picojson-1.3.0
-DPICOJSON_USE_INT64 -D__STDC_FORMAT_MACROS -I../3rdparty/libprocess/3rdparty/protobuf-2.5.0/src
-I../3rdparty/libprocess/3rdparty/glog-0.3.3/src -I../3rdparty/libprocess/3rdparty/glog-0.3.3/src
-I../3rdparty/leveldb/include -I../3rdparty/zookeeper-3.4.5/src/c/include -I../3rdparty/zookeeper-3.4.5/src/c/generated
-I../3rdparty/libprocess/3rdparty/protobuf-2.5.0/src -I/usr/include/subversion-1 -I/usr/include/apr-1
-I/usr/include/apr-1.0  -pthread -g1 -O0 -Wno-unused-local-typedefs -std=c++11 -MT appc/libmesos_no_3rdparty_la-spec.lo
-MD -MP -MF appc/.deps/libmesos_no_3rdparty_la-spec.Tpo -c -o appc/libmesos_no_3rdparty_la-spec.lo
`test -f 'appc/spec.cpp' || echo '../../src/'`appc/spec.cpp
libtool: compile:  g++ -DPACKAGE_NAME=\"mesos\" -DPACKAGE_TARNAME=\"mesos\" -DPACKAGE_VERSION=\"0.28.0\"
"-DPACKAGE_STRING=\"mesos 0.28.0\"" -DPACKAGE_BUGREPORT=\"\" -DPACKAGE_URL=\"\" -DPACKAGE=\"mesos\"
-DVERSION=\"0.28.0\" -DSTDC_HEADERS=1 -DHAVE_SYS_TYPES_H=1 -DHAVE_SYS_STAT_H=1 -DHAVE_STDLIB_H=1
-DHAVE_STRING_H=1 -DHAVE_MEMORY_H=1 -DHAVE_STRINGS_H=1 -DHAVE_INTTYPES_H=1 -DHAVE_STDINT_H=1
-DHAVE_UNISTD_H=1 -DHAVE_DLFCN_H=1 -DLT_OBJDIR=\".libs/\" -DHAVE_PTHREAD_PRIO_INHERIT=1 -DHAVE_PTHREAD=1
-DHAVE_LIBZ=1 -DHAVE_LIBCURL=1 -DHAVE_APR_POOLS_H=1 -DHAVE_LIBAPR_1=1 -DHAVE_SVN_VERSION_H=1
-DHAVE_LIBSVN_SUBR_1=1 -DHAVE_SVN_DELTA_H=1 -DHAVE_LIBSVN_DELTA_1=1 -DHAVE_LIBSASL2=1 -DMESOS_HAS_JAVA=1
-DHAVE_PYTHON=\"2.7\" -DMESOS_HAS_PYTHON=1 -I. -I../../src -Wall -Werror -DLIBDIR=\"/mesos/mesos-0.28.0/_inst/lib\"
-DPKGLIBEXECDIR=\"/mesos/mesos-0.28.0/_inst/libexec/mesos\" -DPKGDATADIR=\"/mesos/mesos-0.28.0/_inst/share/mesos\"
-DPKGMODULEDIR=\"/mesos/mesos-0.28.0/_inst/lib/mesos/modules\" -I../../include -I../../3rdparty/libprocess/include
-I../../3rdparty/libprocess/3rdparty/stout/include -I../include -I../include/mesos -isystem
../3rdparty/libprocess/3rdparty/boost-1.53.0 -I../3rdparty/libprocess/3rdparty/picojson-1.3.0
-DPICOJSON_USE_INT64 -D__STDC_FORMAT_MACROS -I../3rdparty/libprocess/3rdparty/protobuf-2.5.0/src
-I../3rdparty/libprocess/3rdparty/glog-0.3.3/src -I../3rdparty/libprocess/3rdparty/glog-0.3.3/src
-I../3rdparty/leveldb/include -I../3rdparty/zookeeper-3.4.5/src/c/include -I../3rdparty/zookeeper-3.4.5/src/c/generated
-I../3rdparty/libprocess/3rdparty/protobuf-2.5.0/src -I/usr/include/subversion-1 -I/usr/include/apr-1
-I/usr/include/apr-1.0 -pthread -g1 -O0 -Wno-unused-local-typedefs -std=c++11 -MT appc/libmesos_no_3rdparty_la-spec.lo
-MD -MP -MF appc/.deps/libmesos_no_3rdparty_la-spec.Tpo -c ../../src/appc/spec.cpp  -fPIC
-DPIC -o appc/.libs/libmesos_no_3rdparty_la-spec.o
mv -f slave/containerizer/mesos/isolators/filesystem/.deps/libmesos_no_3rdparty_la-linux.Tpo
slave/containerizer/mesos/isolators/filesystem/.deps/libmesos_no_3rdparty_la-linux.Plo
/bin/bash ../libtool  --tag=CXX   --mode=compile g++ -DPACKAGE_NAME=\"mesos\" -DPACKAGE_TARNAME=\"mesos\"
-DPACKAGE_VERSION=\"0.28.0\" -DPACKAGE_STRING=\"mesos\ 0.28.0\" -DPACKAGE_BUGREPORT=\"\" -DPACKAGE_URL=\"\"
-DPACKAGE=\"mesos\" -DVERSION=\"0.28.0\" -DSTDC_HEADERS=1 -DHAVE_SYS_TYPES_H=1 -DHAVE_SYS_STAT_H=1
-DHAVE_STDLIB_H=1 -DHAVE_STRING_H=1 -DHAVE_MEMORY_H=1 -DHAVE_STRINGS_H=1 -DHAVE_INTTYPES_H=1
-DHAVE_STDINT_H=1 -DHAVE_UNISTD_H=1 -DHAVE_DLFCN_H=1 -DLT_OBJDIR=\".libs/\" -DHAVE_PTHREAD_PRIO_INHERIT=1
-DHAVE_PTHREAD=1 -DHAVE_LIBZ=1 -DHAVE_LIBCURL=1 -DHAVE_APR_POOLS_H=1 -DHAVE_LIBAPR_1=1 -DHAVE_SVN_VERSION_H=1
-DHAVE_LIBSVN_SUBR_1=1 -DHAVE_SVN_DELTA_H=1 -DHAVE_LIBSVN_DELTA_1=1 -DHAVE_LIBSASL2=1 -DMESOS_HAS_JAVA=1
-DHAVE_PYTHON=\"2.7\" -DMESOS_HAS_PYTHON=1 -I. -I../../src   -Wall -Werror -DLIBDIR=\"/mesos/mesos-0.28.0/_inst/lib\"
-DPKGLIBEXECDIR=\"/mesos/mesos-0.28.0/_inst/libexec/mesos\" -DPKGDATADIR=\"/mesos/mesos-0.28.0/_inst/share/mesos\"
-DPKGMODULEDIR=\"/mesos/mesos-0.28.0/_inst/lib/mesos/modules\" -I../../include -I../../3rdparty/libprocess/include
-I../../3rdparty/libprocess/3rdparty/stout/include -I../include -I../include/mesos -isystem
../3rdparty/libprocess/3rdparty/boost-1.53.0 -I../3rdparty/libprocess/3rdparty/picojson-1.3.0
-DPICOJSON_USE_INT64 -D__STDC_FORMAT_MACROS -I../3rdparty/libprocess/3rdparty/protobuf-2.5.0/src
-I../3rdparty/libprocess/3rdparty/glog-0.3.3/src -I../3rdparty/libprocess/3rdparty/glog-0.3.3/src
-I../3rdparty/leveldb/include -I../3rdparty/zookeeper-3.4.5/src/c/include -I../3rdparty/zookeeper-3.4.5/src/c/generated
-I../3rdparty/libprocess/3rdparty/protobuf-2.5.0/src -I/usr/include/subversion-1 -I/usr/include/apr-1
-I/usr/include/apr-1.0  -pthread -g1 -O0 -Wno-unused-local-typedefs -std=c++11 -MT authentication/cram_md5/libmesos_no_3rdparty_la-authenticatee.lo
-MD -MP -MF authentication/cram_md5/.deps/libmesos_no_3rdparty_la-authenticatee.Tpo -c -o
authentication/cram_md5/libmesos_no_3rdparty_la-authenticatee.lo `test -f 'authentication/cram_md5/authenticatee.cpp'
|| echo '../../src/'`authentication/cram_md5/authenticatee.cpp
libtool: compile:  g++ -DPACKAGE_NAME=\"mesos\" -DPACKAGE_TARNAME=\"mesos\" -DPACKAGE_VERSION=\"0.28.0\"
"-DPACKAGE_STRING=\"mesos 0.28.0\"" -DPACKAGE_BUGREPORT=\"\" -DPACKAGE_URL=\"\" -DPACKAGE=\"mesos\"
-DVERSION=\"0.28.0\" -DSTDC_HEADERS=1 -DHAVE_SYS_TYPES_H=1 -DHAVE_SYS_STAT_H=1 -DHAVE_STDLIB_H=1
-DHAVE_STRING_H=1 -DHAVE_MEMORY_H=1 -DHAVE_STRINGS_H=1 -DHAVE_INTTYPES_H=1 -DHAVE_STDINT_H=1
-DHAVE_UNISTD_H=1 -DHAVE_DLFCN_H=1 -DLT_OBJDIR=\".libs/\" -DHAVE_PTHREAD_PRIO_INHERIT=1 -DHAVE_PTHREAD=1
-DHAVE_LIBZ=1 -DHAVE_LIBCURL=1 -DHAVE_APR_POOLS_H=1 -DHAVE_LIBAPR_1=1 -DHAVE_SVN_VERSION_H=1
-DHAVE_LIBSVN_SUBR_1=1 -DHAVE_SVN_DELTA_H=1 -DHAVE_LIBSVN_DELTA_1=1 -DHAVE_LIBSASL2=1 -DMESOS_HAS_JAVA=1
-DHAVE_PYTHON=\"2.7\" -DMESOS_HAS_PYTHON=1 -I. -I../../src -Wall -Werror -DLIBDIR=\"/mesos/mesos-0.28.0/_inst/lib\"
-DPKGLIBEXECDIR=\"/mesos/mesos-0.28.0/_inst/libexec/mesos\" -DPKGDATADIR=\"/mesos/mesos-0.28.0/_inst/share/mesos\"
-DPKGMODULEDIR=\"/mesos/mesos-0.28.0/_inst/lib/mesos/modules\" -I../../include -I../../3rdparty/libprocess/include
-I../../3rdparty/libprocess/3rdparty/stout/include -I../include -I../include/mesos -isystem
../3rdparty/libprocess/3rdparty/boost-1.53.0 -I../3rdparty/libprocess/3rdparty/picojson-1.3.0
-DPICOJSON_USE_INT64 -D__STDC_FORMAT_MACROS -I../3rdparty/libprocess/3rdparty/protobuf-2.5.0/src
-I../3rdparty/libprocess/3rdparty/glog-0.3.3/src -I../3rdparty/libprocess/3rdparty/glog-0.3.3/src
-I../3rdparty/leveldb/include -I../3rdparty/zookeeper-3.4.5/src/c/include -I../3rdparty/zookeeper-3.4.5/src/c/generated
-I../3rdparty/libprocess/3rdparty/protobuf-2.5.0/src -I/usr/include/subversion-1 -I/usr/include/apr-1
-I/usr/include/apr-1.0 -pthread -g1 -O0 -Wno-unused-local-typedefs -std=c++11 -MT authentication/cram_md5/libmesos_no_3rdparty_la-authenticatee.lo
-MD -MP -MF authentication/cram_md5/.deps/libmesos_no_3rdparty_la-authenticatee.Tpo -c ../../src/authentication/cram_md5/authenticatee.cpp
 -fPIC -DPIC -o authentication/cram_md5/.libs/libmesos_no_3rdparty_la-authenticatee.o
mv -f usage/.deps/mesos_usage-main.Tpo usage/.deps/mesos_usage-main.Po
/bin/bash ../libtool  --tag=CXX   --mode=compile g++ -DPACKAGE_NAME=\"mesos\" -DPACKAGE_TARNAME=\"mesos\"
-DPACKAGE_VERSION=\"0.28.0\" -DPACKAGE_STRING=\"mesos\ 0.28.0\" -DPACKAGE_BUGREPORT=\"\" -DPACKAGE_URL=\"\"
-DPACKAGE=\"mesos\" -DVERSION=\"0.28.0\" -DSTDC_HEADERS=1 -DHAVE_SYS_TYPES_H=1 -DHAVE_SYS_STAT_H=1
-DHAVE_STDLIB_H=1 -DHAVE_STRING_H=1 -DHAVE_MEMORY_H=1 -DHAVE_STRINGS_H=1 -DHAVE_INTTYPES_H=1
-DHAVE_STDINT_H=1 -DHAVE_UNISTD_H=1 -DHAVE_DLFCN_H=1 -DLT_OBJDIR=\".libs/\" -DHAVE_PTHREAD_PRIO_INHERIT=1
-DHAVE_PTHREAD=1 -DHAVE_LIBZ=1 -DHAVE_LIBCURL=1 -DHAVE_APR_POOLS_H=1 -DHAVE_LIBAPR_1=1 -DHAVE_SVN_VERSION_H=1
-DHAVE_LIBSVN_SUBR_1=1 -DHAVE_SVN_DELTA_H=1 -DHAVE_LIBSVN_DELTA_1=1 -DHAVE_LIBSASL2=1 -DMESOS_HAS_JAVA=1
-DHAVE_PYTHON=\"2.7\" -DMESOS_HAS_PYTHON=1 -I. -I../../src   -Wall -Werror -DLIBDIR=\"/mesos/mesos-0.28.0/_inst/lib\"
-DPKGLIBEXECDIR=\"/mesos/mesos-0.28.0/_inst/libexec/mesos\" -DPKGDATADIR=\"/mesos/mesos-0.28.0/_inst/share/mesos\"
-DPKGMODULEDIR=\"/mesos/mesos-0.28.0/_inst/lib/mesos/modules\" -I../../include -I../../3rdparty/libprocess/include
-I../../3rdparty/libprocess/3rdparty/stout/include -I../include -I../include/mesos -isystem
../3rdparty/libprocess/3rdparty/boost-1.53.0 -I../3rdparty/libprocess/3rdparty/picojson-1.3.0
-DPICOJSON_USE_INT64 -D__STDC_FORMAT_MACROS -I../3rdparty/libprocess/3rdparty/protobuf-2.5.0/src
-I../3rdparty/libprocess/3rdparty/glog-0.3.3/src -I../3rdparty/libprocess/3rdparty/glog-0.3.3/src
-I../3rdparty/leveldb/include -I../3rdparty/zookeeper-3.4.5/src/c/include -I../3rdparty/zookeeper-3.4.5/src/c/generated
-I../3rdparty/libprocess/3rdparty/protobuf-2.5.0/src -I/usr/include/subversion-1 -I/usr/include/apr-1
-I/usr/include/apr-1.0  -pthread -g1 -O0 -Wno-unused-local-typedefs -std=c++11 -MT authentication/cram_md5/libmesos_no_3rdparty_la-authenticator.lo
-MD -MP -MF authentication/cram_md5/.deps/libmesos_no_3rdparty_la-authenticator.Tpo -c -o
authentication/cram_md5/libmesos_no_3rdparty_la-authenticator.lo `test -f 'authentication/cram_md5/authenticator.cpp'
|| echo '../../src/'`authentication/cram_md5/authenticator.cpp
libtool: compile:  g++ -DPACKAGE_NAME=\"mesos\" -DPACKAGE_TARNAME=\"mesos\" -DPACKAGE_VERSION=\"0.28.0\"
"-DPACKAGE_STRING=\"mesos 0.28.0\"" -DPACKAGE_BUGREPORT=\"\" -DPACKAGE_URL=\"\" -DPACKAGE=\"mesos\"
-DVERSION=\"0.28.0\" -DSTDC_HEADERS=1 -DHAVE_SYS_TYPES_H=1 -DHAVE_SYS_STAT_H=1 -DHAVE_STDLIB_H=1
-DHAVE_STRING_H=1 -DHAVE_MEMORY_H=1 -DHAVE_STRINGS_H=1 -DHAVE_INTTYPES_H=1 -DHAVE_STDINT_H=1
-DHAVE_UNISTD_H=1 -DHAVE_DLFCN_H=1 -DLT_OBJDIR=\".libs/\" -DHAVE_PTHREAD_PRIO_INHERIT=1 -DHAVE_PTHREAD=1
-DHAVE_LIBZ=1 -DHAVE_LIBCURL=1 -DHAVE_APR_POOLS_H=1 -DHAVE_LIBAPR_1=1 -DHAVE_SVN_VERSION_H=1
-DHAVE_LIBSVN_SUBR_1=1 -DHAVE_SVN_DELTA_H=1 -DHAVE_LIBSVN_DELTA_1=1 -DHAVE_LIBSASL2=1 -DMESOS_HAS_JAVA=1
-DHAVE_PYTHON=\"2.7\" -DMESOS_HAS_PYTHON=1 -I. -I../../src -Wall -Werror -DLIBDIR=\"/mesos/mesos-0.28.0/_inst/lib\"
-DPKGLIBEXECDIR=\"/mesos/mesos-0.28.0/_inst/libexec/mesos\" -DPKGDATADIR=\"/mesos/mesos-0.28.0/_inst/share/mesos\"
-DPKGMODULEDIR=\"/mesos/mesos-0.28.0/_inst/lib/mesos/modules\" -I../../include -I../../3rdparty/libprocess/include
-I../../3rdparty/libprocess/3rdparty/stout/include -I../include -I../include/mesos -isystem
../3rdparty/libprocess/3rdparty/boost-1.53.0 -I../3rdparty/libprocess/3rdparty/picojson-1.3.0
-DPICOJSON_USE_INT64 -D__STDC_FORMAT_MACROS -I../3rdparty/libprocess/3rdparty/protobuf-2.5.0/src
-I../3rdparty/libprocess/3rdparty/glog-0.3.3/src -I../3rdparty/libprocess/3rdparty/glog-0.3.3/src
-I../3rdparty/leveldb/include -I../3rdparty/zookeeper-3.4.5/src/c/include -I../3rdparty/zookeeper-3.4.5/src/c/generated
-I../3rdparty/libprocess/3rdparty/protobuf-2.5.0/src -I/usr/include/subversion-1 -I/usr/include/apr-1
-I/usr/include/apr-1.0 -pthread -g1 -O0 -Wno-unused-local-typedefs -std=c++11 -MT authentication/cram_md5/libmesos_no_3rdparty_la-authenticator.lo
-MD -MP -MF authentication/cram_md5/.deps/libmesos_no_3rdparty_la-authenticator.Tpo -c ../../src/authentication/cram_md5/authenticator.cpp
 -fPIC -DPIC -o authentication/cram_md5/.libs/libmesos_no_3rdparty_la-authenticator.o
mv -f slave/container_loggers/.deps/mesos_logrotate_logger-logrotate.Tpo slave/container_loggers/.deps/mesos_logrotate_logger-logrotate.Po
/bin/bash ../libtool  --tag=CXX   --mode=compile g++ -DPACKAGE_NAME=\"mesos\" -DPACKAGE_TARNAME=\"mesos\"
-DPACKAGE_VERSION=\"0.28.0\" -DPACKAGE_STRING=\"mesos\ 0.28.0\" -DPACKAGE_BUGREPORT=\"\" -DPACKAGE_URL=\"\"
-DPACKAGE=\"mesos\" -DVERSION=\"0.28.0\" -DSTDC_HEADERS=1 -DHAVE_SYS_TYPES_H=1 -DHAVE_SYS_STAT_H=1
-DHAVE_STDLIB_H=1 -DHAVE_STRING_H=1 -DHAVE_MEMORY_H=1 -DHAVE_STRINGS_H=1 -DHAVE_INTTYPES_H=1
-DHAVE_STDINT_H=1 -DHAVE_UNISTD_H=1 -DHAVE_DLFCN_H=1 -DLT_OBJDIR=\".libs/\" -DHAVE_PTHREAD_PRIO_INHERIT=1
-DHAVE_PTHREAD=1 -DHAVE_LIBZ=1 -DHAVE_LIBCURL=1 -DHAVE_APR_POOLS_H=1 -DHAVE_LIBAPR_1=1 -DHAVE_SVN_VERSION_H=1
-DHAVE_LIBSVN_SUBR_1=1 -DHAVE_SVN_DELTA_H=1 -DHAVE_LIBSVN_DELTA_1=1 -DHAVE_LIBSASL2=1 -DMESOS_HAS_JAVA=1
-DHAVE_PYTHON=\"2.7\" -DMESOS_HAS_PYTHON=1 -I. -I../../src   -Wall -Werror -DLIBDIR=\"/mesos/mesos-0.28.0/_inst/lib\"
-DPKGLIBEXECDIR=\"/mesos/mesos-0.28.0/_inst/libexec/mesos\" -DPKGDATADIR=\"/mesos/mesos-0.28.0/_inst/share/mesos\"
-DPKGMODULEDIR=\"/mesos/mesos-0.28.0/_inst/lib/mesos/modules\" -I../../include -I../../3rdparty/libprocess/include
-I../../3rdparty/libprocess/3rdparty/stout/include -I../include -I../include/mesos -isystem
../3rdparty/libprocess/3rdparty/boost-1.53.0 -I../3rdparty/libprocess/3rdparty/picojson-1.3.0
-DPICOJSON_USE_INT64 -D__STDC_FORMAT_MACROS -I../3rdparty/libprocess/3rdparty/protobuf-2.5.0/src
-I../3rdparty/libprocess/3rdparty/glog-0.3.3/src -I../3rdparty/libprocess/3rdparty/glog-0.3.3/src
-I../3rdparty/leveldb/include -I../3rdparty/zookeeper-3.4.5/src/c/include -I../3rdparty/zookeeper-3.4.5/src/c/generated
-I../3rdparty/libprocess/3rdparty/protobuf-2.5.0/src -I/usr/include/subversion-1 -I/usr/include/apr-1
-I/usr/include/apr-1.0  -pthread -g1 -O0 -Wno-unused-local-typedefs -std=c++11 -MT authentication/cram_md5/libmesos_no_3rdparty_la-auxprop.lo
-MD -MP -MF authentication/cram_md5/.deps/libmesos_no_3rdparty_la-auxprop.Tpo -c -o authentication/cram_md5/libmesos_no_3rdparty_la-auxprop.lo
`test -f 'authentication/cram_md5/auxprop.cpp' || echo '../../src/'`authentication/cram_md5/auxprop.cpp
libtool: compile:  g++ -DPACKAGE_NAME=\"mesos\" -DPACKAGE_TARNAME=\"mesos\" -DPACKAGE_VERSION=\"0.28.0\"
"-DPACKAGE_STRING=\"mesos 0.28.0\"" -DPACKAGE_BUGREPORT=\"\" -DPACKAGE_URL=\"\" -DPACKAGE=\"mesos\"
-DVERSION=\"0.28.0\" -DSTDC_HEADERS=1 -DHAVE_SYS_TYPES_H=1 -DHAVE_SYS_STAT_H=1 -DHAVE_STDLIB_H=1
-DHAVE_STRING_H=1 -DHAVE_MEMORY_H=1 -DHAVE_STRINGS_H=1 -DHAVE_INTTYPES_H=1 -DHAVE_STDINT_H=1
-DHAVE_UNISTD_H=1 -DHAVE_DLFCN_H=1 -DLT_OBJDIR=\".libs/\" -DHAVE_PTHREAD_PRIO_INHERIT=1 -DHAVE_PTHREAD=1
-DHAVE_LIBZ=1 -DHAVE_LIBCURL=1 -DHAVE_APR_POOLS_H=1 -DHAVE_LIBAPR_1=1 -DHAVE_SVN_VERSION_H=1
-DHAVE_LIBSVN_SUBR_1=1 -DHAVE_SVN_DELTA_H=1 -DHAVE_LIBSVN_DELTA_1=1 -DHAVE_LIBSASL2=1 -DMESOS_HAS_JAVA=1
-DHAVE_PYTHON=\"2.7\" -DMESOS_HAS_PYTHON=1 -I. -I../../src -Wall -Werror -DLIBDIR=\"/mesos/mesos-0.28.0/_inst/lib\"
-DPKGLIBEXECDIR=\"/mesos/mesos-0.28.0/_inst/libexec/mesos\" -DPKGDATADIR=\"/mesos/mesos-0.28.0/_inst/share/mesos\"
-DPKGMODULEDIR=\"/mesos/mesos-0.28.0/_inst/lib/mesos/modules\" -I../../include -I../../3rdparty/libprocess/include
-I../../3rdparty/libprocess/3rdparty/stout/include -I../include -I../include/mesos -isystem
../3rdparty/libprocess/3rdparty/boost-1.53.0 -I../3rdparty/libprocess/3rdparty/picojson-1.3.0
-DPICOJSON_USE_INT64 -D__STDC_FORMAT_MACROS -I../3rdparty/libprocess/3rdparty/protobuf-2.5.0/src
-I../3rdparty/libprocess/3rdparty/glog-0.3.3/src -I../3rdparty/libprocess/3rdparty/glog-0.3.3/src
-I../3rdparty/leveldb/include -I../3rdparty/zookeeper-3.4.5/src/c/include -I../3rdparty/zookeeper-3.4.5/src/c/generated
-I../3rdparty/libprocess/3rdparty/protobuf-2.5.0/src -I/usr/include/subversion-1 -I/usr/include/apr-1
-I/usr/include/apr-1.0 -pthread -g1 -O0 -Wno-unused-local-typedefs -std=c++11 -MT authentication/cram_md5/libmesos_no_3rdparty_la-auxprop.lo
-MD -MP -MF authentication/cram_md5/.deps/libmesos_no_3rdparty_la-auxprop.Tpo -c ../../src/authentication/cram_md5/auxprop.cpp
 -fPIC -DPIC -o authentication/cram_md5/.libs/libmesos_no_3rdparty_la-auxprop.o
mv -f local/.deps/mesos_local-main.Tpo local/.deps/mesos_local-main.Po
/bin/bash ../libtool  --tag=CXX   --mode=compile g++ -DPACKAGE_NAME=\"mesos\" -DPACKAGE_TARNAME=\"mesos\"
-DPACKAGE_VERSION=\"0.28.0\" -DPACKAGE_STRING=\"mesos\ 0.28.0\" -DPACKAGE_BUGREPORT=\"\" -DPACKAGE_URL=\"\"
-DPACKAGE=\"mesos\" -DVERSION=\"0.28.0\" -DSTDC_HEADERS=1 -DHAVE_SYS_TYPES_H=1 -DHAVE_SYS_STAT_H=1
-DHAVE_STDLIB_H=1 -DHAVE_STRING_H=1 -DHAVE_MEMORY_H=1 -DHAVE_STRINGS_H=1 -DHAVE_INTTYPES_H=1
-DHAVE_STDINT_H=1 -DHAVE_UNISTD_H=1 -DHAVE_DLFCN_H=1 -DLT_OBJDIR=\".libs/\" -DHAVE_PTHREAD_PRIO_INHERIT=1
-DHAVE_PTHREAD=1 -DHAVE_LIBZ=1 -DHAVE_LIBCURL=1 -DHAVE_APR_POOLS_H=1 -DHAVE_LIBAPR_1=1 -DHAVE_SVN_VERSION_H=1
-DHAVE_LIBSVN_SUBR_1=1 -DHAVE_SVN_DELTA_H=1 -DHAVE_LIBSVN_DELTA_1=1 -DHAVE_LIBSASL2=1 -DMESOS_HAS_JAVA=1
-DHAVE_PYTHON=\"2.7\" -DMESOS_HAS_PYTHON=1 -I. -I../../src   -Wall -Werror -DLIBDIR=\"/mesos/mesos-0.28.0/_inst/lib\"
-DPKGLIBEXECDIR=\"/mesos/mesos-0.28.0/_inst/libexec/mesos\" -DPKGDATADIR=\"/mesos/mesos-0.28.0/_inst/share/mesos\"
-DPKGMODULEDIR=\"/mesos/mesos-0.28.0/_inst/lib/mesos/modules\" -I../../include -I../../3rdparty/libprocess/include
-I../../3rdparty/libprocess/3rdparty/stout/include -I../include -I../include/mesos -isystem
../3rdparty/libprocess/3rdparty/boost-1.53.0 -I../3rdparty/libprocess/3rdparty/picojson-1.3.0
-DPICOJSON_USE_INT64 -D__STDC_FORMAT_MACROS -I../3rdparty/libprocess/3rdparty/protobuf-2.5.0/src
-I../3rdparty/libprocess/3rdparty/glog-0.3.3/src -I../3rdparty/libprocess/3rdparty/glog-0.3.3/src
-I../3rdparty/leveldb/include -I../3rdparty/zookeeper-3.4.5/src/c/include -I../3rdparty/zookeeper-3.4.5/src/c/generated
-I../3rdparty/libprocess/3rdparty/protobuf-2.5.0/src -I/usr/include/subversion-1 -I/usr/include/apr-1
-I/usr/include/apr-1.0  -pthread -g1 -O0 -Wno-unused-local-typedefs -std=c++11 -MT authentication/http/libmesos_no_3rdparty_la-basic_authenticator_factory.lo
-MD -MP -MF authentication/http/.deps/libmesos_no_3rdparty_la-basic_authenticator_factory.Tpo
-c -o authentication/http/libmesos_no_3rdparty_la-basic_authenticator_factory.lo `test -f
'authentication/http/basic_authenticator_factory.cpp' || echo '../../src/'`authentication/http/basic_authenticator_factory.cpp
libtool: compile:  g++ -DPACKAGE_NAME=\"mesos\" -DPACKAGE_TARNAME=\"mesos\" -DPACKAGE_VERSION=\"0.28.0\"
"-DPACKAGE_STRING=\"mesos 0.28.0\"" -DPACKAGE_BUGREPORT=\"\" -DPACKAGE_URL=\"\" -DPACKAGE=\"mesos\"
-DVERSION=\"0.28.0\" -DSTDC_HEADERS=1 -DHAVE_SYS_TYPES_H=1 -DHAVE_SYS_STAT_H=1 -DHAVE_STDLIB_H=1
-DHAVE_STRING_H=1 -DHAVE_MEMORY_H=1 -DHAVE_STRINGS_H=1 -DHAVE_INTTYPES_H=1 -DHAVE_STDINT_H=1
-DHAVE_UNISTD_H=1 -DHAVE_DLFCN_H=1 -DLT_OBJDIR=\".libs/\" -DHAVE_PTHREAD_PRIO_INHERIT=1 -DHAVE_PTHREAD=1
-DHAVE_LIBZ=1 -DHAVE_LIBCURL=1 -DHAVE_APR_POOLS_H=1 -DHAVE_LIBAPR_1=1 -DHAVE_SVN_VERSION_H=1
-DHAVE_LIBSVN_SUBR_1=1 -DHAVE_SVN_DELTA_H=1 -DHAVE_LIBSVN_DELTA_1=1 -DHAVE_LIBSASL2=1 -DMESOS_HAS_JAVA=1
-DHAVE_PYTHON=\"2.7\" -DMESOS_HAS_PYTHON=1 -I. -I../../src -Wall -Werror -DLIBDIR=\"/mesos/mesos-0.28.0/_inst/lib\"
-DPKGLIBEXECDIR=\"/mesos/mesos-0.28.0/_inst/libexec/mesos\" -DPKGDATADIR=\"/mesos/mesos-0.28.0/_inst/share/mesos\"
-DPKGMODULEDIR=\"/mesos/mesos-0.28.0/_inst/lib/mesos/modules\" -I../../include -I../../3rdparty/libprocess/include
-I../../3rdparty/libprocess/3rdparty/stout/include -I../include -I../include/mesos -isystem
../3rdparty/libprocess/3rdparty/boost-1.53.0 -I../3rdparty/libprocess/3rdparty/picojson-1.3.0
-DPICOJSON_USE_INT64 -D__STDC_FORMAT_MACROS -I../3rdparty/libprocess/3rdparty/protobuf-2.5.0/src
-I../3rdparty/libprocess/3rdparty/glog-0.3.3/src -I../3rdparty/libprocess/3rdparty/glog-0.3.3/src
-I../3rdparty/leveldb/include -I../3rdparty/zookeeper-3.4.5/src/c/include -I../3rdparty/zookeeper-3.4.5/src/c/generated
-I../3rdparty/libprocess/3rdparty/protobuf-2.5.0/src -I/usr/include/subversion-1 -I/usr/include/apr-1
-I/usr/include/apr-1.0 -pthread -g1 -O0 -Wno-unused-local-typedefs -std=c++11 -MT authentication/http/libmesos_no_3rdparty_la-basic_authenticator_factory.lo
-MD -MP -MF authentication/http/.deps/libmesos_no_3rdparty_la-basic_authenticator_factory.Tpo
-c ../../src/authentication/http/basic_authenticator_factory.cpp  -fPIC -DPIC -o authentication/http/.libs/libmesos_no_3rdparty_la-basic_authenticator_factory.o
make[3]: *** [slave/mesos_slave-main.o] Error 1
make[3]: *** Waiting for unfinished jobs....
In file included from ../../src/module/manager.hpp:35:0,
                 from ../../src/authentication/http/basic_authenticator_factory.cpp:25:
../../3rdparty/libprocess/3rdparty/stout/include/stout/dynamiclibrary.hpp:21:42: fatal error:
stout/posix/dynamiclibrary.hpp: No such file or directory
 #include <stout/posix/dynamiclibrary.hpp>
                                          ^
compilation terminated.
mv -f appc/.deps/libmesos_no_3rdparty_la-spec.Tpo appc/.deps/libmesos_no_3rdparty_la-spec.Plo
make[3]: *** [master/mesos_master-main.o] Error 1
mv -f authentication/cram_md5/.deps/libmesos_no_3rdparty_la-auxprop.Tpo authentication/cram_md5/.deps/libmesos_no_3rdparty_la-auxprop.Plo
make[3]: *** [authentication/http/libmesos_no_3rdparty_la-basic_authenticator_factory.lo]
Error 1
mv -f authentication/cram_md5/.deps/libmesos_no_3rdparty_la-authenticatee.Tpo authentication/cram_md5/.deps/libmesos_no_3rdparty_la-authenticatee.Plo
mv -f authentication/cram_md5/.deps/libmesos_no_3rdparty_la-authenticator.Tpo authentication/cram_md5/.deps/libmesos_no_3rdparty_la-authenticator.Plo
mv -f docker/.deps/mesos_docker_executor-executor.Tpo docker/.deps/mesos_docker_executor-executor.Po
make[3]: Leaving directory `/mesos/mesos-0.28.0/_build/src'
make[2]: *** [all] Error 2
make[2]: Leaving directory `/mesos/mesos-0.28.0/_build/src'
make[1]: *** [all-recursive] Error 1
make[1]: Leaving directory `/mesos/mesos-0.28.0/_build'
make: *** [distcheck] Error 1
+ docker rmi mesos-1456448924-28806
Untagged: mesos-1456448924-28806:latest
Deleted: 8ad9407678f851331b66f7608023b2ff6e46cade6d8576ed1461c7c978da822f
Deleted: 8506f317e158051252c1e028a9e7d5e805280efd9f7e1386d97a3678af8c04e5
Deleted: fee75e15320d640b6970572d5fbc0f5bc7b2c3de278c7bab0879eee9a8749c64
Deleted: d2105418e89c235bb5878662502618c3849ea599517733e240f64b11dff8f546
Deleted: 46b4332a504982073d2eadaec576c41ad09cf311e4cb6915b9ef9ac08ff71175
Deleted: 63901fc8297675efd0716d8b7e49c311a6c31e3dd27d3f9b639650203318bd27
Deleted: e92b8677a9b21d893c2ebab7619e747fa1d58865d7b5d9697414e0ababb7a55e
Deleted: 67a71e30fb064167bb699268d13333ce7118e2bf1cf32e4f08bed962f55e39ab
Deleted: d411edbdfbc126b31d9e5180a6ad633e8cdc1e5452d4c3e7505f26bc10ec8446
Deleted: c0070935b68ff6844148a2a8a402bd0cc280c544bea912c3816806e9b64aabac
Deleted: d720715f0cfb14e73bdabffa3a4b6c6b46c7ab27a62cf40d23fe37be4995cf7a
Deleted: 4eb7a24b6fbe7afeb251a0d65dc450325b160de1f4bbc294c59c86045a26501b
Deleted: fae1a537512eb4f539eda81ad244108ddfc3ad94d669652c85f587301325c873
Deleted: 4262b023264eaa23627a99e1b6f0bb912d0fb4cbb8fe82240e3b9319a6cadf21
Deleted: 3ffc30e481aaa58a32d0f2edfc210c5abd3cda0514c03d833ef964596d9654b0
Deleted: 84493e5f5f37849f6fded6e2625e2d6d2d1792b4063d60b20270228b9c66cb2c
Build step 'Execute shell' marked build as failure

Mime
View raw message