mesos-builds mailing list archives

Site index · List index
Message view « Date » · « Thread »
Top « Date » · « Thread »
From Apache Jenkins Server <jenk...@builds.apache.org>
Subject Build failed in Jenkins: Mesos » gcc,--verbose,centos:7,docker||Hadoop #1204
Date Mon, 09 Nov 2015 19:02:01 GMT
See <https://builds.apache.org/job/Mesos/COMPILER=gcc,CONFIGURATION=--verbose,OS=centos%3A7,label_exp=docker%7C%7CHadoop/1204/changes>

Changes:

[vinodkone] Renamed slave to agent in v1/scheduler.proto.

[joris.van.remoortere] Fixed a typo in ssl.md.

------------------------------------------
[...truncated 137581 lines...]
I1109 19:02:09.960841 30676 slave.cpp:2009] Asked to shut down framework cbf62e38-c7ac-45d4-9c7d-df7b953f2e68-0000
by @0.0.0.0:0
I1109 19:02:09.960875 30676 slave.cpp:2034] Shutting down framework cbf62e38-c7ac-45d4-9c7d-df7b953f2e68-0000
I1109 19:02:09.960965 30676 slave.cpp:3657] Cleaning up executor 'default' of framework cbf62e38-c7ac-45d4-9c7d-df7b953f2e68-0000
at executor(132)@172.17.6.32:52936
I1109 19:02:09.961244 30680 gc.cpp:56] Scheduling '/tmp/ContentType_SchedulerTest_Message_1_x5G7QN/slaves/cbf62e38-c7ac-45d4-9c7d-df7b953f2e68-S0/frameworks/cbf62e38-c7ac-45d4-9c7d-df7b953f2e68-0000/executors/default/runs/cc0760d4-4854-46a2-a30e-4cbcc5a72619'
for gc 6.9999888756237days in the future
I1109 19:02:09.961375 30676 slave.cpp:3745] Cleaning up framework cbf62e38-c7ac-45d4-9c7d-df7b953f2e68-0000
I1109 19:02:09.961529 30679 status_update_manager.cpp:284] Closing status update streams for
framework cbf62e38-c7ac-45d4-9c7d-df7b953f2e68-0000
I1109 19:02:09.961602 30679 status_update_manager.cpp:530] Cleaning up status update stream
for task 7aadf763-9001-47c3-a4c7-0ec06670d74a of framework cbf62e38-c7ac-45d4-9c7d-df7b953f2e68-0000
I1109 19:02:09.961611 30680 gc.cpp:56] Scheduling '/tmp/ContentType_SchedulerTest_Message_1_x5G7QN/slaves/cbf62e38-c7ac-45d4-9c7d-df7b953f2e68-S0/frameworks/cbf62e38-c7ac-45d4-9c7d-df7b953f2e68-0000/executors/default'
for gc 6.99998887367111days in the future
I1109 19:02:09.961917 30680 gc.cpp:56] Scheduling '/tmp/ContentType_SchedulerTest_Message_1_x5G7QN/slaves/cbf62e38-c7ac-45d4-9c7d-df7b953f2e68-S0/frameworks/cbf62e38-c7ac-45d4-9c7d-df7b953f2e68-0000'
for gc 6.99998886766222days in the future
[       OK ] ContentType/SchedulerTest.Message/1 (153 ms)
[ RUN      ] ContentType/SchedulerTest.Request/0
I1109 19:02:09.970616 30654 leveldb.cpp:176] Opened db in 2.771535ms
I1109 19:02:09.971946 30654 leveldb.cpp:183] Compacted db in 1.173282ms
I1109 19:02:09.972007 30654 leveldb.cpp:198] Created db iterator in 26288ns
I1109 19:02:09.972023 30654 leveldb.cpp:204] Seeked to beginning of db in 2026ns
I1109 19:02:09.972034 30654 leveldb.cpp:273] Iterated through 0 keys in the db in 258ns
I1109 19:02:09.972093 30654 replica.cpp:780] Replica recovered with log positions 0 ->
0 with 1 holes and 0 unlearned
I1109 19:02:09.972728 30687 recover.cpp:449] Starting replica recovery
I1109 19:02:09.973152 30678 recover.cpp:475] Replica is in EMPTY status
I1109 19:02:09.974232 30688 replica.cpp:676] Replica in EMPTY status received a broadcasted
recover request from (10521)@172.17.6.32:52936
I1109 19:02:09.974597 30679 recover.cpp:195] Received a recover response from a replica in
EMPTY status
I1109 19:02:09.975114 30678 recover.cpp:566] Updating replica status to STARTING
I1109 19:02:09.975718 30679 leveldb.cpp:306] Persisting metadata (8 bytes) to leveldb took
506423ns
I1109 19:02:09.975837 30679 replica.cpp:323] Persisted replica status to STARTING
I1109 19:02:09.976066 30679 recover.cpp:475] Replica is in STARTING status
I1109 19:02:09.976831 30675 replica.cpp:676] Replica in STARTING status received a broadcasted
recover request from (10522)@172.17.6.32:52936
I1109 19:02:09.978260 30683 recover.cpp:195] Received a recover response from a replica in
STARTING status
I1109 19:02:09.980522 30685 recover.cpp:566] Updating replica status to VOTING
I1109 19:02:09.980790 30685 master.cpp:367] Master 8d73e4da-3d5b-4265-9c26-46c7a7908522 (5ab0a7e01929)
started on 172.17.6.32:52936
I1109 19:02:09.980820 30685 master.cpp:369] Flags at startup: --acls="" --allocation_interval="1secs"
--allocator="HierarchicalDRF" --authenticate="false" --authenticate_slaves="true" --authenticators="crammd5"
--authorizers="local" --credentials="/tmp/flsJuj/credentials" --framework_sorter="drf" --help="false"
--hostname_lookup="true" --initialize_driver_logging="true" --log_auto_initialize="true" --logbufsecs="0"
--logging_level="INFO" --max_slave_ping_timeouts="5" --quiet="false" --recovery_slave_removal_limit="100%"
--registry="replicated_log" --registry_fetch_timeout="1mins" --registry_store_timeout="25secs"
--registry_strict="true" --root_submissions="true" --slave_ping_timeout="15secs" --slave_reregister_timeout="10mins"
--user_sorter="drf" --version="false" --webui_dir="/mesos/mesos-0.26.0/_inst/share/mesos/webui"
--work_dir="/tmp/flsJuj/master" --zk_session_timeout="10secs"
I1109 19:02:09.981243 30685 master.cpp:416] Master allowing unauthenticated frameworks to
register
I1109 19:02:09.981254 30685 master.cpp:419] Master only allowing authenticated slaves to register
I1109 19:02:09.981261 30685 credentials.hpp:37] Loading credentials for authentication from
'/tmp/flsJuj/credentials'
I1109 19:02:09.981353 30683 leveldb.cpp:306] Persisting metadata (8 bytes) to leveldb took
582382ns
I1109 19:02:09.981389 30683 replica.cpp:323] Persisted replica status to VOTING
I1109 19:02:09.981597 30685 master.cpp:458] Using default 'crammd5' authenticator
I1109 19:02:09.981611 30683 recover.cpp:580] Successfully joined the Paxos group
I1109 19:02:09.981745 30685 master.cpp:495] Authorization enabled
I1109 19:02:09.981823 30683 recover.cpp:464] Recover process terminated
I1109 19:02:09.982038 30679 whitelist_watcher.cpp:79] No whitelist given
I1109 19:02:09.982108 30683 hierarchical.cpp:140] Initialized hierarchical allocator process
I1109 19:02:09.983891 30678 master.cpp:1606] The newly elected leader is master@172.17.6.32:52936
with id 8d73e4da-3d5b-4265-9c26-46c7a7908522
I1109 19:02:09.983940 30678 master.cpp:1619] Elected as the leading master!
I1109 19:02:09.983960 30678 master.cpp:1379] Recovering from registrar
I1109 19:02:09.984102 30682 registrar.cpp:309] Recovering registrar
I1109 19:02:09.984709 30675 log.cpp:661] Attempting to start the writer
I1109 19:02:09.986174 30681 replica.cpp:496] Replica received implicit promise request from
(10523)@172.17.6.32:52936 with proposal 1
I1109 19:02:09.986660 30681 leveldb.cpp:306] Persisting metadata (8 bytes) to leveldb took
441759ns
I1109 19:02:09.986686 30681 replica.cpp:345] Persisted promised to 1
I1109 19:02:09.987256 30683 coordinator.cpp:240] Coordinator attempting to fill missing positions
I1109 19:02:09.988486 30688 replica.cpp:391] Replica received explicit promise request from
(10524)@172.17.6.32:52936 for position 0 with proposal 2
I1109 19:02:09.988911 30688 leveldb.cpp:343] Persisting action (8 bytes) to leveldb took 385634ns
I1109 19:02:09.988960 30688 replica.cpp:715] Persisted action at 0
I1109 19:02:09.989891 30688 replica.cpp:540] Replica received write request for position 0
from (10525)@172.17.6.32:52936
I1109 19:02:09.989977 30688 leveldb.cpp:438] Reading position from leveldb took 57602ns
I1109 19:02:09.990383 30688 leveldb.cpp:343] Persisting action (14 bytes) to leveldb took
352635ns
I1109 19:02:09.990406 30688 replica.cpp:715] Persisted action at 0
I1109 19:02:09.991006 30682 replica.cpp:694] Replica received learned notice for position
0 from @0.0.0.0:0
I1109 19:02:09.991338 30682 leveldb.cpp:343] Persisting action (16 bytes) to leveldb took
302344ns
I1109 19:02:09.991441 30682 replica.cpp:715] Persisted action at 0
I1109 19:02:09.991468 30682 replica.cpp:700] Replica learned NOP action at position 0
I1109 19:02:09.992038 30676 log.cpp:677] Writer started with ending position 0
I1109 19:02:09.993350 30688 leveldb.cpp:438] Reading position from leveldb took 22978ns
I1109 19:02:09.994326 30684 registrar.cpp:342] Successfully fetched the registry (0B) in 10.17088ms
I1109 19:02:09.994559 30684 registrar.cpp:441] Applied 1 operations in 48421ns; attempting
to update the 'registry'
I1109 19:02:09.995507 30684 log.cpp:685] Attempting to append 174 bytes to the log
I1109 19:02:09.995792 30684 coordinator.cpp:350] Coordinator attempting to write APPEND action
at position 1
I1109 19:02:09.996860 30681 replica.cpp:540] Replica received write request for position 1
from (10526)@172.17.6.32:52936
I1109 19:02:09.997304 30681 leveldb.cpp:343] Persisting action (193 bytes) to leveldb took
409068ns
I1109 19:02:09.997333 30681 replica.cpp:715] Persisted action at 1
I1109 19:02:09.998265 30676 replica.cpp:694] Replica received learned notice for position
1 from @0.0.0.0:0
I1109 19:02:09.998684 30676 leveldb.cpp:343] Persisting action (195 bytes) to leveldb took
388674ns
I1109 19:02:09.998742 30676 replica.cpp:715] Persisted action at 1
I1109 19:02:09.998774 30676 replica.cpp:700] Replica learned APPEND action at position 1
I1109 19:02:09.999804 30679 registrar.cpp:486] Successfully updated the 'registry' in 5.028864ms
I1109 19:02:09.999950 30679 registrar.cpp:372] Successfully recovered registrar
I1109 19:02:10.000100 30686 log.cpp:704] Attempting to truncate the log to 1
I1109 19:02:10.000238 30679 coordinator.cpp:350] Coordinator attempting to write TRUNCATE
action at position 2
I1109 19:02:10.000280 30681 master.cpp:1416] Recovered 0 slaves from the Registry (135B) ;
allowing 10mins for slaves to re-register
I1109 19:02:10.001070 30676 replica.cpp:540] Replica received write request for position 2
from (10527)@172.17.6.32:52936
I1109 19:02:10.001503 30676 leveldb.cpp:343] Persisting action (16 bytes) to leveldb took
384338ns
I1109 19:02:10.001534 30676 replica.cpp:715] Persisted action at 2
I1109 19:02:10.002306 30681 replica.cpp:694] Replica received learned notice for position
2 from @0.0.0.0:0
I1109 19:02:10.002758 30681 leveldb.cpp:343] Persisting action (18 bytes) to leveldb took
328905ns
I1109 19:02:10.002820 30681 leveldb.cpp:401] Deleting ~1 keys from leveldb took 32923ns
I1109 19:02:10.002976 30681 replica.cpp:715] Persisted action at 2
I1109 19:02:10.003111 30681 replica.cpp:700] Replica learned TRUNCATE action at position 2
I1109 19:02:10.011888 30654 scheduler.cpp:156] Version: 0.26.0
I1109 19:02:10.012531 30681 scheduler.cpp:238] New master detected at master@172.17.6.32:52936
I1109 19:02:10.013788 30678 scheduler.cpp:300] Sending SUBSCRIBE call to master@172.17.6.32:52936
I1109 19:02:10.016422 30688 process.cpp:3075] Handling HTTP event for process 'master' with
path: '/master/api/v1/scheduler'
I1109 19:02:10.016619 30688 http.cpp:334] HTTP POST for /master/api/v1/scheduler from 172.17.6.32:36112
I1109 19:02:10.016841 30688 master.cpp:1868] Received subscription request for HTTP framework
'default'
I1109 19:02:10.016937 30688 master.cpp:1645] Authorizing framework principal 'test-principal'
to receive offers for role '*'
I1109 19:02:10.017277 30673 master.cpp:1960] Subscribing framework 'default' with checkpointing
disabled and capabilities [  ]
I1109 19:02:10.017854 30673 hierarchical.cpp:185] Added framework 8d73e4da-3d5b-4265-9c26-46c7a7908522-0000
I1109 19:02:10.017913 30673 hierarchical.cpp:971] No resources available to allocate!
I1109 19:02:10.018013 30673 hierarchical.cpp:1064] No inverse offers to send out!
I1109 19:02:10.018048 30673 hierarchical.cpp:870] Performed allocation for 0 slaves in 171842ns
I1109 19:02:10.018244 30673 master.hpp:1439] Sending heartbeat to 8d73e4da-3d5b-4265-9c26-46c7a7908522-0000
I1109 19:02:10.019708 30684 scheduler.cpp:459] Enqueuing event SUBSCRIBED received from master@172.17.6.32:52936
I1109 19:02:10.020117 30684 scheduler.cpp:459] Enqueuing event HEARTBEAT received from master@172.17.6.32:52936
I1109 19:02:10.020989 30682 master_maintenance_tests.cpp:174] Ignoring HEARTBEAT event
I1109 19:02:10.021214 30677 scheduler.cpp:300] Sending REQUEST call to master@172.17.6.32:52936
I1109 19:02:10.023038 30680 process.cpp:3075] Handling HTTP event for process 'master' with
path: '/master/api/v1/scheduler'
I1109 19:02:10.023208 30680 http.cpp:334] HTTP POST for /master/api/v1/scheduler from 172.17.6.32:36113
I1109 19:02:10.023319 30680 master.cpp:2615] Processing REQUEST call for framework 8d73e4da-3d5b-4265-9c26-46c7a7908522-0000
(default)
I1109 19:02:10.023468 30683 hierarchical.cpp:449] Received resource request from framework
8d73e4da-3d5b-4265-9c26-46c7a7908522-0000
I1109 19:02:10.023790 30654 master.cpp:922] Master terminating
I1109 19:02:10.024057 30683 hierarchical.cpp:220] Removed framework 8d73e4da-3d5b-4265-9c26-46c7a7908522-0000
E1109 19:02:10.025877 30680 scheduler.cpp:433] End-Of-File received from master. The master
closed the event stream
[       OK ] ContentType/SchedulerTest.Request/0 (66 ms)
[ RUN      ] ContentType/SchedulerTest.Request/1
I1109 19:02:10.035138 30654 leveldb.cpp:176] Opened db in 2.42659ms
I1109 19:02:10.036551 30654 leveldb.cpp:183] Compacted db in 1.247319ms
I1109 19:02:10.036684 30654 leveldb.cpp:198] Created db iterator in 26316ns
I1109 19:02:10.036800 30654 leveldb.cpp:204] Seeked to beginning of db in 2307ns
I1109 19:02:10.036890 30654 leveldb.cpp:273] Iterated through 0 keys in the db in 421ns
I1109 19:02:10.037070 30654 replica.cpp:780] Replica recovered with log positions 0 ->
0 with 1 holes and 0 unlearned
I1109 19:02:10.038518 30678 recover.cpp:449] Starting replica recovery
I1109 19:02:10.039983 30673 recover.cpp:475] Replica is in EMPTY status
I1109 19:02:10.041174 30678 master.cpp:367] Master f61fff82-f57c-4ae9-ae94-adf0c831ffee (5ab0a7e01929)
started on 172.17.6.32:52936
I1109 19:02:10.041281 30678 master.cpp:369] Flags at startup: --acls="" --allocation_interval="1secs"
--allocator="HierarchicalDRF" --authenticate="false" --authenticate_slaves="true" --authenticators="crammd5"
--authorizers="local" --credentials="/tmp/nNtAG9/credentials" --framework_sorter="drf" --help="false"
--hostname_lookup="true" --initialize_driver_logging="true" --log_auto_initialize="true" --logbufsecs="0"
--logging_level="INFO" --max_slave_ping_timeouts="5" --quiet="false" --recovery_slave_removal_limit="100%"
--registry="replicated_log" --registry_fetch_timeout="1mins" --registry_store_timeout="25secs"
--registry_strict="true" --root_submissions="true" --slave_ping_timeout="15secs" --slave_reregister_timeout="10mins"
--user_sorter="drf" --version="false" --webui_dir="/mesos/mesos-0.26.0/_inst/share/mesos/webui"
--work_dir="/tmp/nNtAG9/master" --zk_session_timeout="10secs"
I1109 19:02:10.041767 30678 master.cpp:416] Master allowing unauthenticated frameworks to
register
I1109 19:02:10.041842 30678 master.cpp:419] Master only allowing authenticated slaves to register
I1109 19:02:10.041941 30678 credentials.hpp:37] Loading credentials for authentication from
'/tmp/nNtAG9/credentials'
I1109 19:02:10.042361 30678 master.cpp:458] Using default 'crammd5' authenticator
I1109 19:02:10.042989 30678 master.cpp:495] Authorization enabled
I1109 19:02:10.043887 30685 hierarchical.cpp:140] Initialized hierarchical allocator process
I1109 19:02:10.043974 30676 whitelist_watcher.cpp:79] No whitelist given
I1109 19:02:10.044028 30674 replica.cpp:676] Replica in EMPTY status received a broadcasted
recover request from (10532)@172.17.6.32:52936
I1109 19:02:10.045053 30679 recover.cpp:195] Received a recover response from a replica in
EMPTY status
I1109 19:02:10.045644 30679 recover.cpp:566] Updating replica status to STARTING
I1109 19:02:10.046455 30681 master.cpp:1606] The newly elected leader is master@172.17.6.32:52936
with id f61fff82-f57c-4ae9-ae94-adf0c831ffee
I1109 19:02:10.046491 30681 master.cpp:1619] Elected as the leading master!
I1109 19:02:10.046511 30681 master.cpp:1379] Recovering from registrar
I1109 19:02:10.046624 30679 leveldb.cpp:306] Persisting metadata (8 bytes) to leveldb took
695710ns
I1109 19:02:10.046654 30679 replica.cpp:323] Persisted replica status to STARTING
I1109 19:02:10.046690 30673 registrar.cpp:309] Recovering registrar
I1109 19:02:10.046874 30679 recover.cpp:475] Replica is in STARTING status
I1109 19:02:10.048998 30682 replica.cpp:676] Replica in STARTING status received a broadcasted
recover request from (10533)@172.17.6.32:52936
I1109 19:02:10.049424 30682 recover.cpp:195] Received a recover response from a replica in
STARTING status
I1109 19:02:10.050065 30686 recover.cpp:566] Updating replica status to VOTING
I1109 19:02:10.051142 30686 leveldb.cpp:306] Persisting metadata (8 bytes) to leveldb took
884930ns
I1109 19:02:10.051175 30686 replica.cpp:323] Persisted replica status to VOTING
I1109 19:02:10.051307 30681 recover.cpp:580] Successfully joined the Paxos group
I1109 19:02:10.051522 30681 recover.cpp:464] Recover process terminated
I1109 19:02:10.052093 30686 log.cpp:661] Attempting to start the writer
I1109 19:02:10.053884 30679 replica.cpp:496] Replica received implicit promise request from
(10534)@172.17.6.32:52936 with proposal 1
I1109 19:02:10.054976 30679 leveldb.cpp:306] Persisting metadata (8 bytes) to leveldb took
1.030211ms
I1109 19:02:10.055023 30679 replica.cpp:345] Persisted promised to 1
I1109 19:02:10.056187 30684 coordinator.cpp:240] Coordinator attempting to fill missing positions
I1109 19:02:10.058007 30679 replica.cpp:391] Replica received explicit promise request from
(10535)@172.17.6.32:52936 for position 0 with proposal 2
I1109 19:02:10.058976 30679 leveldb.cpp:343] Persisting action (8 bytes) to leveldb took 912134ns
I1109 19:02:10.059010 30679 replica.cpp:715] Persisted action at 0
I1109 19:02:10.061100 30674 replica.cpp:540] Replica received write request for position 0
from (10536)@172.17.6.32:52936
I1109 19:02:10.061199 30674 leveldb.cpp:438] Reading position from leveldb took 48329ns
I1109 19:02:10.062981 30674 leveldb.cpp:343] Persisting action (14 bytes) to leveldb took
1.722018ms
I1109 19:02:10.063033 30674 replica.cpp:715] Persisted action at 0
I1109 19:02:10.063982 30679 replica.cpp:694] Replica received learned notice for position
0 from @0.0.0.0:0
I1109 19:02:10.065021 30679 leveldb.cpp:343] Persisting action (16 bytes) to leveldb took
983685ns
I1109 19:02:10.065052 30679 replica.cpp:715] Persisted action at 0
I1109 19:02:10.065078 30679 replica.cpp:700] Replica learned NOP action at position 0
I1109 19:02:10.066002 30675 log.cpp:677] Writer started with ending position 0
I1109 19:02:10.067656 30680 leveldb.cpp:438] Reading position from leveldb took 69853ns
I1109 19:02:10.069013 30681 registrar.cpp:342] Successfully fetched the registry (0B) in 22.270976ms
I1109 19:02:10.069177 30681 registrar.cpp:441] Applied 1 operations in 46509ns; attempting
to update the 'registry'
I1109 19:02:10.070410 30674 log.cpp:685] Attempting to append 174 bytes to the log
I1109 19:02:10.070560 30688 coordinator.cpp:350] Coordinator attempting to write APPEND action
at position 1
I1109 19:02:10.071635 30673 replica.cpp:540] Replica received write request for position 1
from (10537)@172.17.6.32:52936
I1109 19:02:10.072196 30673 leveldb.cpp:343] Persisting action (193 bytes) to leveldb took
508032ns
I1109 19:02:10.072224 30673 replica.cpp:715] Persisted action at 1
I1109 19:02:10.073484 30684 replica.cpp:694] Replica received learned notice for position
1 from @0.0.0.0:0
I1109 19:02:10.073968 30684 leveldb.cpp:343] Persisting action (195 bytes) to leveldb took
446996ns
I1109 19:02:10.073998 30684 replica.cpp:715] Persisted action at 1
I1109 19:02:10.074023 30684 replica.cpp:700] Replica learned APPEND action at position 1
I1109 19:02:10.075920 30684 registrar.cpp:486] Successfully updated the 'registry' in 6.6688ms
I1109 19:02:10.075992 30674 log.cpp:704] Attempting to truncate the log to 1
I1109 19:02:10.076148 30681 coordinator.cpp:350] Coordinator attempting to write TRUNCATE
action at position 2
I1109 19:02:10.078305 30684 registrar.cpp:372] Successfully recovered registrar
I1109 19:02:10.078824 30676 master.cpp:1416] Recovered 0 slaves from the Registry (135B) ;
allowing 10mins for slaves to re-register
I1109 19:02:10.078999 30681 replica.cpp:540] Replica received write request for position 2
from (10538)@172.17.6.32:52936
I1109 19:02:10.081008 30681 leveldb.cpp:343] Persisting action (16 bytes) to leveldb took
1.939855ms
I1109 19:02:10.081082 30681 replica.cpp:715] Persisted action at 2
I1109 19:02:10.082391 30684 replica.cpp:694] Replica received learned notice for position
2 from @0.0.0.0:0
I1109 19:02:10.082979 30684 leveldb.cpp:343] Persisting action (18 bytes) to leveldb took
540475ns
I1109 19:02:10.083050 30684 leveldb.cpp:401] Deleting ~1 keys from leveldb took 36290ns
I1109 19:02:10.083076 30684 replica.cpp:715] Persisted action at 2
I1109 19:02:10.083109 30684 replica.cpp:700] Replica learned TRUNCATE action at position 2
I1109 19:02:10.090214 30654 scheduler.cpp:156] Version: 0.26.0
I1109 19:02:10.091472 30684 scheduler.cpp:238] New master detected at master@172.17.6.32:52936
I1109 19:02:10.093098 30674 scheduler.cpp:300] Sending SUBSCRIBE call to master@172.17.6.32:52936
I1109 19:02:10.096333 30683 process.cpp:3075] Handling HTTP event for process 'master' with
path: '/master/api/v1/scheduler'
I1109 19:02:10.096588 30683 http.cpp:334] HTTP POST for /master/api/v1/scheduler from 172.17.6.32:36114
I1109 19:02:10.097141 30683 master.cpp:1868] Received subscription request for HTTP framework
'default'
I1109 19:02:10.097231 30683 master.cpp:1645] Authorizing framework principal 'test-principal'
to receive offers for role '*'
I1109 19:02:10.102084 30674 master.cpp:1960] Subscribing framework 'default' with checkpointing
disabled and capabilities [  ]
I1109 19:02:10.102829 30684 hierarchical.cpp:185] Added framework f61fff82-f57c-4ae9-ae94-adf0c831ffee-0000
I1109 19:02:10.102901 30684 hierarchical.cpp:971] No resources available to allocate!
I1109 19:02:10.102921 30679 master.hpp:1439] Sending heartbeat to f61fff82-f57c-4ae9-ae94-adf0c831ffee-0000
I1109 19:02:10.102958 30684 hierarchical.cpp:1064] No inverse offers to send out!
I1109 19:02:10.102989 30684 hierarchical.cpp:870] Performed allocation for 0 slaves in 132228ns
I1109 19:02:10.104192 30683 scheduler.cpp:459] Enqueuing event SUBSCRIBED received from master@172.17.6.32:52936
I1109 19:02:10.104949 30683 scheduler.cpp:459] Enqueuing event HEARTBEAT received from master@172.17.6.32:52936
I1109 19:02:10.105516 30683 master_maintenance_tests.cpp:174] Ignoring HEARTBEAT event
I1109 19:02:10.105595 30682 scheduler.cpp:300] Sending REQUEST call to master@172.17.6.32:52936
I1109 19:02:10.107897 30688 process.cpp:3075] Handling HTTP event for process 'master' with
path: '/master/api/v1/scheduler'
I1109 19:02:10.108129 30688 http.cpp:334] HTTP POST for /master/api/v1/scheduler from 172.17.6.32:36115
I1109 19:02:10.108494 30688 master.cpp:2615] Processing REQUEST call for framework f61fff82-f57c-4ae9-ae94-adf0c831ffee-0000
(default)
I1109 19:02:10.108703 30682 hierarchical.cpp:449] Received resource request from framework
f61fff82-f57c-4ae9-ae94-adf0c831ffee-0000
I1109 19:02:10.109242 30688 master.cpp:922] Master terminating
I1109 19:02:10.109516 30687 hierarchical.cpp:220] Removed framework f61fff82-f57c-4ae9-ae94-adf0c831ffee-0000
E1109 19:02:10.110888 30687 scheduler.cpp:433] End-Of-File received from master. The master
closed the event stream
[       OK ] ContentType/SchedulerTest.Request/1 (84 ms)
[----------] 22 tests from ContentType/SchedulerTest (5128 ms total)

[----------] Global test environment tear-down
[==========] 826 tests from 112 test cases ran. (366223 ms total)
[  PASSED  ] 825 tests.
[  FAILED  ] 1 test, listed below:
[  FAILED  ] FetcherCacheHttpTest.HttpCachedSerialized

 1 FAILED TEST
  YOU HAVE 7 DISABLED TESTS

make[4]: *** [check-local] Error 1
make[4]: Leaving directory `/mesos/mesos-0.26.0/_build/src'
make[3]: *** [check-am] Error 2
make[3]: Leaving directory `/mesos/mesos-0.26.0/_build/src'
make[2]: *** [check] Error 2
make[2]: Leaving directory `/mesos/mesos-0.26.0/_build/src'
make[1]: *** [check-recursive] Error 1
make[1]: Leaving directory `/mesos/mesos-0.26.0/_build'
make: *** [distcheck] Error 1
+ docker rmi mesos-1447093442-7350
Untagged: mesos-1447093442-7350:latest
Deleted: 9c1c21b5c2d8ebbee5b792c2ed7bbb21ce913a81660a3cc47ee7a253ca82abf9
Deleted: 71f2446551bbb57d983e95c1a9d803a2cb493d6c03facebfabd44cd98a3ab01a
Deleted: 83a571be184e8b7128f566941cc90f8e58e5e692e49ba41f67fc7b7aa77e63c5
Deleted: 8e53e98984c01d53ee91ffe0598305ac516b72c937497e972352f5ef6ea2bf5b
Deleted: d9d762f13c61f252a365b16668f6a50be34cabae40243cba42816cbd18a14f47
Deleted: ac309f62824d46cd3cee81ef00e2f23336953f4378b503191cd26d3c29ba7b0d
Deleted: 6b3c1690d9965dc8640ff071256062e8256cd9b3fd4a661b9d845c6ef99f813c
Deleted: a4b720f0460c634cee009806cfd9bd55737b6b1e0feb7a297123380989a971d6
Deleted: c6f03179eaef62d64b0b2df5b6e096475a7a03fa4e7fb3a0a9fc8a70149f8441
Deleted: c392dfd9c6197011b62f25e665ccc0f85b696779a0be3d1a7acf2a70a369355d
Deleted: a13a18898743340d9ae59ec3a7ef8da7a3820eae26448ac28e4b136a8b7de109
Deleted: 467a89c4f087535fd876734be76e764c67b58b45f538cc15c033e69581a6e639
Build step 'Execute shell' marked build as failure

Mime
View raw message