mesos-builds mailing list archives

Site index · List index
Message view « Date » · « Thread »
Top « Date » · « Thread »
From Apache Jenkins Server <jenk...@builds.apache.org>
Subject Build failed in Jenkins: Mesos » gcc,--verbose,centos:7,docker||Hadoop #1182
Date Fri, 06 Nov 2015 11:24:26 GMT
See <https://builds.apache.org/job/Mesos/COMPILER=gcc,CONFIGURATION=--verbose,OS=centos%3A7,label_exp=docker%7C%7CHadoop/1182/changes>

Changes:

[adam] Updated /site to reflect Niklas' 0.25.0 changes that weren't reflected

------------------------------------------
[...truncated 17316 lines...]
byte-compiling build/bdist.linux-x86_64/egg/mesos/__init__.py to __init__.pyc
creating stub loader for mesos/native/_mesos.so
byte-compiling build/bdist.linux-x86_64/egg/mesos/native/_mesos.py to _mesos.pyc
creating build/bdist.linux-x86_64/egg/EGG-INFO
copying src/mesos.native.egg-info/PKG-INFO -> build/bdist.linux-x86_64/egg/EGG-INFO
copying src/mesos.native.egg-info/SOURCES.txt -> build/bdist.linux-x86_64/egg/EGG-INFO
copying src/mesos.native.egg-info/dependency_links.txt -> build/bdist.linux-x86_64/egg/EGG-INFO
copying src/mesos.native.egg-info/namespace_packages.txt -> build/bdist.linux-x86_64/egg/EGG-INFO
copying src/mesos.native.egg-info/requires.txt -> build/bdist.linux-x86_64/egg/EGG-INFO
copying src/mesos.native.egg-info/top_level.txt -> build/bdist.linux-x86_64/egg/EGG-INFO
writing build/bdist.linux-x86_64/egg/EGG-INFO/native_libs.txt
zip_safe flag not set; analyzing archive contents...
mesos.__init__: module references __path__
creating '/mesos/mesos-0.26.0/_build/src/python/dist/mesos.native-0.26.0-py2.7-linux-x86_64.egg' and adding 'build/bdist.linux-x86_64/egg' to it
removing 'build/bdist.linux-x86_64/egg' (and everything under it)
running bdist_wheel
running build
installing to build/bdist.linux-x86_64/wheel
running install
running install_lib
Skipping installation of build/bdist.linux-x86_64/wheel/mesos/__init__.py (namespace package)
copying mesos/native/_mesos.so -> build/bdist.linux-x86_64/wheel/mesos/native
copying mesos/native/__init__.py -> build/bdist.linux-x86_64/wheel/mesos/native
running install_egg_info
Copying src/mesos.native.egg-info to build/bdist.linux-x86_64/wheel/mesos.native-0.26.0-py2.7.egg-info
Installing build/bdist.linux-x86_64/wheel/mesos.native-0.26.0-py2.7-nspkg.pth
running install_scripts
creating build/bdist.linux-x86_64/wheel/mesos.native-0.26.0.dist-info/WHEEL
make  event-call-framework test-framework test-executor long-lived-framework long-lived-executor no-executor-framework docker-no-executor-framework balloon-framework balloon-executor load-generator-framework persistent-volume-framework setns-test-helper memory-test-helper active-user-test-helper mesos-tests examples/java/test-framework examples/java/test-executor examples/java/test-exception-framework examples/java/test-multiple-executors-framework examples/java/test-log examples/python/test_containerizer.py examples/python/test-containerizer examples/python/test_framework.py examples/python/test-framework examples/python/test_executor.py examples/python/test-executor \
  tests/balloon_framework_test.sh tests/event_call_framework_test.sh tests/java_exception_test.sh tests/java_framework_test.sh tests/java_log_test.sh tests/no_executor_framework_test.sh tests/persistent_volume_framework_test.sh tests/python_framework_test.sh tests/test_framework_test.sh
make[4]: Entering directory `/mesos/mesos-0.26.0/_build/src'
g++ -DPACKAGE_NAME=\"mesos\" -DPACKAGE_TARNAME=\"mesos\" -DPACKAGE_VERSION=\"0.26.0\" -DPACKAGE_STRING=\"mesos\ 0.26.0\" -DPACKAGE_BUGREPORT=\"\" -DPACKAGE_URL=\"\" -DPACKAGE=\"mesos\" -DVERSION=\"0.26.0\" -DSTDC_HEADERS=1 -DHAVE_SYS_TYPES_H=1 -DHAVE_SYS_STAT_H=1 -DHAVE_STDLIB_H=1 -DHAVE_STRING_H=1 -DHAVE_MEMORY_H=1 -DHAVE_STRINGS_H=1 -DHAVE_INTTYPES_H=1 -DHAVE_STDINT_H=1 -DHAVE_UNISTD_H=1 -DHAVE_DLFCN_H=1 -DLT_OBJDIR=\".libs/\" -DHAVE_PTHREAD_PRIO_INHERIT=1 -DHAVE_PTHREAD=1 -DHAVE_LIBZ=1 -DHAVE_LIBCURL=1 -DHAVE_APR_POOLS_H=1 -DHAVE_LIBAPR_1=1 -DHAVE_SVN_VERSION_H=1 -DHAVE_LIBSVN_SUBR_1=1 -DHAVE_SVN_DELTA_H=1 -DHAVE_LIBSVN_DELTA_1=1 -DHAVE_LIBSASL2=1 -DMESOS_HAS_JAVA=1 -DHAVE_PYTHON=\"2.7\" -DMESOS_HAS_PYTHON=1 -I. -I../../src   -Wall -Werror -DLIBDIR=\"/mesos/mesos-0.26.0/_inst/lib\" -DPKGLIBEXECDIR=\"/mesos/mesos-0.26.0/_inst/libexec/mesos\" -DPKGDATADIR=\"/mesos/mesos-0.26.0/_inst/share/mesos\" -I../../include -I../../3rdparty/libprocess/include -I../../3rdparty/libprocess/3rdparty/stout/include -I../include -I../include/mesos -I../3rdparty/libprocess/3rdparty/boost-1.53.0 -I../3rdparty/libprocess/3rdparty/picojson-1.3.0 -DPICOJSON_USE_INT64 -D__STDC_FORMAT_MACROS -I../3rdparty/libprocess/3rdparty/protobuf-2.5.0/src -I../3rdparty/libprocess/3rdparty/glog-0.3.3/src -I../3rdparty/libprocess/3rdparty/glog-0.3.3/src -I../3rdparty/leveldb/include -I../3rdparty/zookeeper-3.4.5/src/c/include -I../3rdparty/zookeeper-3.4.5/src/c/generated -I../3rdparty/libprocess/3rdparty/protobuf-2.5.0/src -I/usr/include/subversion-1 -I/usr/include/apr-1 -I/usr/include/apr-1.0  -pthread -g1 -O0 -Wno-unused-local-typedefs -std=c++11 -MT examples/event_call_framework-event_call_framework.o -MD -MP -MF examples/.deps/event_call_framework-event_call_framework.Tpo -c -o examples/event_call_framework-event_call_framework.o `test -f 'examples/event_call_framework.cpp' || echo '../../src/'`examples/event_call_framework.cpp
g++ -DPACKAGE_NAME=\"mesos\" -DPACKAGE_TARNAME=\"mesos\" -DPACKAGE_VERSION=\"0.26.0\" -DPACKAGE_STRING=\"mesos\ 0.26.0\" -DPACKAGE_BUGREPORT=\"\" -DPACKAGE_URL=\"\" -DPACKAGE=\"mesos\" -DVERSION=\"0.26.0\" -DSTDC_HEADERS=1 -DHAVE_SYS_TYPES_H=1 -DHAVE_SYS_STAT_H=1 -DHAVE_STDLIB_H=1 -DHAVE_STRING_H=1 -DHAVE_MEMORY_H=1 -DHAVE_STRINGS_H=1 -DHAVE_INTTYPES_H=1 -DHAVE_STDINT_H=1 -DHAVE_UNISTD_H=1 -DHAVE_DLFCN_H=1 -DLT_OBJDIR=\".libs/\" -DHAVE_PTHREAD_PRIO_INHERIT=1 -DHAVE_PTHREAD=1 -DHAVE_LIBZ=1 -DHAVE_LIBCURL=1 -DHAVE_APR_POOLS_H=1 -DHAVE_LIBAPR_1=1 -DHAVE_SVN_VERSION_H=1 -DHAVE_LIBSVN_SUBR_1=1 -DHAVE_SVN_DELTA_H=1 -DHAVE_LIBSVN_DELTA_1=1 -DHAVE_LIBSASL2=1 -DMESOS_HAS_JAVA=1 -DHAVE_PYTHON=\"2.7\" -DMESOS_HAS_PYTHON=1 -I. -I../../src   -Wall -Werror -DLIBDIR=\"/mesos/mesos-0.26.0/_inst/lib\" -DPKGLIBEXECDIR=\"/mesos/mesos-0.26.0/_inst/libexec/mesos\" -DPKGDATADIR=\"/mesos/mesos-0.26.0/_inst/share/mesos\" -I../../include -I../../3rdparty/libprocess/include -I../../3rdparty/libprocess/3rdparty/stout/include -I../include -I../include/mesos -I../3rdparty/libprocess/3rdparty/boost-1.53.0 -I../3rdparty/libprocess/3rdparty/picojson-1.3.0 -DPICOJSON_USE_INT64 -D__STDC_FORMAT_MACROS -I../3rdparty/libprocess/3rdparty/protobuf-2.5.0/src -I../3rdparty/libprocess/3rdparty/glog-0.3.3/src -I../3rdparty/libprocess/3rdparty/glog-0.3.3/src -I../3rdparty/leveldb/include -I../3rdparty/zookeeper-3.4.5/src/c/include -I../3rdparty/zookeeper-3.4.5/src/c/generated -I../3rdparty/libprocess/3rdparty/protobuf-2.5.0/src -I/usr/include/subversion-1 -I/usr/include/apr-1 -I/usr/include/apr-1.0  -pthread -g1 -O0 -Wno-unused-local-typedefs -std=c++11 -MT examples/test_framework-test_framework.o -MD -MP -MF examples/.deps/test_framework-test_framework.Tpo -c -o examples/test_framework-test_framework.o `test -f 'examples/test_framework.cpp' || echo '../../src/'`examples/test_framework.cpp
g++ -DPACKAGE_NAME=\"mesos\" -DPACKAGE_TARNAME=\"mesos\" -DPACKAGE_VERSION=\"0.26.0\" -DPACKAGE_STRING=\"mesos\ 0.26.0\" -DPACKAGE_BUGREPORT=\"\" -DPACKAGE_URL=\"\" -DPACKAGE=\"mesos\" -DVERSION=\"0.26.0\" -DSTDC_HEADERS=1 -DHAVE_SYS_TYPES_H=1 -DHAVE_SYS_STAT_H=1 -DHAVE_STDLIB_H=1 -DHAVE_STRING_H=1 -DHAVE_MEMORY_H=1 -DHAVE_STRINGS_H=1 -DHAVE_INTTYPES_H=1 -DHAVE_STDINT_H=1 -DHAVE_UNISTD_H=1 -DHAVE_DLFCN_H=1 -DLT_OBJDIR=\".libs/\" -DHAVE_PTHREAD_PRIO_INHERIT=1 -DHAVE_PTHREAD=1 -DHAVE_LIBZ=1 -DHAVE_LIBCURL=1 -DHAVE_APR_POOLS_H=1 -DHAVE_LIBAPR_1=1 -DHAVE_SVN_VERSION_H=1 -DHAVE_LIBSVN_SUBR_1=1 -DHAVE_SVN_DELTA_H=1 -DHAVE_LIBSVN_DELTA_1=1 -DHAVE_LIBSASL2=1 -DMESOS_HAS_JAVA=1 -DHAVE_PYTHON=\"2.7\" -DMESOS_HAS_PYTHON=1 -I. -I../../src   -Wall -Werror -DLIBDIR=\"/mesos/mesos-0.26.0/_inst/lib\" -DPKGLIBEXECDIR=\"/mesos/mesos-0.26.0/_inst/libexec/mesos\" -DPKGDATADIR=\"/mesos/mesos-0.26.0/_inst/share/mesos\" -I../../include -I../../3rdparty/libprocess/include -I../../3rdparty/libprocess/3rdparty/stout/include -I../include -I../include/mesos -I../3rdparty/libprocess/3rdparty/boost-1.53.0 -I../3rdparty/libprocess/3rdparty/picojson-1.3.0 -DPICOJSON_USE_INT64 -D__STDC_FORMAT_MACROS -I../3rdparty/libprocess/3rdparty/protobuf-2.5.0/src -I../3rdparty/libprocess/3rdparty/glog-0.3.3/src -I../3rdparty/libprocess/3rdparty/glog-0.3.3/src -I../3rdparty/leveldb/include -I../3rdparty/zookeeper-3.4.5/src/c/include -I../3rdparty/zookeeper-3.4.5/src/c/generated -I../3rdparty/libprocess/3rdparty/protobuf-2.5.0/src -I/usr/include/subversion-1 -I/usr/include/apr-1 -I/usr/include/apr-1.0  -pthread -g1 -O0 -Wno-unused-local-typedefs -std=c++11 -MT examples/test_executor-test_executor.o -MD -MP -MF examples/.deps/test_executor-test_executor.Tpo -c -o examples/test_executor-test_executor.o `test -f 'examples/test_executor.cpp' || echo '../../src/'`examples/test_executor.cpp
g++ -DPACKAGE_NAME=\"mesos\" -DPACKAGE_TARNAME=\"mesos\" -DPACKAGE_VERSION=\"0.26.0\" -DPACKAGE_STRING=\"mesos\ 0.26.0\" -DPACKAGE_BUGREPORT=\"\" -DPACKAGE_URL=\"\" -DPACKAGE=\"mesos\" -DVERSION=\"0.26.0\" -DSTDC_HEADERS=1 -DHAVE_SYS_TYPES_H=1 -DHAVE_SYS_STAT_H=1 -DHAVE_STDLIB_H=1 -DHAVE_STRING_H=1 -DHAVE_MEMORY_H=1 -DHAVE_STRINGS_H=1 -DHAVE_INTTYPES_H=1 -DHAVE_STDINT_H=1 -DHAVE_UNISTD_H=1 -DHAVE_DLFCN_H=1 -DLT_OBJDIR=\".libs/\" -DHAVE_PTHREAD_PRIO_INHERIT=1 -DHAVE_PTHREAD=1 -DHAVE_LIBZ=1 -DHAVE_LIBCURL=1 -DHAVE_APR_POOLS_H=1 -DHAVE_LIBAPR_1=1 -DHAVE_SVN_VERSION_H=1 -DHAVE_LIBSVN_SUBR_1=1 -DHAVE_SVN_DELTA_H=1 -DHAVE_LIBSVN_DELTA_1=1 -DHAVE_LIBSASL2=1 -DMESOS_HAS_JAVA=1 -DHAVE_PYTHON=\"2.7\" -DMESOS_HAS_PYTHON=1 -I. -I../../src   -Wall -Werror -DLIBDIR=\"/mesos/mesos-0.26.0/_inst/lib\" -DPKGLIBEXECDIR=\"/mesos/mesos-0.26.0/_inst/libexec/mesos\" -DPKGDATADIR=\"/mesos/mesos-0.26.0/_inst/share/mesos\" -I../../include -I../../3rdparty/libprocess/include -I../../3rdparty/libprocess/3rdparty/stout/include -I../include -I../include/mesos -I../3rdparty/libprocess/3rdparty/boost-1.53.0 -I../3rdparty/libprocess/3rdparty/picojson-1.3.0 -DPICOJSON_USE_INT64 -D__STDC_FORMAT_MACROS -I../3rdparty/libprocess/3rdparty/protobuf-2.5.0/src -I../3rdparty/libprocess/3rdparty/glog-0.3.3/src -I../3rdparty/libprocess/3rdparty/glog-0.3.3/src -I../3rdparty/leveldb/include -I../3rdparty/zookeeper-3.4.5/src/c/include -I../3rdparty/zookeeper-3.4.5/src/c/generated -I../3rdparty/libprocess/3rdparty/protobuf-2.5.0/src -I/usr/include/subversion-1 -I/usr/include/apr-1 -I/usr/include/apr-1.0  -pthread -g1 -O0 -Wno-unused-local-typedefs -std=c++11 -MT examples/long_lived_framework-long_lived_framework.o -MD -MP -MF examples/.deps/long_lived_framework-long_lived_framework.Tpo -c -o examples/long_lived_framework-long_lived_framework.o `test -f 'examples/long_lived_framework.cpp' || echo '../../src/'`examples/long_lived_framework.cpp
g++ -DPACKAGE_NAME=\"mesos\" -DPACKAGE_TARNAME=\"mesos\" -DPACKAGE_VERSION=\"0.26.0\" -DPACKAGE_STRING=\"mesos\ 0.26.0\" -DPACKAGE_BUGREPORT=\"\" -DPACKAGE_URL=\"\" -DPACKAGE=\"mesos\" -DVERSION=\"0.26.0\" -DSTDC_HEADERS=1 -DHAVE_SYS_TYPES_H=1 -DHAVE_SYS_STAT_H=1 -DHAVE_STDLIB_H=1 -DHAVE_STRING_H=1 -DHAVE_MEMORY_H=1 -DHAVE_STRINGS_H=1 -DHAVE_INTTYPES_H=1 -DHAVE_STDINT_H=1 -DHAVE_UNISTD_H=1 -DHAVE_DLFCN_H=1 -DLT_OBJDIR=\".libs/\" -DHAVE_PTHREAD_PRIO_INHERIT=1 -DHAVE_PTHREAD=1 -DHAVE_LIBZ=1 -DHAVE_LIBCURL=1 -DHAVE_APR_POOLS_H=1 -DHAVE_LIBAPR_1=1 -DHAVE_SVN_VERSION_H=1 -DHAVE_LIBSVN_SUBR_1=1 -DHAVE_SVN_DELTA_H=1 -DHAVE_LIBSVN_DELTA_1=1 -DHAVE_LIBSASL2=1 -DMESOS_HAS_JAVA=1 -DHAVE_PYTHON=\"2.7\" -DMESOS_HAS_PYTHON=1 -I. -I../../src   -Wall -Werror -DLIBDIR=\"/mesos/mesos-0.26.0/_inst/lib\" -DPKGLIBEXECDIR=\"/mesos/mesos-0.26.0/_inst/libexec/mesos\" -DPKGDATADIR=\"/mesos/mesos-0.26.0/_inst/share/mesos\" -I../../include -I../../3rdparty/libprocess/include -I../../3rdparty/libprocess/3rdparty/stout/include -I../include -I../include/mesos -I../3rdparty/libprocess/3rdparty/boost-1.53.0 -I../3rdparty/libprocess/3rdparty/picojson-1.3.0 -DPICOJSON_USE_INT64 -D__STDC_FORMAT_MACROS -I../3rdparty/libprocess/3rdparty/protobuf-2.5.0/src -I../3rdparty/libprocess/3rdparty/glog-0.3.3/src -I../3rdparty/libprocess/3rdparty/glog-0.3.3/src -I../3rdparty/leveldb/include -I../3rdparty/zookeeper-3.4.5/src/c/include -I../3rdparty/zookeeper-3.4.5/src/c/generated -I../3rdparty/libprocess/3rdparty/protobuf-2.5.0/src -I/usr/include/subversion-1 -I/usr/include/apr-1 -I/usr/include/apr-1.0  -pthread -g1 -O0 -Wno-unused-local-typedefs -std=c++11 -MT examples/long_lived_executor-long_lived_executor.o -MD -MP -MF examples/.deps/long_lived_executor-long_lived_executor.Tpo -c -o examples/long_lived_executor-long_lived_executor.o `test -f 'examples/long_lived_executor.cpp' || echo '../../src/'`examples/long_lived_executor.cpp
g++ -DPACKAGE_NAME=\"mesos\" -DPACKAGE_TARNAME=\"mesos\" -DPACKAGE_VERSION=\"0.26.0\" -DPACKAGE_STRING=\"mesos\ 0.26.0\" -DPACKAGE_BUGREPORT=\"\" -DPACKAGE_URL=\"\" -DPACKAGE=\"mesos\" -DVERSION=\"0.26.0\" -DSTDC_HEADERS=1 -DHAVE_SYS_TYPES_H=1 -DHAVE_SYS_STAT_H=1 -DHAVE_STDLIB_H=1 -DHAVE_STRING_H=1 -DHAVE_MEMORY_H=1 -DHAVE_STRINGS_H=1 -DHAVE_INTTYPES_H=1 -DHAVE_STDINT_H=1 -DHAVE_UNISTD_H=1 -DHAVE_DLFCN_H=1 -DLT_OBJDIR=\".libs/\" -DHAVE_PTHREAD_PRIO_INHERIT=1 -DHAVE_PTHREAD=1 -DHAVE_LIBZ=1 -DHAVE_LIBCURL=1 -DHAVE_APR_POOLS_H=1 -DHAVE_LIBAPR_1=1 -DHAVE_SVN_VERSION_H=1 -DHAVE_LIBSVN_SUBR_1=1 -DHAVE_SVN_DELTA_H=1 -DHAVE_LIBSVN_DELTA_1=1 -DHAVE_LIBSASL2=1 -DMESOS_HAS_JAVA=1 -DHAVE_PYTHON=\"2.7\" -DMESOS_HAS_PYTHON=1 -I. -I../../src   -Wall -Werror -DLIBDIR=\"/mesos/mesos-0.26.0/_inst/lib\" -DPKGLIBEXECDIR=\"/mesos/mesos-0.26.0/_inst/libexec/mesos\" -DPKGDATADIR=\"/mesos/mesos-0.26.0/_inst/share/mesos\" -I../../include -I../../3rdparty/libprocess/include -I../../3rdparty/libprocess/3rdparty/stout/include -I../include -I../include/mesos -I../3rdparty/libprocess/3rdparty/boost-1.53.0 -I../3rdparty/libprocess/3rdparty/picojson-1.3.0 -DPICOJSON_USE_INT64 -D__STDC_FORMAT_MACROS -I../3rdparty/libprocess/3rdparty/protobuf-2.5.0/src -I../3rdparty/libprocess/3rdparty/glog-0.3.3/src -I../3rdparty/libprocess/3rdparty/glog-0.3.3/src -I../3rdparty/leveldb/include -I../3rdparty/zookeeper-3.4.5/src/c/include -I../3rdparty/zookeeper-3.4.5/src/c/generated -I../3rdparty/libprocess/3rdparty/protobuf-2.5.0/src -I/usr/include/subversion-1 -I/usr/include/apr-1 -I/usr/include/apr-1.0  -pthread -g1 -O0 -Wno-unused-local-typedefs -std=c++11 -MT examples/no_executor_framework-no_executor_framework.o -MD -MP -MF examples/.deps/no_executor_framework-no_executor_framework.Tpo -c -o examples/no_executor_framework-no_executor_framework.o `test -f 'examples/no_executor_framework.cpp' || echo '../../src/'`examples/no_executor_framework.cpp
g++ -DPACKAGE_NAME=\"mesos\" -DPACKAGE_TARNAME=\"mesos\" -DPACKAGE_VERSION=\"0.26.0\" -DPACKAGE_STRING=\"mesos\ 0.26.0\" -DPACKAGE_BUGREPORT=\"\" -DPACKAGE_URL=\"\" -DPACKAGE=\"mesos\" -DVERSION=\"0.26.0\" -DSTDC_HEADERS=1 -DHAVE_SYS_TYPES_H=1 -DHAVE_SYS_STAT_H=1 -DHAVE_STDLIB_H=1 -DHAVE_STRING_H=1 -DHAVE_MEMORY_H=1 -DHAVE_STRINGS_H=1 -DHAVE_INTTYPES_H=1 -DHAVE_STDINT_H=1 -DHAVE_UNISTD_H=1 -DHAVE_DLFCN_H=1 -DLT_OBJDIR=\".libs/\" -DHAVE_PTHREAD_PRIO_INHERIT=1 -DHAVE_PTHREAD=1 -DHAVE_LIBZ=1 -DHAVE_LIBCURL=1 -DHAVE_APR_POOLS_H=1 -DHAVE_LIBAPR_1=1 -DHAVE_SVN_VERSION_H=1 -DHAVE_LIBSVN_SUBR_1=1 -DHAVE_SVN_DELTA_H=1 -DHAVE_LIBSVN_DELTA_1=1 -DHAVE_LIBSASL2=1 -DMESOS_HAS_JAVA=1 -DHAVE_PYTHON=\"2.7\" -DMESOS_HAS_PYTHON=1 -I. -I../../src   -Wall -Werror -DLIBDIR=\"/mesos/mesos-0.26.0/_inst/lib\" -DPKGLIBEXECDIR=\"/mesos/mesos-0.26.0/_inst/libexec/mesos\" -DPKGDATADIR=\"/mesos/mesos-0.26.0/_inst/share/mesos\" -I../../include -I../../3rdparty/libprocess/include -I../../3rdparty/libprocess/3rdparty/stout/include -I../include -I../include/mesos -I../3rdparty/libprocess/3rdparty/boost-1.53.0 -I../3rdparty/libprocess/3rdparty/picojson-1.3.0 -DPICOJSON_USE_INT64 -D__STDC_FORMAT_MACROS -I../3rdparty/libprocess/3rdparty/protobuf-2.5.0/src -I../3rdparty/libprocess/3rdparty/glog-0.3.3/src -I../3rdparty/libprocess/3rdparty/glog-0.3.3/src -I../3rdparty/leveldb/include -I../3rdparty/zookeeper-3.4.5/src/c/include -I../3rdparty/zookeeper-3.4.5/src/c/generated -I../3rdparty/libprocess/3rdparty/protobuf-2.5.0/src -I/usr/include/subversion-1 -I/usr/include/apr-1 -I/usr/include/apr-1.0  -pthread -g1 -O0 -Wno-unused-local-typedefs -std=c++11 -MT examples/docker_no_executor_framework-docker_no_executor_framework.o -MD -MP -MF examples/.deps/docker_no_executor_framework-docker_no_executor_framework.Tpo -c -o examples/docker_no_executor_framework-docker_no_executor_framework.o `test -f 'examples/docker_no_executor_framework.cpp' || echo '../../src/'`examples/docker_no_executor_framework.cpp
g++ -DPACKAGE_NAME=\"mesos\" -DPACKAGE_TARNAME=\"mesos\" -DPACKAGE_VERSION=\"0.26.0\" -DPACKAGE_STRING=\"mesos\ 0.26.0\" -DPACKAGE_BUGREPORT=\"\" -DPACKAGE_URL=\"\" -DPACKAGE=\"mesos\" -DVERSION=\"0.26.0\" -DSTDC_HEADERS=1 -DHAVE_SYS_TYPES_H=1 -DHAVE_SYS_STAT_H=1 -DHAVE_STDLIB_H=1 -DHAVE_STRING_H=1 -DHAVE_MEMORY_H=1 -DHAVE_STRINGS_H=1 -DHAVE_INTTYPES_H=1 -DHAVE_STDINT_H=1 -DHAVE_UNISTD_H=1 -DHAVE_DLFCN_H=1 -DLT_OBJDIR=\".libs/\" -DHAVE_PTHREAD_PRIO_INHERIT=1 -DHAVE_PTHREAD=1 -DHAVE_LIBZ=1 -DHAVE_LIBCURL=1 -DHAVE_APR_POOLS_H=1 -DHAVE_LIBAPR_1=1 -DHAVE_SVN_VERSION_H=1 -DHAVE_LIBSVN_SUBR_1=1 -DHAVE_SVN_DELTA_H=1 -DHAVE_LIBSVN_DELTA_1=1 -DHAVE_LIBSASL2=1 -DMESOS_HAS_JAVA=1 -DHAVE_PYTHON=\"2.7\" -DMESOS_HAS_PYTHON=1 -I. -I../../src   -Wall -Werror -DLIBDIR=\"/mesos/mesos-0.26.0/_inst/lib\" -DPKGLIBEXECDIR=\"/mesos/mesos-0.26.0/_inst/libexec/mesos\" -DPKGDATADIR=\"/mesos/mesos-0.26.0/_inst/share/mesos\" -I../../include -I../../3rdparty/libprocess/include -I../../3rdparty/libprocess/3rdparty/stout/include -I../include -I../include/mesos -I../3rdparty/libprocess/3rdparty/boost-1.53.0 -I../3rdparty/libprocess/3rdparty/picojson-1.3.0 -DPICOJSON_USE_INT64 -D__STDC_FORMAT_MACROS -I../3rdparty/libprocess/3rdparty/protobuf-2.5.0/src -I../3rdparty/libprocess/3rdparty/glog-0.3.3/src -I../3rdparty/libprocess/3rdparty/glog-0.3.3/src -I../3rdparty/leveldb/include -I../3rdparty/zookeeper-3.4.5/src/c/include -I../3rdparty/zookeeper-3.4.5/src/c/generated -I../3rdparty/libprocess/3rdparty/protobuf-2.5.0/src -I/usr/include/subversion-1 -I/usr/include/apr-1 -I/usr/include/apr-1.0  -pthread -g1 -O0 -Wno-unused-local-typedefs -std=c++11 -MT examples/balloon_framework-balloon_framework.o -MD -MP -MF examples/.deps/balloon_framework-balloon_framework.Tpo -c -o examples/balloon_framework-balloon_framework.o `test -f 'examples/balloon_framework.cpp' || echo '../../src/'`examples/balloon_framework.cpp
mv -f examples/.deps/test_executor-test_executor.Tpo examples/.deps/test_executor-test_executor.Po
g++ -DPACKAGE_NAME=\"mesos\" -DPACKAGE_TARNAME=\"mesos\" -DPACKAGE_VERSION=\"0.26.0\" -DPACKAGE_STRING=\"mesos\ 0.26.0\" -DPACKAGE_BUGREPORT=\"\" -DPACKAGE_URL=\"\" -DPACKAGE=\"mesos\" -DVERSION=\"0.26.0\" -DSTDC_HEADERS=1 -DHAVE_SYS_TYPES_H=1 -DHAVE_SYS_STAT_H=1 -DHAVE_STDLIB_H=1 -DHAVE_STRING_H=1 -DHAVE_MEMORY_H=1 -DHAVE_STRINGS_H=1 -DHAVE_INTTYPES_H=1 -DHAVE_STDINT_H=1 -DHAVE_UNISTD_H=1 -DHAVE_DLFCN_H=1 -DLT_OBJDIR=\".libs/\" -DHAVE_PTHREAD_PRIO_INHERIT=1 -DHAVE_PTHREAD=1 -DHAVE_LIBZ=1 -DHAVE_LIBCURL=1 -DHAVE_APR_POOLS_H=1 -DHAVE_LIBAPR_1=1 -DHAVE_SVN_VERSION_H=1 -DHAVE_LIBSVN_SUBR_1=1 -DHAVE_SVN_DELTA_H=1 -DHAVE_LIBSVN_DELTA_1=1 -DHAVE_LIBSASL2=1 -DMESOS_HAS_JAVA=1 -DHAVE_PYTHON=\"2.7\" -DMESOS_HAS_PYTHON=1 -I. -I../../src   -Wall -Werror -DLIBDIR=\"/mesos/mesos-0.26.0/_inst/lib\" -DPKGLIBEXECDIR=\"/mesos/mesos-0.26.0/_inst/libexec/mesos\" -DPKGDATADIR=\"/mesos/mesos-0.26.0/_inst/share/mesos\" -I../../include -I../../3rdparty/libprocess/include -I../../3rdparty/libprocess/3rdparty/stout/include -I../include -I../include/mesos -I../3rdparty/libprocess/3rdparty/boost-1.53.0 -I../3rdparty/libprocess/3rdparty/picojson-1.3.0 -DPICOJSON_USE_INT64 -D__STDC_FORMAT_MACROS -I../3rdparty/libprocess/3rdparty/protobuf-2.5.0/src -I../3rdparty/libprocess/3rdparty/glog-0.3.3/src -I../3rdparty/libprocess/3rdparty/glog-0.3.3/src -I../3rdparty/leveldb/include -I../3rdparty/zookeeper-3.4.5/src/c/include -I../3rdparty/zookeeper-3.4.5/src/c/generated -I../3rdparty/libprocess/3rdparty/protobuf-2.5.0/src -I/usr/include/subversion-1 -I/usr/include/apr-1 -I/usr/include/apr-1.0  -pthread -g1 -O0 -Wno-unused-local-typedefs -std=c++11 -MT examples/balloon_executor-balloon_executor.o -MD -MP -MF examples/.deps/balloon_executor-balloon_executor.Tpo -c -o examples/balloon_executor-balloon_executor.o `test -f 'examples/balloon_executor.cpp' || echo '../../src/'`examples/balloon_executor.cpp
mv -f examples/.deps/long_lived_framework-long_lived_framework.Tpo examples/.deps/long_lived_framework-long_lived_framework.Po
g++ -DPACKAGE_NAME=\"mesos\" -DPACKAGE_TARNAME=\"mesos\" -DPACKAGE_VERSION=\"0.26.0\" -DPACKAGE_STRING=\"mesos\ 0.26.0\" -DPACKAGE_BUGREPORT=\"\" -DPACKAGE_URL=\"\" -DPACKAGE=\"mesos\" -DVERSION=\"0.26.0\" -DSTDC_HEADERS=1 -DHAVE_SYS_TYPES_H=1 -DHAVE_SYS_STAT_H=1 -DHAVE_STDLIB_H=1 -DHAVE_STRING_H=1 -DHAVE_MEMORY_H=1 -DHAVE_STRINGS_H=1 -DHAVE_INTTYPES_H=1 -DHAVE_STDINT_H=1 -DHAVE_UNISTD_H=1 -DHAVE_DLFCN_H=1 -DLT_OBJDIR=\".libs/\" -DHAVE_PTHREAD_PRIO_INHERIT=1 -DHAVE_PTHREAD=1 -DHAVE_LIBZ=1 -DHAVE_LIBCURL=1 -DHAVE_APR_POOLS_H=1 -DHAVE_LIBAPR_1=1 -DHAVE_SVN_VERSION_H=1 -DHAVE_LIBSVN_SUBR_1=1 -DHAVE_SVN_DELTA_H=1 -DHAVE_LIBSVN_DELTA_1=1 -DHAVE_LIBSASL2=1 -DMESOS_HAS_JAVA=1 -DHAVE_PYTHON=\"2.7\" -DMESOS_HAS_PYTHON=1 -I. -I../../src   -Wall -Werror -DLIBDIR=\"/mesos/mesos-0.26.0/_inst/lib\" -DPKGLIBEXECDIR=\"/mesos/mesos-0.26.0/_inst/libexec/mesos\" -DPKGDATADIR=\"/mesos/mesos-0.26.0/_inst/share/mesos\" -I../../include -I../../3rdparty/libprocess/include -I../../3rdparty/libprocess/3rdparty/stout/include -I../include -I../include/mesos -I../3rdparty/libprocess/3rdparty/boost-1.53.0 -I../3rdparty/libprocess/3rdparty/picojson-1.3.0 -DPICOJSON_USE_INT64 -D__STDC_FORMAT_MACROS -I../3rdparty/libprocess/3rdparty/protobuf-2.5.0/src -I../3rdparty/libprocess/3rdparty/glog-0.3.3/src -I../3rdparty/libprocess/3rdparty/glog-0.3.3/src -I../3rdparty/leveldb/include -I../3rdparty/zookeeper-3.4.5/src/c/include -I../3rdparty/zookeeper-3.4.5/src/c/generated -I../3rdparty/libprocess/3rdparty/protobuf-2.5.0/src -I/usr/include/subversion-1 -I/usr/include/apr-1 -I/usr/include/apr-1.0  -pthread -g1 -O0 -Wno-unused-local-typedefs -std=c++11 -MT examples/load_generator_framework-load_generator_framework.o -MD -MP -MF examples/.deps/load_generator_framework-load_generator_framework.Tpo -c -o examples/load_generator_framework-load_generator_framework.o `test -f 'examples/load_generator_framework.cpp' || echo '../../src/'`examples/load_generator_framework.cpp
mv -f examples/.deps/long_lived_executor-long_lived_executor.Tpo examples/.deps/long_lived_executor-long_lived_executor.Po
g++ -DPACKAGE_NAME=\"mesos\" -DPACKAGE_TARNAME=\"mesos\" -DPACKAGE_VERSION=\"0.26.0\" -DPACKAGE_STRING=\"mesos\ 0.26.0\" -DPACKAGE_BUGREPORT=\"\" -DPACKAGE_URL=\"\" -DPACKAGE=\"mesos\" -DVERSION=\"0.26.0\" -DSTDC_HEADERS=1 -DHAVE_SYS_TYPES_H=1 -DHAVE_SYS_STAT_H=1 -DHAVE_STDLIB_H=1 -DHAVE_STRING_H=1 -DHAVE_MEMORY_H=1 -DHAVE_STRINGS_H=1 -DHAVE_INTTYPES_H=1 -DHAVE_STDINT_H=1 -DHAVE_UNISTD_H=1 -DHAVE_DLFCN_H=1 -DLT_OBJDIR=\".libs/\" -DHAVE_PTHREAD_PRIO_INHERIT=1 -DHAVE_PTHREAD=1 -DHAVE_LIBZ=1 -DHAVE_LIBCURL=1 -DHAVE_APR_POOLS_H=1 -DHAVE_LIBAPR_1=1 -DHAVE_SVN_VERSION_H=1 -DHAVE_LIBSVN_SUBR_1=1 -DHAVE_SVN_DELTA_H=1 -DHAVE_LIBSVN_DELTA_1=1 -DHAVE_LIBSASL2=1 -DMESOS_HAS_JAVA=1 -DHAVE_PYTHON=\"2.7\" -DMESOS_HAS_PYTHON=1 -I. -I../../src   -Wall -Werror -DLIBDIR=\"/mesos/mesos-0.26.0/_inst/lib\" -DPKGLIBEXECDIR=\"/mesos/mesos-0.26.0/_inst/libexec/mesos\" -DPKGDATADIR=\"/mesos/mesos-0.26.0/_inst/share/mesos\" -I../../include -I../../3rdparty/libprocess/include -I../../3rdparty/libprocess/3rdparty/stout/include -I../include -I../include/mesos -I../3rdparty/libprocess/3rdparty/boost-1.53.0 -I../3rdparty/libprocess/3rdparty/picojson-1.3.0 -DPICOJSON_USE_INT64 -D__STDC_FORMAT_MACROS -I../3rdparty/libprocess/3rdparty/protobuf-2.5.0/src -I../3rdparty/libprocess/3rdparty/glog-0.3.3/src -I../3rdparty/libprocess/3rdparty/glog-0.3.3/src -I../3rdparty/leveldb/include -I../3rdparty/zookeeper-3.4.5/src/c/include -I../3rdparty/zookeeper-3.4.5/src/c/generated -I../3rdparty/libprocess/3rdparty/protobuf-2.5.0/src -I/usr/include/subversion-1 -I/usr/include/apr-1 -I/usr/include/apr-1.0  -pthread -g1 -O0 -Wno-unused-local-typedefs -std=c++11 -MT examples/persistent_volume_framework-persistent_volume_framework.o -MD -MP -MF examples/.deps/persistent_volume_framework-persistent_volume_framework.Tpo -c -o examples/persistent_volume_framework-persistent_volume_framework.o `test -f 'examples/persistent_volume_framework.cpp' || echo '../../src/'`examples/persistent_volume_framework.cpp
mv -f examples/.deps/docker_no_executor_framework-docker_no_executor_framework.Tpo examples/.deps/docker_no_executor_framework-docker_no_executor_framework.Po
g++ -DPACKAGE_NAME=\"mesos\" -DPACKAGE_TARNAME=\"mesos\" -DPACKAGE_VERSION=\"0.26.0\" -DPACKAGE_STRING=\"mesos\ 0.26.0\" -DPACKAGE_BUGREPORT=\"\" -DPACKAGE_URL=\"\" -DPACKAGE=\"mesos\" -DVERSION=\"0.26.0\" -DSTDC_HEADERS=1 -DHAVE_SYS_TYPES_H=1 -DHAVE_SYS_STAT_H=1 -DHAVE_STDLIB_H=1 -DHAVE_STRING_H=1 -DHAVE_MEMORY_H=1 -DHAVE_STRINGS_H=1 -DHAVE_INTTYPES_H=1 -DHAVE_STDINT_H=1 -DHAVE_UNISTD_H=1 -DHAVE_DLFCN_H=1 -DLT_OBJDIR=\".libs/\" -DHAVE_PTHREAD_PRIO_INHERIT=1 -DHAVE_PTHREAD=1 -DHAVE_LIBZ=1 -DHAVE_LIBCURL=1 -DHAVE_APR_POOLS_H=1 -DHAVE_LIBAPR_1=1 -DHAVE_SVN_VERSION_H=1 -DHAVE_LIBSVN_SUBR_1=1 -DHAVE_SVN_DELTA_H=1 -DHAVE_LIBSVN_DELTA_1=1 -DHAVE_LIBSASL2=1 -DMESOS_HAS_JAVA=1 -DHAVE_PYTHON=\"2.7\" -DMESOS_HAS_PYTHON=1 -I. -I../../src   -Wall -Werror -DLIBDIR=\"/mesos/mesos-0.26.0/_inst/lib\" -DPKGLIBEXECDIR=\"/mesos/mesos-0.26.0/_inst/libexec/mesos\" -DPKGDATADIR=\"/mesos/mesos-0.26.0/_inst/share/mesos\" -I../../include -I../../3rdparty/libprocess/include -I../../3rdparty/libprocess/3rdparty/stout/include -I../include -I../include/mesos -I../3rdparty/libprocess/3rdparty/boost-1.53.0 -I../3rdparty/libprocess/3rdparty/picojson-1.3.0 -DPICOJSON_USE_INT64 -D__STDC_FORMAT_MACROS -I../3rdparty/libprocess/3rdparty/protobuf-2.5.0/src -I../3rdparty/libprocess/3rdparty/glog-0.3.3/src -I../3rdparty/libprocess/3rdparty/glog-0.3.3/src -I../3rdparty/leveldb/include -I../3rdparty/zookeeper-3.4.5/src/c/include -I../3rdparty/zookeeper-3.4.5/src/c/generated -I../3rdparty/libprocess/3rdparty/protobuf-2.5.0/src -DSOURCE_DIR=\"/mesos/mesos-0.26.0/_build/..\" -DBUILD_DIR=\"/mesos/mesos-0.26.0/_build\" -I../3rdparty/libprocess/3rdparty/gmock-1.7.0/gtest/include -I../3rdparty/libprocess/3rdparty/gmock-1.7.0/include -I/usr/lib/jvm/java-1.7.0-openjdk-1.7.0.91-2.6.2.1.el7_1.x86_64/include -I/usr/lib/jvm/java-1.7.0-openjdk-1.7.0.91-2.6.2.1.el7_1.x86_64/include/linux -DZOOKEEPER_VERSION=\"3.4.5\" -I/usr/include/subversion-1 -I/usr/include/apr-1 -I/usr/include/apr-1.0  -pthread -g1 -O0 -Wno-unused-local-typedefs -std=c++11 -MT tests/containerizer/memory_test_helper-memory_test_helper_main.o -MD -MP -MF tests/containerizer/.deps/memory_test_helper-memory_test_helper_main.Tpo -c -o tests/containerizer/memory_test_helper-memory_test_helper_main.o `test -f 'tests/containerizer/memory_test_helper_main.cpp' || echo '../../src/'`tests/containerizer/memory_test_helper_main.cpp
mv -f examples/.deps/test_framework-test_framework.Tpo examples/.deps/test_framework-test_framework.Po
g++ -DPACKAGE_NAME=\"mesos\" -DPACKAGE_TARNAME=\"mesos\" -DPACKAGE_VERSION=\"0.26.0\" -DPACKAGE_STRING=\"mesos\ 0.26.0\" -DPACKAGE_BUGREPORT=\"\" -DPACKAGE_URL=\"\" -DPACKAGE=\"mesos\" -DVERSION=\"0.26.0\" -DSTDC_HEADERS=1 -DHAVE_SYS_TYPES_H=1 -DHAVE_SYS_STAT_H=1 -DHAVE_STDLIB_H=1 -DHAVE_STRING_H=1 -DHAVE_MEMORY_H=1 -DHAVE_STRINGS_H=1 -DHAVE_INTTYPES_H=1 -DHAVE_STDINT_H=1 -DHAVE_UNISTD_H=1 -DHAVE_DLFCN_H=1 -DLT_OBJDIR=\".libs/\" -DHAVE_PTHREAD_PRIO_INHERIT=1 -DHAVE_PTHREAD=1 -DHAVE_LIBZ=1 -DHAVE_LIBCURL=1 -DHAVE_APR_POOLS_H=1 -DHAVE_LIBAPR_1=1 -DHAVE_SVN_VERSION_H=1 -DHAVE_LIBSVN_SUBR_1=1 -DHAVE_SVN_DELTA_H=1 -DHAVE_LIBSVN_DELTA_1=1 -DHAVE_LIBSASL2=1 -DMESOS_HAS_JAVA=1 -DHAVE_PYTHON=\"2.7\" -DMESOS_HAS_PYTHON=1 -I. -I../../src   -Wall -Werror -DLIBDIR=\"/mesos/mesos-0.26.0/_inst/lib\" -DPKGLIBEXECDIR=\"/mesos/mesos-0.26.0/_inst/libexec/mesos\" -DPKGDATADIR=\"/mesos/mesos-0.26.0/_inst/share/mesos\" -I../../include -I../../3rdparty/libprocess/include -I../../3rdparty/libprocess/3rdparty/stout/include -I../include -I../include/mesos -I../3rdparty/libprocess/3rdparty/boost-1.53.0 -I../3rdparty/libprocess/3rdparty/picojson-1.3.0 -DPICOJSON_USE_INT64 -D__STDC_FORMAT_MACROS -I../3rdparty/libprocess/3rdparty/protobuf-2.5.0/src -I../3rdparty/libprocess/3rdparty/glog-0.3.3/src -I../3rdparty/libprocess/3rdparty/glog-0.3.3/src -I../3rdparty/leveldb/include -I../3rdparty/zookeeper-3.4.5/src/c/include -I../3rdparty/zookeeper-3.4.5/src/c/generated -I../3rdparty/libprocess/3rdparty/protobuf-2.5.0/src -DSOURCE_DIR=\"/mesos/mesos-0.26.0/_build/..\" -DBUILD_DIR=\"/mesos/mesos-0.26.0/_build\" -I../3rdparty/libprocess/3rdparty/gmock-1.7.0/gtest/include -I../3rdparty/libprocess/3rdparty/gmock-1.7.0/include -I/usr/lib/jvm/java-1.7.0-openjdk-1.7.0.91-2.6.2.1.el7_1.x86_64/include -I/usr/lib/jvm/java-1.7.0-openjdk-1.7.0.91-2.6.2.1.el7_1.x86_64/include/linux -DZOOKEEPER_VERSION=\"3.4.5\" -I/usr/include/subversion-1 -I/usr/include/apr-1 -I/usr/include/apr-1.0  -pthread -g1 -O0 -Wno-unused-local-typedefs -std=c++11 -MT tests/containerizer/memory_test_helper-memory_test_helper.o -MD -MP -MF tests/containerizer/.deps/memory_test_helper-memory_test_helper.Tpo -c -o tests/containerizer/memory_test_helper-memory_test_helper.o `test -f 'tests/containerizer/memory_test_helper.cpp' || echo '../../src/'`tests/containerizer/memory_test_helper.cpp
mv -f examples/.deps/balloon_framework-balloon_framework.Tpo examples/.deps/balloon_framework-balloon_framework.Po
g++ -DPACKAGE_NAME=\"mesos\" -DPACKAGE_TARNAME=\"mesos\" -DPACKAGE_VERSION=\"0.26.0\" -DPACKAGE_STRING=\"mesos\ 0.26.0\" -DPACKAGE_BUGREPORT=\"\" -DPACKAGE_URL=\"\" -DPACKAGE=\"mesos\" -DVERSION=\"0.26.0\" -DSTDC_HEADERS=1 -DHAVE_SYS_TYPES_H=1 -DHAVE_SYS_STAT_H=1 -DHAVE_STDLIB_H=1 -DHAVE_STRING_H=1 -DHAVE_MEMORY_H=1 -DHAVE_STRINGS_H=1 -DHAVE_INTTYPES_H=1 -DHAVE_STDINT_H=1 -DHAVE_UNISTD_H=1 -DHAVE_DLFCN_H=1 -DLT_OBJDIR=\".libs/\" -DHAVE_PTHREAD_PRIO_INHERIT=1 -DHAVE_PTHREAD=1 -DHAVE_LIBZ=1 -DHAVE_LIBCURL=1 -DHAVE_APR_POOLS_H=1 -DHAVE_LIBAPR_1=1 -DHAVE_SVN_VERSION_H=1 -DHAVE_LIBSVN_SUBR_1=1 -DHAVE_SVN_DELTA_H=1 -DHAVE_LIBSVN_DELTA_1=1 -DHAVE_LIBSASL2=1 -DMESOS_HAS_JAVA=1 -DHAVE_PYTHON=\"2.7\" -DMESOS_HAS_PYTHON=1 -I. -I../../src   -Wall -Werror -DLIBDIR=\"/mesos/mesos-0.26.0/_inst/lib\" -DPKGLIBEXECDIR=\"/mesos/mesos-0.26.0/_inst/libexec/mesos\" -DPKGDATADIR=\"/mesos/mesos-0.26.0/_inst/share/mesos\" -I../../include -I../../3rdparty/libprocess/include -I../../3rdparty/libprocess/3rdparty/stout/include -I../include -I../include/mesos -I../3rdparty/libprocess/3rdparty/boost-1.53.0 -I../3rdparty/libprocess/3rdparty/picojson-1.3.0 -DPICOJSON_USE_INT64 -D__STDC_FORMAT_MACROS -I../3rdparty/libprocess/3rdparty/protobuf-2.5.0/src -I../3rdparty/libprocess/3rdparty/glog-0.3.3/src -I../3rdparty/libprocess/3rdparty/glog-0.3.3/src -I../3rdparty/leveldb/include -I../3rdparty/zookeeper-3.4.5/src/c/include -I../3rdparty/zookeeper-3.4.5/src/c/generated -I../3rdparty/libprocess/3rdparty/protobuf-2.5.0/src -I/usr/include/subversion-1 -I/usr/include/apr-1 -I/usr/include/apr-1.0  -pthread -g1 -O0 -Wno-unused-local-typedefs -std=c++11 -MT tests/active_user_test_helper-active_user_test_helper.o -MD -MP -MF tests/.deps/active_user_test_helper-active_user_test_helper.Tpo -c -o tests/active_user_test_helper-active_user_test_helper.o `test -f 'tests/active_user_test_helper.cpp' || echo '../../src/'`tests/active_user_test_helper.cpp
mv -f examples/.deps/balloon_executor-balloon_executor.Tpo examples/.deps/balloon_executor-balloon_executor.Po
g++ -DPACKAGE_NAME=\"mesos\" -DPACKAGE_TARNAME=\"mesos\" -DPACKAGE_VERSION=\"0.26.0\" -DPACKAGE_STRING=\"mesos\ 0.26.0\" -DPACKAGE_BUGREPORT=\"\" -DPACKAGE_URL=\"\" -DPACKAGE=\"mesos\" -DVERSION=\"0.26.0\" -DSTDC_HEADERS=1 -DHAVE_SYS_TYPES_H=1 -DHAVE_SYS_STAT_H=1 -DHAVE_STDLIB_H=1 -DHAVE_STRING_H=1 -DHAVE_MEMORY_H=1 -DHAVE_STRINGS_H=1 -DHAVE_INTTYPES_H=1 -DHAVE_STDINT_H=1 -DHAVE_UNISTD_H=1 -DHAVE_DLFCN_H=1 -DLT_OBJDIR=\".libs/\" -DHAVE_PTHREAD_PRIO_INHERIT=1 -DHAVE_PTHREAD=1 -DHAVE_LIBZ=1 -DHAVE_LIBCURL=1 -DHAVE_APR_POOLS_H=1 -DHAVE_LIBAPR_1=1 -DHAVE_SVN_VERSION_H=1 -DHAVE_LIBSVN_SUBR_1=1 -DHAVE_SVN_DELTA_H=1 -DHAVE_LIBSVN_DELTA_1=1 -DHAVE_LIBSASL2=1 -DMESOS_HAS_JAVA=1 -DHAVE_PYTHON=\"2.7\" -DMESOS_HAS_PYTHON=1 -I. -I../../src   -Wall -Werror -DLIBDIR=\"/mesos/mesos-0.26.0/_inst/lib\" -DPKGLIBEXECDIR=\"/mesos/mesos-0.26.0/_inst/libexec/mesos\" -DPKGDATADIR=\"/mesos/mesos-0.26.0/_inst/share/mesos\" -I../../include -I../../3rdparty/libprocess/include -I../../3rdparty/libprocess/3rdparty/stout/include -I../include -I../include/mesos -I../3rdparty/libprocess/3rdparty/boost-1.53.0 -I../3rdparty/libprocess/3rdparty/picojson-1.3.0 -DPICOJSON_USE_INT64 -D__STDC_FORMAT_MACROS -I../3rdparty/libprocess/3rdparty/protobuf-2.5.0/src -I../3rdparty/libprocess/3rdparty/glog-0.3.3/src -I../3rdparty/libprocess/3rdparty/glog-0.3.3/src -I../3rdparty/leveldb/include -I../3rdparty/zookeeper-3.4.5/src/c/include -I../3rdparty/zookeeper-3.4.5/src/c/generated -I../3rdparty/libprocess/3rdparty/protobuf-2.5.0/src -DSOURCE_DIR=\"/mesos/mesos-0.26.0/_build/..\" -DBUILD_DIR=\"/mesos/mesos-0.26.0/_build\" -I../3rdparty/libprocess/3rdparty/gmock-1.7.0/gtest/include -I../3rdparty/libprocess/3rdparty/gmock-1.7.0/include -I/usr/lib/jvm/java-1.7.0-openjdk-1.7.0.91-2.6.2.1.el7_1.x86_64/include -I/usr/lib/jvm/java-1.7.0-openjdk-1.7.0.91-2.6.2.1.el7_1.x86_64/include/linux -DZOOKEEPER_VERSION=\"3.4.5\" -I/usr/include/subversion-1 -I/usr/include/apr-1 -I/usr/include/apr-1.0  -pthread -g1 -O0 -Wno-unused-local-typedefs -std=c++11 -MT tests/mesos_tests-anonymous_tests.o -MD -MP -MF tests/.deps/mesos_tests-anonymous_tests.Tpo -c -o tests/mesos_tests-anonymous_tests.o `test -f 'tests/anonymous_tests.cpp' || echo '../../src/'`tests/anonymous_tests.cpp
mv -f examples/.deps/no_executor_framework-no_executor_framework.Tpo examples/.deps/no_executor_framework-no_executor_framework.Po
g++ -DPACKAGE_NAME=\"mesos\" -DPACKAGE_TARNAME=\"mesos\" -DPACKAGE_VERSION=\"0.26.0\" -DPACKAGE_STRING=\"mesos\ 0.26.0\" -DPACKAGE_BUGREPORT=\"\" -DPACKAGE_URL=\"\" -DPACKAGE=\"mesos\" -DVERSION=\"0.26.0\" -DSTDC_HEADERS=1 -DHAVE_SYS_TYPES_H=1 -DHAVE_SYS_STAT_H=1 -DHAVE_STDLIB_H=1 -DHAVE_STRING_H=1 -DHAVE_MEMORY_H=1 -DHAVE_STRINGS_H=1 -DHAVE_INTTYPES_H=1 -DHAVE_STDINT_H=1 -DHAVE_UNISTD_H=1 -DHAVE_DLFCN_H=1 -DLT_OBJDIR=\".libs/\" -DHAVE_PTHREAD_PRIO_INHERIT=1 -DHAVE_PTHREAD=1 -DHAVE_LIBZ=1 -DHAVE_LIBCURL=1 -DHAVE_APR_POOLS_H=1 -DHAVE_LIBAPR_1=1 -DHAVE_SVN_VERSION_H=1 -DHAVE_LIBSVN_SUBR_1=1 -DHAVE_SVN_DELTA_H=1 -DHAVE_LIBSVN_DELTA_1=1 -DHAVE_LIBSASL2=1 -DMESOS_HAS_JAVA=1 -DHAVE_PYTHON=\"2.7\" -DMESOS_HAS_PYTHON=1 -I. -I../../src   -Wall -Werror -DLIBDIR=\"/mesos/mesos-0.26.0/_inst/lib\" -DPKGLIBEXECDIR=\"/mesos/mesos-0.26.0/_inst/libexec/mesos\" -DPKGDATADIR=\"/mesos/mesos-0.26.0/_inst/share/mesos\" -I../../include -I../../3rdparty/libprocess/include -I../../3rdparty/libprocess/3rdparty/stout/include -I../include -I../include/mesos -I../3rdparty/libprocess/3rdparty/boost-1.53.0 -I../3rdparty/libprocess/3rdparty/picojson-1.3.0 -DPICOJSON_USE_INT64 -D__STDC_FORMAT_MACROS -I../3rdparty/libprocess/3rdparty/protobuf-2.5.0/src -I../3rdparty/libprocess/3rdparty/glog-0.3.3/src -I../3rdparty/libprocess/3rdparty/glog-0.3.3/src -I../3rdparty/leveldb/include -I../3rdparty/zookeeper-3.4.5/src/c/include -I../3rdparty/zookeeper-3.4.5/src/c/generated -I../3rdparty/libprocess/3rdparty/protobuf-2.5.0/src -DSOURCE_DIR=\"/mesos/mesos-0.26.0/_build/..\" -DBUILD_DIR=\"/mesos/mesos-0.26.0/_build\" -I../3rdparty/libprocess/3rdparty/gmock-1.7.0/gtest/include -I../3rdparty/libprocess/3rdparty/gmock-1.7.0/include -I/usr/lib/jvm/java-1.7.0-openjdk-1.7.0.91-2.6.2.1.el7_1.x86_64/include -I/usr/lib/jvm/java-1.7.0-openjdk-1.7.0.91-2.6.2.1.el7_1.x86_64/include/linux -DZOOKEEPER_VERSION=\"3.4.5\" -I/usr/include/subversion-1 -I/usr/include/apr-1 -I/usr/include/apr-1.0  -pthread -g1 -O0 -Wno-unused-local-typedefs -std=c++11 -MT tests/mesos_tests-attributes_tests.o -MD -MP -MF tests/.deps/mesos_tests-attributes_tests.Tpo -c -o tests/mesos_tests-attributes_tests.o `test -f 'tests/attributes_tests.cpp' || echo '../../src/'`tests/attributes_tests.cpp
mv -f examples/.deps/event_call_framework-event_call_framework.Tpo examples/.deps/event_call_framework-event_call_framework.Po
g++ -DPACKAGE_NAME=\"mesos\" -DPACKAGE_TARNAME=\"mesos\" -DPACKAGE_VERSION=\"0.26.0\" -DPACKAGE_STRING=\"mesos\ 0.26.0\" -DPACKAGE_BUGREPORT=\"\" -DPACKAGE_URL=\"\" -DPACKAGE=\"mesos\" -DVERSION=\"0.26.0\" -DSTDC_HEADERS=1 -DHAVE_SYS_TYPES_H=1 -DHAVE_SYS_STAT_H=1 -DHAVE_STDLIB_H=1 -DHAVE_STRING_H=1 -DHAVE_MEMORY_H=1 -DHAVE_STRINGS_H=1 -DHAVE_INTTYPES_H=1 -DHAVE_STDINT_H=1 -DHAVE_UNISTD_H=1 -DHAVE_DLFCN_H=1 -DLT_OBJDIR=\".libs/\" -DHAVE_PTHREAD_PRIO_INHERIT=1 -DHAVE_PTHREAD=1 -DHAVE_LIBZ=1 -DHAVE_LIBCURL=1 -DHAVE_APR_POOLS_H=1 -DHAVE_LIBAPR_1=1 -DHAVE_SVN_VERSION_H=1 -DHAVE_LIBSVN_SUBR_1=1 -DHAVE_SVN_DELTA_H=1 -DHAVE_LIBSVN_DELTA_1=1 -DHAVE_LIBSASL2=1 -DMESOS_HAS_JAVA=1 -DHAVE_PYTHON=\"2.7\" -DMESOS_HAS_PYTHON=1 -I. -I../../src   -Wall -Werror -DLIBDIR=\"/mesos/mesos-0.26.0/_inst/lib\" -DPKGLIBEXECDIR=\"/mesos/mesos-0.26.0/_inst/libexec/mesos\" -DPKGDATADIR=\"/mesos/mesos-0.26.0/_inst/share/mesos\" -I../../include -I../../3rdparty/libprocess/include -I../../3rdparty/libprocess/3rdparty/stout/include -I../include -I../include/mesos -I../3rdparty/libprocess/3rdparty/boost-1.53.0 -I../3rdparty/libprocess/3rdparty/picojson-1.3.0 -DPICOJSON_USE_INT64 -D__STDC_FORMAT_MACROS -I../3rdparty/libprocess/3rdparty/protobuf-2.5.0/src -I../3rdparty/libprocess/3rdparty/glog-0.3.3/src -I../3rdparty/libprocess/3rdparty/glog-0.3.3/src -I../3rdparty/leveldb/include -I../3rdparty/zookeeper-3.4.5/src/c/include -I../3rdparty/zookeeper-3.4.5/src/c/generated -I../3rdparty/libprocess/3rdparty/protobuf-2.5.0/src -DSOURCE_DIR=\"/mesos/mesos-0.26.0/_build/..\" -DBUILD_DIR=\"/mesos/mesos-0.26.0/_build\" -I../3rdparty/libprocess/3rdparty/gmock-1.7.0/gtest/include -I../3rdparty/libprocess/3rdparty/gmock-1.7.0/include -I/usr/lib/jvm/java-1.7.0-openjdk-1.7.0.91-2.6.2.1.el7_1.x86_64/include -I/usr/lib/jvm/java-1.7.0-openjdk-1.7.0.91-2.6.2.1.el7_1.x86_64/include/linux -DZOOKEEPER_VERSION=\"3.4.5\" -I/usr/include/subversion-1 -I/usr/include/apr-1 -I/usr/include/apr-1.0  -pthread -g1 -O0 -Wno-unused-local-typedefs -std=c++11 -MT tests/mesos_tests-authentication_tests.o -MD -MP -MF tests/.deps/mesos_tests-authentication_tests.Tpo -c -o tests/mesos_tests-authentication_tests.o `test -f 'tests/authentication_tests.cpp' || echo '../../src/'`tests/authentication_tests.cpp
mv -f tests/.deps/active_user_test_helper-active_user_test_helper.Tpo tests/.deps/active_user_test_helper-active_user_test_helper.Po
g++ -DPACKAGE_NAME=\"mesos\" -DPACKAGE_TARNAME=\"mesos\" -DPACKAGE_VERSION=\"0.26.0\" -DPACKAGE_STRING=\"mesos\ 0.26.0\" -DPACKAGE_BUGREPORT=\"\" -DPACKAGE_URL=\"\" -DPACKAGE=\"mesos\" -DVERSION=\"0.26.0\" -DSTDC_HEADERS=1 -DHAVE_SYS_TYPES_H=1 -DHAVE_SYS_STAT_H=1 -DHAVE_STDLIB_H=1 -DHAVE_STRING_H=1 -DHAVE_MEMORY_H=1 -DHAVE_STRINGS_H=1 -DHAVE_INTTYPES_H=1 -DHAVE_STDINT_H=1 -DHAVE_UNISTD_H=1 -DHAVE_DLFCN_H=1 -DLT_OBJDIR=\".libs/\" -DHAVE_PTHREAD_PRIO_INHERIT=1 -DHAVE_PTHREAD=1 -DHAVE_LIBZ=1 -DHAVE_LIBCURL=1 -DHAVE_APR_POOLS_H=1 -DHAVE_LIBAPR_1=1 -DHAVE_SVN_VERSION_H=1 -DHAVE_LIBSVN_SUBR_1=1 -DHAVE_SVN_DELTA_H=1 -DHAVE_LIBSVN_DELTA_1=1 -DHAVE_LIBSASL2=1 -DMESOS_HAS_JAVA=1 -DHAVE_PYTHON=\"2.7\" -DMESOS_HAS_PYTHON=1 -I. -I../../src   -Wall -Werror -DLIBDIR=\"/mesos/mesos-0.26.0/_inst/lib\" -DPKGLIBEXECDIR=\"/mesos/mesos-0.26.0/_inst/libexec/mesos\" -DPKGDATADIR=\"/mesos/mesos-0.26.0/_inst/share/mesos\" -I../../include -I../../3rdparty/libprocess/include -I../../3rdparty/libprocess/3rdparty/stout/include -I../include -I../include/mesos -I../3rdparty/libprocess/3rdparty/boost-1.53.0 -I../3rdparty/libprocess/3rdparty/picojson-1.3.0 -DPICOJSON_USE_INT64 -D__STDC_FORMAT_MACROS -I../3rdparty/libprocess/3rdparty/protobuf-2.5.0/src -I../3rdparty/libprocess/3rdparty/glog-0.3.3/src -I../3rdparty/libprocess/3rdparty/glog-0.3.3/src -I../3rdparty/leveldb/include -I../3rdparty/zookeeper-3.4.5/src/c/include -I../3rdparty/zookeeper-3.4.5/src/c/generated -I../3rdparty/libprocess/3rdparty/protobuf-2.5.0/src -DSOURCE_DIR=\"/mesos/mesos-0.26.0/_build/..\" -DBUILD_DIR=\"/mesos/mesos-0.26.0/_build\" -I../3rdparty/libprocess/3rdparty/gmock-1.7.0/gtest/include -I../3rdparty/libprocess/3rdparty/gmock-1.7.0/include -I/usr/lib/jvm/java-1.7.0-openjdk-1.7.0.91-2.6.2.1.el7_1.x86_64/include -I/usr/lib/jvm/java-1.7.0-openjdk-1.7.0.91-2.6.2.1.el7_1.x86_64/include/linux -DZOOKEEPER_VERSION=\"3.4.5\" -I/usr/include/subversion-1 -I/usr/include/apr-1 -I/usr/include/apr-1.0  -pthread -g1 -O0 -Wno-unused-local-typedefs -std=c++11 -MT tests/mesos_tests-authorization_tests.o -MD -MP -MF tests/.deps/mesos_tests-authorization_tests.Tpo -c -o tests/mesos_tests-authorization_tests.o `test -f 'tests/authorization_tests.cpp' || echo '../../src/'`tests/authorization_tests.cpp
mv -f tests/containerizer/.deps/memory_test_helper-memory_test_helper_main.Tpo tests/containerizer/.deps/memory_test_helper-memory_test_helper_main.Po
g++ -DPACKAGE_NAME=\"mesos\" -DPACKAGE_TARNAME=\"mesos\" -DPACKAGE_VERSION=\"0.26.0\" -DPACKAGE_STRING=\"mesos\ 0.26.0\" -DPACKAGE_BUGREPORT=\"\" -DPACKAGE_URL=\"\" -DPACKAGE=\"mesos\" -DVERSION=\"0.26.0\" -DSTDC_HEADERS=1 -DHAVE_SYS_TYPES_H=1 -DHAVE_SYS_STAT_H=1 -DHAVE_STDLIB_H=1 -DHAVE_STRING_H=1 -DHAVE_MEMORY_H=1 -DHAVE_STRINGS_H=1 -DHAVE_INTTYPES_H=1 -DHAVE_STDINT_H=1 -DHAVE_UNISTD_H=1 -DHAVE_DLFCN_H=1 -DLT_OBJDIR=\".libs/\" -DHAVE_PTHREAD_PRIO_INHERIT=1 -DHAVE_PTHREAD=1 -DHAVE_LIBZ=1 -DHAVE_LIBCURL=1 -DHAVE_APR_POOLS_H=1 -DHAVE_LIBAPR_1=1 -DHAVE_SVN_VERSION_H=1 -DHAVE_LIBSVN_SUBR_1=1 -DHAVE_SVN_DELTA_H=1 -DHAVE_LIBSVN_DELTA_1=1 -DHAVE_LIBSASL2=1 -DMESOS_HAS_JAVA=1 -DHAVE_PYTHON=\"2.7\" -DMESOS_HAS_PYTHON=1 -I. -I../../src   -Wall -Werror -DLIBDIR=\"/mesos/mesos-0.26.0/_inst/lib\" -DPKGLIBEXECDIR=\"/mesos/mesos-0.26.0/_inst/libexec/mesos\" -DPKGDATADIR=\"/mesos/mesos-0.26.0/_inst/share/mesos\" -I../../include -I../../3rdparty/libprocess/include -I../../3rdparty/libprocess/3rdparty/stout/include -I../include -I../include/mesos -I../3rdparty/libprocess/3rdparty/boost-1.53.0 -I../3rdparty/libprocess/3rdparty/picojson-1.3.0 -DPICOJSON_USE_INT64 -D__STDC_FORMAT_MACROS -I../3rdparty/libprocess/3rdparty/protobuf-2.5.0/src -I../3rdparty/libprocess/3rdparty/glog-0.3.3/src -I../3rdparty/libprocess/3rdparty/glog-0.3.3/src -I../3rdparty/leveldb/include -I../3rdparty/zookeeper-3.4.5/src/c/include -I../3rdparty/zookeeper-3.4.5/src/c/generated -I../3rdparty/libprocess/3rdparty/protobuf-2.5.0/src -DSOURCE_DIR=\"/mesos/mesos-0.26.0/_build/..\" -DBUILD_DIR=\"/mesos/mesos-0.26.0/_build\" -I../3rdparty/libprocess/3rdparty/gmock-1.7.0/gtest/include -I../3rdparty/libprocess/3rdparty/gmock-1.7.0/include -I/usr/lib/jvm/java-1.7.0-openjdk-1.7.0.91-2.6.2.1.el7_1.x86_64/include -I/usr/lib/jvm/java-1.7.0-openjdk-1.7.0.91-2.6.2.1.el7_1.x86_64/include/linux -DZOOKEEPER_VERSION=\"3.4.5\" -I/usr/include/subversion-1 -I/usr/include/apr-1 -I/usr/include/apr-1.0  -pthread -g1 -O0 -Wno-unused-local-typedefs -std=c++11 -MT tests/mesos_tests-containerizer.o -MD -MP -MF tests/.deps/mesos_tests-containerizer.Tpo -c -o tests/mesos_tests-containerizer.o `test -f 'tests/containerizer.cpp' || echo '../../src/'`tests/containerizer.cpp
mv -f tests/.deps/mesos_tests-attributes_tests.Tpo tests/.deps/mesos_tests-attributes_tests.Po
g++ -DPACKAGE_NAME=\"mesos\" -DPACKAGE_TARNAME=\"mesos\" -DPACKAGE_VERSION=\"0.26.0\" -DPACKAGE_STRING=\"mesos\ 0.26.0\" -DPACKAGE_BUGREPORT=\"\" -DPACKAGE_URL=\"\" -DPACKAGE=\"mesos\" -DVERSION=\"0.26.0\" -DSTDC_HEADERS=1 -DHAVE_SYS_TYPES_H=1 -DHAVE_SYS_STAT_H=1 -DHAVE_STDLIB_H=1 -DHAVE_STRING_H=1 -DHAVE_MEMORY_H=1 -DHAVE_STRINGS_H=1 -DHAVE_INTTYPES_H=1 -DHAVE_STDINT_H=1 -DHAVE_UNISTD_H=1 -DHAVE_DLFCN_H=1 -DLT_OBJDIR=\".libs/\" -DHAVE_PTHREAD_PRIO_INHERIT=1 -DHAVE_PTHREAD=1 -DHAVE_LIBZ=1 -DHAVE_LIBCURL=1 -DHAVE_APR_POOLS_H=1 -DHAVE_LIBAPR_1=1 -DHAVE_SVN_VERSION_H=1 -DHAVE_LIBSVN_SUBR_1=1 -DHAVE_SVN_DELTA_H=1 -DHAVE_LIBSVN_DELTA_1=1 -DHAVE_LIBSASL2=1 -DMESOS_HAS_JAVA=1 -DHAVE_PYTHON=\"2.7\" -DMESOS_HAS_PYTHON=1 -I. -I../../src   -Wall -Werror -DLIBDIR=\"/mesos/mesos-0.26.0/_inst/lib\" -DPKGLIBEXECDIR=\"/mesos/mesos-0.26.0/_inst/libexec/mesos\" -DPKGDATADIR=\"/mesos/mesos-0.26.0/_inst/share/mesos\" -I../../include -I../../3rdparty/libprocess/include -I../../3rdparty/libprocess/3rdparty/stout/include -I../include -I../include/mesos -I../3rdparty/libprocess/3rdparty/boost-1.53.0 -I../3rdparty/libprocess/3rdparty/picojson-1.3.0 -DPICOJSON_USE_INT64 -D__STDC_FORMAT_MACROS -I../3rdparty/libprocess/3rdparty/protobuf-2.5.0/src -I../3rdparty/libprocess/3rdparty/glog-0.3.3/src -I../3rdparty/libprocess/3rdparty/glog-0.3.3/src -I../3rdparty/leveldb/include -I../3rdparty/zookeeper-3.4.5/src/c/include -I../3rdparty/zookeeper-3.4.5/src/c/generated -I../3rdparty/libprocess/3rdparty/protobuf-2.5.0/src -DSOURCE_DIR=\"/mesos/mesos-0.26.0/_build/..\" -DBUILD_DIR=\"/mesos/mesos-0.26.0/_build\" -I../3rdparty/libprocess/3rdparty/gmock-1.7.0/gtest/include -I../3rdparty/libprocess/3rdparty/gmock-1.7.0/include -I/usr/lib/jvm/java-1.7.0-openjdk-1.7.0.91-2.6.2.1.el7_1.x86_64/include -I/usr/lib/jvm/java-1.7.0-openjdk-1.7.0.91-2.6.2.1.el7_1.x86_64/include/linux -DZOOKEEPER_VERSION=\"3.4.5\" -I/usr/include/subversion-1 -I/usr/include/apr-1 -I/usr/include/apr-1.0  -pthread -g1 -O0 -Wno-unused-local-typedefs -std=c++11 -MT tests/mesos_tests-cram_md5_authentication_tests.o -MD -MP -MF tests/.deps/mesos_tests-cram_md5_authentication_tests.Tpo -c -o tests/mesos_tests-cram_md5_authentication_tests.o `test -f 'tests/cram_md5_authentication_tests.cpp' || echo '../../src/'`tests/cram_md5_authentication_tests.cpp
mv -f examples/.deps/load_generator_framework-load_generator_framework.Tpo examples/.deps/load_generator_framework-load_generator_framework.Po
g++ -DPACKAGE_NAME=\"mesos\" -DPACKAGE_TARNAME=\"mesos\" -DPACKAGE_VERSION=\"0.26.0\" -DPACKAGE_STRING=\"mesos\ 0.26.0\" -DPACKAGE_BUGREPORT=\"\" -DPACKAGE_URL=\"\" -DPACKAGE=\"mesos\" -DVERSION=\"0.26.0\" -DSTDC_HEADERS=1 -DHAVE_SYS_TYPES_H=1 -DHAVE_SYS_STAT_H=1 -DHAVE_STDLIB_H=1 -DHAVE_STRING_H=1 -DHAVE_MEMORY_H=1 -DHAVE_STRINGS_H=1 -DHAVE_INTTYPES_H=1 -DHAVE_STDINT_H=1 -DHAVE_UNISTD_H=1 -DHAVE_DLFCN_H=1 -DLT_OBJDIR=\".libs/\" -DHAVE_PTHREAD_PRIO_INHERIT=1 -DHAVE_PTHREAD=1 -DHAVE_LIBZ=1 -DHAVE_LIBCURL=1 -DHAVE_APR_POOLS_H=1 -DHAVE_LIBAPR_1=1 -DHAVE_SVN_VERSION_H=1 -DHAVE_LIBSVN_SUBR_1=1 -DHAVE_SVN_DELTA_H=1 -DHAVE_LIBSVN_DELTA_1=1 -DHAVE_LIBSASL2=1 -DMESOS_HAS_JAVA=1 -DHAVE_PYTHON=\"2.7\" -DMESOS_HAS_PYTHON=1 -I. -I../../src   -Wall -Werror -DLIBDIR=\"/mesos/mesos-0.26.0/_inst/lib\" -DPKGLIBEXECDIR=\"/mesos/mesos-0.26.0/_inst/libexec/mesos\" -DPKGDATADIR=\"/mesos/mesos-0.26.0/_inst/share/mesos\" -I../../include -I../../3rdparty/libprocess/include -I../../3rdparty/libprocess/3rdparty/stout/include -I../include -I../include/mesos -I../3rdparty/libprocess/3rdparty/boost-1.53.0 -I../3rdparty/libprocess/3rdparty/picojson-1.3.0 -DPICOJSON_USE_INT64 -D__STDC_FORMAT_MACROS -I../3rdparty/libprocess/3rdparty/protobuf-2.5.0/src -I../3rdparty/libprocess/3rdparty/glog-0.3.3/src -I../3rdparty/libprocess/3rdparty/glog-0.3.3/src -I../3rdparty/leveldb/include -I../3rdparty/zookeeper-3.4.5/src/c/include -I../3rdparty/zookeeper-3.4.5/src/c/generated -I../3rdparty/libprocess/3rdparty/protobuf-2.5.0/src -DSOURCE_DIR=\"/mesos/mesos-0.26.0/_build/..\" -DBUILD_DIR=\"/mesos/mesos-0.26.0/_build\" -I../3rdparty/libprocess/3rdparty/gmock-1.7.0/gtest/include -I../3rdparty/libprocess/3rdparty/gmock-1.7.0/include -I/usr/lib/jvm/java-1.7.0-openjdk-1.7.0.91-2.6.2.1.el7_1.x86_64/include -I/usr/lib/jvm/java-1.7.0-openjdk-1.7.0.91-2.6.2.1.el7_1.x86_64/include/linux -DZOOKEEPER_VERSION=\"3.4.5\" -I/usr/include/subversion-1 -I/usr/include/apr-1 -I/usr/include/apr-1.0  -pthread -g1 -O0 -Wno-unused-local-typedefs -std=c++11 -MT tests/mesos_tests-credentials_tests.o -MD -MP -MF tests/.deps/mesos_tests-credentials_tests.Tpo -c -o tests/mesos_tests-credentials_tests.o `test -f 'tests/credentials_tests.cpp' || echo '../../src/'`tests/credentials_tests.cpp
mv -f examples/.deps/persistent_volume_framework-persistent_volume_framework.Tpo examples/.deps/persistent_volume_framework-persistent_volume_framework.Po
g++ -DPACKAGE_NAME=\"mesos\" -DPACKAGE_TARNAME=\"mesos\" -DPACKAGE_VERSION=\"0.26.0\" -DPACKAGE_STRING=\"mesos\ 0.26.0\" -DPACKAGE_BUGREPORT=\"\" -DPACKAGE_URL=\"\" -DPACKAGE=\"mesos\" -DVERSION=\"0.26.0\" -DSTDC_HEADERS=1 -DHAVE_SYS_TYPES_H=1 -DHAVE_SYS_STAT_H=1 -DHAVE_STDLIB_H=1 -DHAVE_STRING_H=1 -DHAVE_MEMORY_H=1 -DHAVE_STRINGS_H=1 -DHAVE_INTTYPES_H=1 -DHAVE_STDINT_H=1 -DHAVE_UNISTD_H=1 -DHAVE_DLFCN_H=1 -DLT_OBJDIR=\".libs/\" -DHAVE_PTHREAD_PRIO_INHERIT=1 -DHAVE_PTHREAD=1 -DHAVE_LIBZ=1 -DHAVE_LIBCURL=1 -DHAVE_APR_POOLS_H=1 -DHAVE_LIBAPR_1=1 -DHAVE_SVN_VERSION_H=1 -DHAVE_LIBSVN_SUBR_1=1 -DHAVE_SVN_DELTA_H=1 -DHAVE_LIBSVN_DELTA_1=1 -DHAVE_LIBSASL2=1 -DMESOS_HAS_JAVA=1 -DHAVE_PYTHON=\"2.7\" -DMESOS_HAS_PYTHON=1 -I. -I../../src   -Wall -Werror -DLIBDIR=\"/mesos/mesos-0.26.0/_inst/lib\" -DPKGLIBEXECDIR=\"/mesos/mesos-0.26.0/_inst/libexec/mesos\" -DPKGDATADIR=\"/mesos/mesos-0.26.0/_inst/share/mesos\" -I../../include -I../../3rdparty/libprocess/include -I../../3rdparty/libprocess/3rdparty/stout/include -I../include -I../include/mesos -I../3rdparty/libprocess/3rdparty/boost-1.53.0 -I../3rdparty/libprocess/3rdparty/picojson-1.3.0 -DPICOJSON_USE_INT64 -D__STDC_FORMAT_MACROS -I../3rdparty/libprocess/3rdparty/protobuf-2.5.0/src -I../3rdparty/libprocess/3rdparty/glog-0.3.3/src -I../3rdparty/libprocess/3rdparty/glog-0.3.3/src -I../3rdparty/leveldb/include -I../3rdparty/zookeeper-3.4.5/src/c/include -I../3rdparty/zookeeper-3.4.5/src/c/generated -I../3rdparty/libprocess/3rdparty/protobuf-2.5.0/src -DSOURCE_DIR=\"/mesos/mesos-0.26.0/_build/..\" -DBUILD_DIR=\"/mesos/mesos-0.26.0/_build\" -I../3rdparty/libprocess/3rdparty/gmock-1.7.0/gtest/include -I../3rdparty/libprocess/3rdparty/gmock-1.7.0/include -I/usr/lib/jvm/java-1.7.0-openjdk-1.7.0.91-2.6.2.1.el7_1.x86_64/include -I/usr/lib/jvm/java-1.7.0-openjdk-1.7.0.91-2.6.2.1.el7_1.x86_64/include/linux -DZOOKEEPER_VERSION=\"3.4.5\" -I/usr/include/subversion-1 -I/usr/include/apr-1 -I/usr/include/apr-1.0  -pthread -g1 -O0 -Wno-unused-local-typedefs -std=c++11 -MT tests/mesos_tests-disk_quota_tests.o -MD -MP -MF tests/.deps/mesos_tests-disk_quota_tests.Tpo -c -o tests/mesos_tests-disk_quota_tests.o `test -f 'tests/disk_quota_tests.cpp' || echo '../../src/'`tests/disk_quota_tests.cpp
mv -f tests/containerizer/.deps/memory_test_helper-memory_test_helper.Tpo tests/containerizer/.deps/memory_test_helper-memory_test_helper.Po
g++ -DPACKAGE_NAME=\"mesos\" -DPACKAGE_TARNAME=\"mesos\" -DPACKAGE_VERSION=\"0.26.0\" -DPACKAGE_STRING=\"mesos\ 0.26.0\" -DPACKAGE_BUGREPORT=\"\" -DPACKAGE_URL=\"\" -DPACKAGE=\"mesos\" -DVERSION=\"0.26.0\" -DSTDC_HEADERS=1 -DHAVE_SYS_TYPES_H=1 -DHAVE_SYS_STAT_H=1 -DHAVE_STDLIB_H=1 -DHAVE_STRING_H=1 -DHAVE_MEMORY_H=1 -DHAVE_STRINGS_H=1 -DHAVE_INTTYPES_H=1 -DHAVE_STDINT_H=1 -DHAVE_UNISTD_H=1 -DHAVE_DLFCN_H=1 -DLT_OBJDIR=\".libs/\" -DHAVE_PTHREAD_PRIO_INHERIT=1 -DHAVE_PTHREAD=1 -DHAVE_LIBZ=1 -DHAVE_LIBCURL=1 -DHAVE_APR_POOLS_H=1 -DHAVE_LIBAPR_1=1 -DHAVE_SVN_VERSION_H=1 -DHAVE_LIBSVN_SUBR_1=1 -DHAVE_SVN_DELTA_H=1 -DHAVE_LIBSVN_DELTA_1=1 -DHAVE_LIBSASL2=1 -DMESOS_HAS_JAVA=1 -DHAVE_PYTHON=\"2.7\" -DMESOS_HAS_PYTHON=1 -I. -I../../src   -Wall -Werror -DLIBDIR=\"/mesos/mesos-0.26.0/_inst/lib\" -DPKGLIBEXECDIR=\"/mesos/mesos-0.26.0/_inst/libexec/mesos\" -DPKGDATADIR=\"/mesos/mesos-0.26.0/_inst/share/mesos\" -I../../include -I../../3rdparty/libprocess/include -I../../3rdparty/libprocess/3rdparty/stout/include -I../include -I../include/mesos -I../3rdparty/libprocess/3rdparty/boost-1.53.0 -I../3rdparty/libprocess/3rdparty/picojson-1.3.0 -DPICOJSON_USE_INT64 -D__STDC_FORMAT_MACROS -I../3rdparty/libprocess/3rdparty/protobuf-2.5.0/src -I../3rdparty/libprocess/3rdparty/glog-0.3.3/src -I../3rdparty/libprocess/3rdparty/glog-0.3.3/src -I../3rdparty/leveldb/include -I../3rdparty/zookeeper-3.4.5/src/c/include -I../3rdparty/zookeeper-3.4.5/src/c/generated -I../3rdparty/libprocess/3rdparty/protobuf-2.5.0/src -DSOURCE_DIR=\"/mesos/mesos-0.26.0/_build/..\" -DBUILD_DIR=\"/mesos/mesos-0.26.0/_build\" -I../3rdparty/libprocess/3rdparty/gmock-1.7.0/gtest/include -I../3rdparty/libprocess/3rdparty/gmock-1.7.0/include -I/usr/lib/jvm/java-1.7.0-openjdk-1.7.0.91-2.6.2.1.el7_1.x86_64/include -I/usr/lib/jvm/java-1.7.0-openjdk-1.7.0.91-2.6.2.1.el7_1.x86_64/include/linux -DZOOKEEPER_VERSION=\"3.4.5\" -I/usr/include/subversion-1 -I/usr/include/apr-1 -I/usr/include/apr-1.0  -pthread -g1 -O0 -Wno-unused-local-typedefs -std=c++11 -MT tests/mesos_tests-environment.o -MD -MP -MF tests/.deps/mesos_tests-environment.Tpo -c -o tests/mesos_tests-environment.o `test -f 'tests/environment.cpp' || echo '../../src/'`tests/environment.cpp
mv -f tests/.deps/mesos_tests-environment.Tpo tests/.deps/mesos_tests-environment.Po
g++ -DPACKAGE_NAME=\"mesos\" -DPACKAGE_TARNAME=\"mesos\" -DPACKAGE_VERSION=\"0.26.0\" -DPACKAGE_STRING=\"mesos\ 0.26.0\" -DPACKAGE_BUGREPORT=\"\" -DPACKAGE_URL=\"\" -DPACKAGE=\"mesos\" -DVERSION=\"0.26.0\" -DSTDC_HEADERS=1 -DHAVE_SYS_TYPES_H=1 -DHAVE_SYS_STAT_H=1 -DHAVE_STDLIB_H=1 -DHAVE_STRING_H=1 -DHAVE_MEMORY_H=1 -DHAVE_STRINGS_H=1 -DHAVE_INTTYPES_H=1 -DHAVE_STDINT_H=1 -DHAVE_UNISTD_H=1 -DHAVE_DLFCN_H=1 -DLT_OBJDIR=\".libs/\" -DHAVE_PTHREAD_PRIO_INHERIT=1 -DHAVE_PTHREAD=1 -DHAVE_LIBZ=1 -DHAVE_LIBCURL=1 -DHAVE_APR_POOLS_H=1 -DHAVE_LIBAPR_1=1 -DHAVE_SVN_VERSION_H=1 -DHAVE_LIBSVN_SUBR_1=1 -DHAVE_SVN_DELTA_H=1 -DHAVE_LIBSVN_DELTA_1=1 -DHAVE_LIBSASL2=1 -DMESOS_HAS_JAVA=1 -DHAVE_PYTHON=\"2.7\" -DMESOS_HAS_PYTHON=1 -I. -I../../src   -Wall -Werror -DLIBDIR=\"/mesos/mesos-0.26.0/_inst/lib\" -DPKGLIBEXECDIR=\"/mesos/mesos-0.26.0/_inst/libexec/mesos\" -DPKGDATADIR=\"/mesos/mesos-0.26.0/_inst/share/mesos\" -I../../include -I../../3rdparty/libprocess/include -I../../3rdparty/libprocess/3rdparty/stout/include -I../include -I../include/mesos -I../3rdparty/libprocess/3rdparty/boost-1.53.0 -I../3rdparty/libprocess/3rdparty/picojson-1.3.0 -DPICOJSON_USE_INT64 -D__STDC_FORMAT_MACROS -I../3rdparty/libprocess/3rdparty/protobuf-2.5.0/src -I../3rdparty/libprocess/3rdparty/glog-0.3.3/src -I../3rdparty/libprocess/3rdparty/glog-0.3.3/src -I../3rdparty/leveldb/include -I../3rdparty/zookeeper-3.4.5/src/c/include -I../3rdparty/zookeeper-3.4.5/src/c/generated -I../3rdparty/libprocess/3rdparty/protobuf-2.5.0/src -DSOURCE_DIR=\"/mesos/mesos-0.26.0/_build/..\" -DBUILD_DIR=\"/mesos/mesos-0.26.0/_build\" -I../3rdparty/libprocess/3rdparty/gmock-1.7.0/gtest/include -I../3rdparty/libprocess/3rdparty/gmock-1.7.0/include -I/usr/lib/jvm/java-1.7.0-openjdk-1.7.0.91-2.6.2.1.el7_1.x86_64/include -I/usr/lib/jvm/java-1.7.0-openjdk-1.7.0.91-2.6.2.1.el7_1.x86_64/include/linux -DZOOKEEPER_VERSION=\"3.4.5\" -I/usr/include/subversion-1 -I/usr/include/apr-1 -I/usr/include/apr-1.0  -pthread -g1 -O0 -Wno-unused-local-typedefs -std=c++11 -MT tests/mesos_tests-examples_tests.o -MD -MP -MF tests/.deps/mesos_tests-examples_tests.Tpo -c -o tests/mesos_tests-examples_tests.o `test -f 'tests/examples_tests.cpp' || echo '../../src/'`tests/examples_tests.cpp
mv -f tests/.deps/mesos_tests-examples_tests.Tpo tests/.deps/mesos_tests-examples_tests.Po
g++ -DPACKAGE_NAME=\"mesos\" -DPACKAGE_TARNAME=\"mesos\" -DPACKAGE_VERSION=\"0.26.0\" -DPACKAGE_STRING=\"mesos\ 0.26.0\" -DPACKAGE_BUGREPORT=\"\" -DPACKAGE_URL=\"\" -DPACKAGE=\"mesos\" -DVERSION=\"0.26.0\" -DSTDC_HEADERS=1 -DHAVE_SYS_TYPES_H=1 -DHAVE_SYS_STAT_H=1 -DHAVE_STDLIB_H=1 -DHAVE_STRING_H=1 -DHAVE_MEMORY_H=1 -DHAVE_STRINGS_H=1 -DHAVE_INTTYPES_H=1 -DHAVE_STDINT_H=1 -DHAVE_UNISTD_H=1 -DHAVE_DLFCN_H=1 -DLT_OBJDIR=\".libs/\" -DHAVE_PTHREAD_PRIO_INHERIT=1 -DHAVE_PTHREAD=1 -DHAVE_LIBZ=1 -DHAVE_LIBCURL=1 -DHAVE_APR_POOLS_H=1 -DHAVE_LIBAPR_1=1 -DHAVE_SVN_VERSION_H=1 -DHAVE_LIBSVN_SUBR_1=1 -DHAVE_SVN_DELTA_H=1 -DHAVE_LIBSVN_DELTA_1=1 -DHAVE_LIBSASL2=1 -DMESOS_HAS_JAVA=1 -DHAVE_PYTHON=\"2.7\" -DMESOS_HAS_PYTHON=1 -I. -I../../src   -Wall -Werror -DLIBDIR=\"/mesos/mesos-0.26.0/_inst/lib\" -DPKGLIBEXECDIR=\"/mesos/mesos-0.26.0/_inst/libexec/mesos\" -DPKGDATADIR=\"/mesos/mesos-0.26.0/_inst/share/mesos\" -I../../include -I../../3rdparty/libprocess/include -I../../3rdparty/libprocess/3rdparty/stout/include -I../include -I../include/mesos -I../3rdparty/libprocess/3rdparty/boost-1.53.0 -I../3rdparty/libprocess/3rdparty/picojson-1.3.0 -DPICOJSON_USE_INT64 -D__STDC_FORMAT_MACROS -I../3rdparty/libprocess/3rdparty/protobuf-2.5.0/src -I../3rdparty/libprocess/3rdparty/glog-0.3.3/src -I../3rdparty/libprocess/3rdparty/glog-0.3.3/src -I../3rdparty/leveldb/include -I../3rdparty/zookeeper-3.4.5/src/c/include -I../3rdparty/zookeeper-3.4.5/src/c/generated -I../3rdparty/libprocess/3rdparty/protobuf-2.5.0/src -DSOURCE_DIR=\"/mesos/mesos-0.26.0/_build/..\" -DBUILD_DIR=\"/mesos/mesos-0.26.0/_build\" -I../3rdparty/libprocess/3rdparty/gmock-1.7.0/gtest/include -I../3rdparty/libprocess/3rdparty/gmock-1.7.0/include -I/usr/lib/jvm/java-1.7.0-openjdk-1.7.0.91-2.6.2.1.el7_1.x86_64/include -I/usr/lib/jvm/java-1.7.0-openjdk-1.7.0.91-2.6.2.1.el7_1.x86_64/include/linux -DZOOKEEPER_VERSION=\"3.4.5\" -I/usr/include/subversion-1 -I/usr/include/apr-1 -I/usr/include/apr-1.0  -pthread -g1 -O0 -Wno-unused-local-typedefs -std=c++11 -MT tests/mesos_tests-exception_tests.o -MD -MP -MF tests/.deps/mesos_tests-exception_tests.Tpo -c -o tests/mesos_tests-exception_tests.o `test -f 'tests/exception_tests.cpp' || echo '../../src/'`tests/exception_tests.cpp
mv -f tests/.deps/mesos_tests-anonymous_tests.Tpo tests/.deps/mesos_tests-anonymous_tests.Po
g++ -DPACKAGE_NAME=\"mesos\" -DPACKAGE_TARNAME=\"mesos\" -DPACKAGE_VERSION=\"0.26.0\" -DPACKAGE_STRING=\"mesos\ 0.26.0\" -DPACKAGE_BUGREPORT=\"\" -DPACKAGE_URL=\"\" -DPACKAGE=\"mesos\" -DVERSION=\"0.26.0\" -DSTDC_HEADERS=1 -DHAVE_SYS_TYPES_H=1 -DHAVE_SYS_STAT_H=1 -DHAVE_STDLIB_H=1 -DHAVE_STRING_H=1 -DHAVE_MEMORY_H=1 -DHAVE_STRINGS_H=1 -DHAVE_INTTYPES_H=1 -DHAVE_STDINT_H=1 -DHAVE_UNISTD_H=1 -DHAVE_DLFCN_H=1 -DLT_OBJDIR=\".libs/\" -DHAVE_PTHREAD_PRIO_INHERIT=1 -DHAVE_PTHREAD=1 -DHAVE_LIBZ=1 -DHAVE_LIBCURL=1 -DHAVE_APR_POOLS_H=1 -DHAVE_LIBAPR_1=1 -DHAVE_SVN_VERSION_H=1 -DHAVE_LIBSVN_SUBR_1=1 -DHAVE_SVN_DELTA_H=1 -DHAVE_LIBSVN_DELTA_1=1 -DHAVE_LIBSASL2=1 -DMESOS_HAS_JAVA=1 -DHAVE_PYTHON=\"2.7\" -DMESOS_HAS_PYTHON=1 -I. -I../../src   -Wall -Werror -DLIBDIR=\"/mesos/mesos-0.26.0/_inst/lib\" -DPKGLIBEXECDIR=\"/mesos/mesos-0.26.0/_inst/libexec/mesos\" -DPKGDATADIR=\"/mesos/mesos-0.26.0/_inst/share/mesos\" -I../../include -I../../3rdparty/libprocess/include -I../../3rdparty/libprocess/3rdparty/stout/include -I../include -I../include/mesos -I../3rdparty/libprocess/3rdparty/boost-1.53.0 -I../3rdparty/libprocess/3rdparty/picojson-1.3.0 -DPICOJSON_USE_INT64 -D__STDC_FORMAT_MACROS -I../3rdparty/libprocess/3rdparty/protobuf-2.5.0/src -I../3rdparty/libprocess/3rdparty/glog-0.3.3/src -I../3rdparty/libprocess/3rdparty/glog-0.3.3/src -I../3rdparty/leveldb/include -I../3rdparty/zookeeper-3.4.5/src/c/include -I../3rdparty/zookeeper-3.4.5/src/c/generated -I../3rdparty/libprocess/3rdparty/protobuf-2.5.0/src -DSOURCE_DIR=\"/mesos/mesos-0.26.0/_build/..\" -DBUILD_DIR=\"/mesos/mesos-0.26.0/_build\" -I../3rdparty/libprocess/3rdparty/gmock-1.7.0/gtest/include -I../3rdparty/libprocess/3rdparty/gmock-1.7.0/include -I/usr/lib/jvm/java-1.7.0-openjdk-1.7.0.91-2.6.2.1.el7_1.x86_64/include -I/usr/lib/jvm/java-1.7.0-openjdk-1.7.0.91-2.6.2.1.el7_1.x86_64/include/linux -DZOOKEEPER_VERSION=\"3.4.5\" -I/usr/include/subversion-1 -I/usr/include/apr-1 -I/usr/include/apr-1.0  -pthread -g1 -O0 -Wno-unused-local-typedefs -std=c++11 -MT tests/mesos_tests-executor_http_api_tests.o -MD -MP -MF tests/.deps/mesos_tests-executor_http_api_tests.Tpo -c -o tests/mesos_tests-executor_http_api_tests.o `test -f 'tests/executor_http_api_tests.cpp' || echo '../../src/'`tests/executor_http_api_tests.cpp
mv -f tests/.deps/mesos_tests-containerizer.Tpo tests/.deps/mesos_tests-containerizer.Po
g++ -DPACKAGE_NAME=\"mesos\" -DPACKAGE_TARNAME=\"mesos\" -DPACKAGE_VERSION=\"0.26.0\" -DPACKAGE_STRING=\"mesos\ 0.26.0\" -DPACKAGE_BUGREPORT=\"\" -DPACKAGE_URL=\"\" -DPACKAGE=\"mesos\" -DVERSION=\"0.26.0\" -DSTDC_HEADERS=1 -DHAVE_SYS_TYPES_H=1 -DHAVE_SYS_STAT_H=1 -DHAVE_STDLIB_H=1 -DHAVE_STRING_H=1 -DHAVE_MEMORY_H=1 -DHAVE_STRINGS_H=1 -DHAVE_INTTYPES_H=1 -DHAVE_STDINT_H=1 -DHAVE_UNISTD_H=1 -DHAVE_DLFCN_H=1 -DLT_OBJDIR=\".libs/\" -DHAVE_PTHREAD_PRIO_INHERIT=1 -DHAVE_PTHREAD=1 -DHAVE_LIBZ=1 -DHAVE_LIBCURL=1 -DHAVE_APR_POOLS_H=1 -DHAVE_LIBAPR_1=1 -DHAVE_SVN_VERSION_H=1 -DHAVE_LIBSVN_SUBR_1=1 -DHAVE_SVN_DELTA_H=1 -DHAVE_LIBSVN_DELTA_1=1 -DHAVE_LIBSASL2=1 -DMESOS_HAS_JAVA=1 -DHAVE_PYTHON=\"2.7\" -DMESOS_HAS_PYTHON=1 -I. -I../../src   -Wall -Werror -DLIBDIR=\"/mesos/mesos-0.26.0/_inst/lib\" -DPKGLIBEXECDIR=\"/mesos/mesos-0.26.0/_inst/libexec/mesos\" -DPKGDATADIR=\"/mesos/mesos-0.26.0/_inst/share/mesos\" -I../../include -I../../3rdparty/libprocess/include -I../../3rdparty/libprocess/3rdparty/stout/include -I../include -I../include/mesos -I../3rdparty/libprocess/3rdparty/boost-1.53.0 -I../3rdparty/libprocess/3rdparty/picojson-1.3.0 -DPICOJSON_USE_INT64 -D__STDC_FORMAT_MACROS -I../3rdparty/libprocess/3rdparty/protobuf-2.5.0/src -I../3rdparty/libprocess/3rdparty/glog-0.3.3/src -I../3rdparty/libprocess/3rdparty/glog-0.3.3/src -I../3rdparty/leveldb/include -I../3rdparty/zookeeper-3.4.5/src/c/include -I../3rdparty/zookeeper-3.4.5/src/c/generated -I../3rdparty/libprocess/3rdparty/protobuf-2.5.0/src -DSOURCE_DIR=\"/mesos/mesos-0.26.0/_build/..\" -DBUILD_DIR=\"/mesos/mesos-0.26.0/_build\" -I../3rdparty/libprocess/3rdparty/gmock-1.7.0/gtest/include -I../3rdparty/libprocess/3rdparty/gmock-1.7.0/include -I/usr/lib/jvm/java-1.7.0-openjdk-1.7.0.91-2.6.2.1.el7_1.x86_64/include -I/usr/lib/jvm/java-1.7.0-openjdk-1.7.0.91-2.6.2.1.el7_1.x86_64/include/linux -DZOOKEEPER_VERSION=\"3.4.5\" -I/usr/include/subversion-1 -I/usr/include/apr-1 -I/usr/include/apr-1.0  -pthread -g1 -O0 -Wno-unused-local-typedefs -std=c++11 -MT tests/mesos_tests-health_check_tests.o -MD -MP -MF tests/.deps/mesos_tests-health_check_tests.Tpo -c -o tests/mesos_tests-health_check_tests.o `test -f 'tests/health_check_tests.cpp' || echo '../../src/'`tests/health_check_tests.cpp
mv -f tests/.deps/mesos_tests-authorization_tests.Tpo tests/.deps/mesos_tests-authorization_tests.Po
g++ -DPACKAGE_NAME=\"mesos\" -DPACKAGE_TARNAME=\"mesos\" -DPACKAGE_VERSION=\"0.26.0\" -DPACKAGE_STRING=\"mesos\ 0.26.0\" -DPACKAGE_BUGREPORT=\"\" -DPACKAGE_URL=\"\" -DPACKAGE=\"mesos\" -DVERSION=\"0.26.0\" -DSTDC_HEADERS=1 -DHAVE_SYS_TYPES_H=1 -DHAVE_SYS_STAT_H=1 -DHAVE_STDLIB_H=1 -DHAVE_STRING_H=1 -DHAVE_MEMORY_H=1 -DHAVE_STRINGS_H=1 -DHAVE_INTTYPES_H=1 -DHAVE_STDINT_H=1 -DHAVE_UNISTD_H=1 -DHAVE_DLFCN_H=1 -DLT_OBJDIR=\".libs/\" -DHAVE_PTHREAD_PRIO_INHERIT=1 -DHAVE_PTHREAD=1 -DHAVE_LIBZ=1 -DHAVE_LIBCURL=1 -DHAVE_APR_POOLS_H=1 -DHAVE_LIBAPR_1=1 -DHAVE_SVN_VERSION_H=1 -DHAVE_LIBSVN_SUBR_1=1 -DHAVE_SVN_DELTA_H=1 -DHAVE_LIBSVN_DELTA_1=1 -DHAVE_LIBSASL2=1 -DMESOS_HAS_JAVA=1 -DHAVE_PYTHON=\"2.7\" -DMESOS_HAS_PYTHON=1 -I. -I../../src   -Wall -Werror -DLIBDIR=\"/mesos/mesos-0.26.0/_inst/lib\" -DPKGLIBEXECDIR=\"/mesos/mesos-0.26.0/_inst/libexec/mesos\" -DPKGDATADIR=\"/mesos/mesos-0.26.0/_inst/share/mesos\" -I../../include -I../../3rdparty/libprocess/include -I../../3rdparty/libprocess/3rdparty/stout/include -I../include -I../include/mesos -I../3rdparty/libprocess/3rdparty/boost-1.53.0 -I../3rdparty/libprocess/3rdparty/picojson-1.3.0 -DPICOJSON_USE_INT64 -D__STDC_FORMAT_MACROS -I../3rdparty/libprocess/3rdparty/protobuf-2.5.0/src -I../3rdparty/libprocess/3rdparty/glog-0.3.3/src -I../3rdparty/libprocess/3rdparty/glog-0.3.3/src -I../3rdparty/leveldb/include -I../3rdparty/zookeeper-3.4.5/src/c/include -I../3rdparty/zookeeper-3.4.5/src/c/generated -I../3rdparty/libprocess/3rdparty/protobuf-2.5.0/src -DSOURCE_DIR=\"/mesos/mesos-0.26.0/_build/..\" -DBUILD_DIR=\"/mesos/mesos-0.26.0/_build\" -I../3rdparty/libprocess/3rdparty/gmock-1.7.0/gtest/include -I../3rdparty/libprocess/3rdparty/gmock-1.7.0/include -I/usr/lib/jvm/java-1.7.0-openjdk-1.7.0.91-2.6.2.1.el7_1.x86_64/include -I/usr/lib/jvm/java-1.7.0-openjdk-1.7.0.91-2.6.2.1.el7_1.x86_64/include/linux -DZOOKEEPER_VERSION=\"3.4.5\" -I/usr/include/subversion-1 -I/usr/include/apr-1 -I/usr/include/apr-1.0  -pthread -g1 -O0 -Wno-unused-local-typedefs -std=c++11 -MT tests/mesos_tests-fault_tolerance_tests.o -MD -MP -MF tests/.deps/mesos_tests-fault_tolerance_tests.Tpo -c -o tests/mesos_tests-fault_tolerance_tests.o `test -f 'tests/fault_tolerance_tests.cpp' || echo '../../src/'`tests/fault_tolerance_tests.cpp
mv -f tests/.deps/mesos_tests-cram_md5_authentication_tests.Tpo tests/.deps/mesos_tests-cram_md5_authentication_tests.Po
g++ -DPACKAGE_NAME=\"mesos\" -DPACKAGE_TARNAME=\"mesos\" -DPACKAGE_VERSION=\"0.26.0\" -DPACKAGE_STRING=\"mesos\ 0.26.0\" -DPACKAGE_BUGREPORT=\"\" -DPACKAGE_URL=\"\" -DPACKAGE=\"mesos\" -DVERSION=\"0.26.0\" -DSTDC_HEADERS=1 -DHAVE_SYS_TYPES_H=1 -DHAVE_SYS_STAT_H=1 -DHAVE_STDLIB_H=1 -DHAVE_STRING_H=1 -DHAVE_MEMORY_H=1 -DHAVE_STRINGS_H=1 -DHAVE_INTTYPES_H=1 -DHAVE_STDINT_H=1 -DHAVE_UNISTD_H=1 -DHAVE_DLFCN_H=1 -DLT_OBJDIR=\".libs/\" -DHAVE_PTHREAD_PRIO_INHERIT=1 -DHAVE_PTHREAD=1 -DHAVE_LIBZ=1 -DHAVE_LIBCURL=1 -DHAVE_APR_POOLS_H=1 -DHAVE_LIBAPR_1=1 -DHAVE_SVN_VERSION_H=1 -DHAVE_LIBSVN_SUBR_1=1 -DHAVE_SVN_DELTA_H=1 -DHAVE_LIBSVN_DELTA_1=1 -DHAVE_LIBSASL2=1 -DMESOS_HAS_JAVA=1 -DHAVE_PYTHON=\"2.7\" -DMESOS_HAS_PYTHON=1 -I. -I../../src   -Wall -Werror -DLIBDIR=\"/mesos/mesos-0.26.0/_inst/lib\" -DPKGLIBEXECDIR=\"/mesos/mesos-0.26.0/_inst/libexec/mesos\" -DPKGDATADIR=\"/mesos/mesos-0.26.0/_inst/share/mesos\" -I../../include -I../../3rdparty/libprocess/include -I../../3rdparty/libprocess/3rdparty/stout/include -I../include -I../include/mesos -I../3rdparty/libprocess/3rdparty/boost-1.53.0 -I../3rdparty/libprocess/3rdparty/picojson-1.3.0 -DPICOJSON_USE_INT64 -D__STDC_FORMAT_MACROS -I../3rdparty/libprocess/3rdparty/protobuf-2.5.0/src -I../3rdparty/libprocess/3rdparty/glog-0.3.3/src -I../3rdparty/libprocess/3rdparty/glog-0.3.3/src -I../3rdparty/leveldb/include -I../3rdparty/zookeeper-3.4.5/src/c/include -I../3rdparty/zookeeper-3.4.5/src/c/generated -I../3rdparty/libprocess/3rdparty/protobuf-2.5.0/src -DSOURCE_DIR=\"/mesos/mesos-0.26.0/_build/..\" -DBUILD_DIR=\"/mesos/mesos-0.26.0/_build\" -I../3rdparty/libprocess/3rdparty/gmock-1.7.0/gtest/include -I../3rdparty/libprocess/3rdparty/gmock-1.7.0/include -I/usr/lib/jvm/java-1.7.0-openjdk-1.7.0.91-2.6.2.1.el7_1.x86_64/include -I/usr/lib/jvm/java-1.7.0-openjdk-1.7.0.91-2.6.2.1.el7_1.x86_64/include/linux -DZOOKEEPER_VERSION=\"3.4.5\" -I/usr/include/subversion-1 -I/usr/include/apr-1 -I/usr/include/apr-1.0  -pthread -g1 -O0 -Wno-unused-local-typedefs -std=c++11 -MT tests/mesos_tests-fetcher_cache_tests.o -MD -MP -MF tests/.deps/mesos_tests-fetcher_cache_tests.Tpo -c -o tests/mesos_tests-fetcher_cache_tests.o `test -f 'tests/fetcher_cache_tests.cpp' || echo '../../src/'`tests/fetcher_cache_tests.cpp
mv -f tests/.deps/mesos_tests-credentials_tests.Tpo tests/.deps/mesos_tests-credentials_tests.Po
g++ -DPACKAGE_NAME=\"mesos\" -DPACKAGE_TARNAME=\"mesos\" -DPACKAGE_VERSION=\"0.26.0\" -DPACKAGE_STRING=\"mesos\ 0.26.0\" -DPACKAGE_BUGREPORT=\"\" -DPACKAGE_URL=\"\" -DPACKAGE=\"mesos\" -DVERSION=\"0.26.0\" -DSTDC_HEADERS=1 -DHAVE_SYS_TYPES_H=1 -DHAVE_SYS_STAT_H=1 -DHAVE_STDLIB_H=1 -DHAVE_STRING_H=1 -DHAVE_MEMORY_H=1 -DHAVE_STRINGS_H=1 -DHAVE_INTTYPES_H=1 -DHAVE_STDINT_H=1 -DHAVE_UNISTD_H=1 -DHAVE_DLFCN_H=1 -DLT_OBJDIR=\".libs/\" -DHAVE_PTHREAD_PRIO_INHERIT=1 -DHAVE_PTHREAD=1 -DHAVE_LIBZ=1 -DHAVE_LIBCURL=1 -DHAVE_APR_POOLS_H=1 -DHAVE_LIBAPR_1=1 -DHAVE_SVN_VERSION_H=1 -DHAVE_LIBSVN_SUBR_1=1 -DHAVE_SVN_DELTA_H=1 -DHAVE_LIBSVN_DELTA_1=1 -DHAVE_LIBSASL2=1 -DMESOS_HAS_JAVA=1 -DHAVE_PYTHON=\"2.7\" -DMESOS_HAS_PYTHON=1 -I. -I../../src   -Wall -Werror -DLIBDIR=\"/mesos/mesos-0.26.0/_inst/lib\" -DPKGLIBEXECDIR=\"/mesos/mesos-0.26.0/_inst/libexec/mesos\" -DPKGDATADIR=\"/mesos/mesos-0.26.0/_inst/share/mesos\" -I../../include -I../../3rdparty/libprocess/include -I../../3rdparty/libprocess/3rdparty/stout/include -I../include -I../include/mesos -I../3rdparty/libprocess/3rdparty/boost-1.53.0 -I../3rdparty/libprocess/3rdparty/picojson-1.3.0 -DPICOJSON_USE_INT64 -D__STDC_FORMAT_MACROS -I../3rdparty/libprocess/3rdparty/protobuf-2.5.0/src -I../3rdparty/libprocess/3rdparty/glog-0.3.3/src -I../3rdparty/libprocess/3rdparty/glog-0.3.3/src -I../3rdparty/leveldb/include -I../3rdparty/zookeeper-3.4.5/src/c/include -I../3rdparty/zookeeper-3.4.5/src/c/generated -I../3rdparty/libprocess/3rdparty/protobuf-2.5.0/src -DSOURCE_DIR=\"/mesos/mesos-0.26.0/_build/..\" -DBUILD_DIR=\"/mesos/mesos-0.26.0/_build\" -I../3rdparty/libprocess/3rdparty/gmock-1.7.0/gtest/include -I../3rdparty/libprocess/3rdparty/gmock-1.7.0/include -I/usr/lib/jvm/java-1.7.0-openjdk-1.7.0.91-2.6.2.1.el7_1.x86_64/include -I/usr/lib/jvm/java-1.7.0-openjdk-1.7.0.91-2.6.2.1.el7_1.x86_64/include/linux -DZOOKEEPER_VERSION=\"3.4.5\" -I/usr/include/subversion-1 -I/usr/include/apr-1 -I/usr/include/apr-1.0  -pthread -g1 -O0 -Wno-unused-local-typedefs -std=c++11 -MT tests/mesos_tests-fetcher_tests.o -MD -MP -MF tests/.deps/mesos_tests-fetcher_tests.Tpo -c -o tests/mesos_tests-fetcher_tests.o `test -f 'tests/fetcher_tests.cpp' || echo '../../src/'`tests/fetcher_tests.cpp
mv -f tests/.deps/mesos_tests-authentication_tests.Tpo tests/.deps/mesos_tests-authentication_tests.Po
g++ -DPACKAGE_NAME=\"mesos\" -DPACKAGE_TARNAME=\"mesos\" -DPACKAGE_VERSION=\"0.26.0\" -DPACKAGE_STRING=\"mesos\ 0.26.0\" -DPACKAGE_BUGREPORT=\"\" -DPACKAGE_URL=\"\" -DPACKAGE=\"mesos\" -DVERSION=\"0.26.0\" -DSTDC_HEADERS=1 -DHAVE_SYS_TYPES_H=1 -DHAVE_SYS_STAT_H=1 -DHAVE_STDLIB_H=1 -DHAVE_STRING_H=1 -DHAVE_MEMORY_H=1 -DHAVE_STRINGS_H=1 -DHAVE_INTTYPES_H=1 -DHAVE_STDINT_H=1 -DHAVE_UNISTD_H=1 -DHAVE_DLFCN_H=1 -DLT_OBJDIR=\".libs/\" -DHAVE_PTHREAD_PRIO_INHERIT=1 -DHAVE_PTHREAD=1 -DHAVE_LIBZ=1 -DHAVE_LIBCURL=1 -DHAVE_APR_POOLS_H=1 -DHAVE_LIBAPR_1=1 -DHAVE_SVN_VERSION_H=1 -DHAVE_LIBSVN_SUBR_1=1 -DHAVE_SVN_DELTA_H=1 -DHAVE_LIBSVN_DELTA_1=1 -DHAVE_LIBSASL2=1 -DMESOS_HAS_JAVA=1 -DHAVE_PYTHON=\"2.7\" -DMESOS_HAS_PYTHON=1 -I. -I../../src   -Wall -Werror -DLIBDIR=\"/mesos/mesos-0.26.0/_inst/lib\" -DPKGLIBEXECDIR=\"/mesos/mesos-0.26.0/_inst/libexec/mesos\" -DPKGDATADIR=\"/mesos/mesos-0.26.0/_inst/share/mesos\" -I../../include -I../../3rdparty/libprocess/include -I../../3rdparty/libprocess/3rdparty/stout/include -I../include -I../include/mesos -I../3rdparty/libprocess/3rdparty/boost-1.53.0 -I../3rdparty/libprocess/3rdparty/picojson-1.3.0 -DPICOJSON_USE_INT64 -D__STDC_FORMAT_MACROS -I../3rdparty/libprocess/3rdparty/protobuf-2.5.0/src -I../3rdparty/libprocess/3rdparty/glog-0.3.3/src -I../3rdparty/libprocess/3rdparty/glog-0.3.3/src -I../3rdparty/leveldb/include -I../3rdparty/zookeeper-3.4.5/src/c/include -I../3rdparty/zookeeper-3.4.5/src/c/generated -I../3rdparty/libprocess/3rdparty/protobuf-2.5.0/src -DSOURCE_DIR=\"/mesos/mesos-0.26.0/_build/..\" -DBUILD_DIR=\"/mesos/mesos-0.26.0/_build\" -I../3rdparty/libprocess/3rdparty/gmock-1.7.0/gtest/include -I../3rdparty/libprocess/3rdparty/gmock-1.7.0/include -I/usr/lib/jvm/java-1.7.0-openjdk-1.7.0.91-2.6.2.1.el7_1.x86_64/include -I/usr/lib/jvm/java-1.7.0-openjdk-1.7.0.91-2.6.2.1.el7_1.x86_64/include/linux -DZOOKEEPER_VERSION=\"3.4.5\" -I/usr/include/subversion-1 -I/usr/include/apr-1 -I/usr/include/apr-1.0  -pthread -g1 -O0 -Wno-unused-local-typedefs -std=c++11 -MT tests/mesos_tests-files_tests.o -MD -MP -MF tests/.deps/mesos_tests-files_tests.Tpo -c -o tests/mesos_tests-files_tests.o `test -f 'tests/files_tests.cpp' || echo '../../src/'`tests/files_tests.cpp
mv -f tests/.deps/mesos_tests-disk_quota_tests.Tpo tests/.deps/mesos_tests-disk_quota_tests.Po
g++ -DPACKAGE_NAME=\"mesos\" -DPACKAGE_TARNAME=\"mesos\" -DPACKAGE_VERSION=\"0.26.0\" -DPACKAGE_STRING=\"mesos\ 0.26.0\" -DPACKAGE_BUGREPORT=\"\" -DPACKAGE_URL=\"\" -DPACKAGE=\"mesos\" -DVERSION=\"0.26.0\" -DSTDC_HEADERS=1 -DHAVE_SYS_TYPES_H=1 -DHAVE_SYS_STAT_H=1 -DHAVE_STDLIB_H=1 -DHAVE_STRING_H=1 -DHAVE_MEMORY_H=1 -DHAVE_STRINGS_H=1 -DHAVE_INTTYPES_H=1 -DHAVE_STDINT_H=1 -DHAVE_UNISTD_H=1 -DHAVE_DLFCN_H=1 -DLT_OBJDIR=\".libs/\" -DHAVE_PTHREAD_PRIO_INHERIT=1 -DHAVE_PTHREAD=1 -DHAVE_LIBZ=1 -DHAVE_LIBCURL=1 -DHAVE_APR_POOLS_H=1 -DHAVE_LIBAPR_1=1 -DHAVE_SVN_VERSION_H=1 -DHAVE_LIBSVN_SUBR_1=1 -DHAVE_SVN_DELTA_H=1 -DHAVE_LIBSVN_DELTA_1=1 -DHAVE_LIBSASL2=1 -DMESOS_HAS_JAVA=1 -DHAVE_PYTHON=\"2.7\" -DMESOS_HAS_PYTHON=1 -I. -I../../src   -Wall -Werror -DLIBDIR=\"/mesos/mesos-0.26.0/_inst/lib\" -DPKGLIBEXECDIR=\"/mesos/mesos-0.26.0/_inst/libexec/mesos\" -DPKGDATADIR=\"/mesos/mesos-0.26.0/_inst/share/mesos\" -I../../include -I../../3rdparty/libprocess/include -I../../3rdparty/libprocess/3rdparty/stout/include -I../include -I../include/mesos -I../3rdparty/libprocess/3rdparty/boost-1.53.0 -I../3rdparty/libprocess/3rdparty/picojson-1.3.0 -DPICOJSON_USE_INT64 -D__STDC_FORMAT_MACROS -I../3rdparty/libprocess/3rdparty/protobuf-2.5.0/src -I../3rdparty/libprocess/3rdparty/glog-0.3.3/src -I../3rdparty/libprocess/3rdparty/glog-0.3.3/src -I../3rdparty/leveldb/include -I../3rdparty/zookeeper-3.4.5/src/c/include -I../3rdparty/zookeeper-3.4.5/src/c/generated -I../3rdparty/libprocess/3rdparty/protobuf-2.5.0/src -DSOURCE_DIR=\"/mesos/mesos-0.26.0/_build/..\" -DBUILD_DIR=\"/mesos/mesos-0.26.0/_build\" -I../3rdparty/libprocess/3rdparty/gmock-1.7.0/gtest/include -I../3rdparty/libprocess/3rdparty/gmock-1.7.0/include -I/usr/lib/jvm/java-1.7.0-openjdk-1.7.0.91-2.6.2.1.el7_1.x86_64/include -I/usr/lib/jvm/java-1.7.0-openjdk-1.7.0.91-2.6.2.1.el7_1.x86_64/include/linux -DZOOKEEPER_VERSION=\"3.4.5\" -I/usr/include/subversion-1 -I/usr/include/apr-1 -I/usr/include/apr-1.0  -pthread -g1 -O0 -Wno-unused-local-typedefs -std=c++11 -MT tests/mesos_tests-flags.o -MD -MP -MF tests/.deps/mesos_tests-flags.Tpo -c -o tests/mesos_tests-flags.o `test -f 'tests/flags.cpp' || echo '../../src/'`tests/flags.cpp
mv -f tests/.deps/mesos_tests-files_tests.Tpo tests/.deps/mesos_tests-files_tests.Po
g++ -DPACKAGE_NAME=\"mesos\" -DPACKAGE_TARNAME=\"mesos\" -DPACKAGE_VERSION=\"0.26.0\" -DPACKAGE_STRING=\"mesos\ 0.26.0\" -DPACKAGE_BUGREPORT=\"\" -DPACKAGE_URL=\"\" -DPACKAGE=\"mesos\" -DVERSION=\"0.26.0\" -DSTDC_HEADERS=1 -DHAVE_SYS_TYPES_H=1 -DHAVE_SYS_STAT_H=1 -DHAVE_STDLIB_H=1 -DHAVE_STRING_H=1 -DHAVE_MEMORY_H=1 -DHAVE_STRINGS_H=1 -DHAVE_INTTYPES_H=1 -DHAVE_STDINT_H=1 -DHAVE_UNISTD_H=1 -DHAVE_DLFCN_H=1 -DLT_OBJDIR=\".libs/\" -DHAVE_PTHREAD_PRIO_INHERIT=1 -DHAVE_PTHREAD=1 -DHAVE_LIBZ=1 -DHAVE_LIBCURL=1 -DHAVE_APR_POOLS_H=1 -DHAVE_LIBAPR_1=1 -DHAVE_SVN_VERSION_H=1 -DHAVE_LIBSVN_SUBR_1=1 -DHAVE_SVN_DELTA_H=1 -DHAVE_LIBSVN_DELTA_1=1 -DHAVE_LIBSASL2=1 -DMESOS_HAS_JAVA=1 -DHAVE_PYTHON=\"2.7\" -DMESOS_HAS_PYTHON=1 -I. -I../../src   -Wall -Werror -DLIBDIR=\"/mesos/mesos-0.26.0/_inst/lib\" -DPKGLIBEXECDIR=\"/mesos/mesos-0.26.0/_inst/libexec/mesos\" -DPKGDATADIR=\"/mesos/mesos-0.26.0/_inst/share/mesos\" -I../../include -I../../3rdparty/libprocess/include -I../../3rdparty/libprocess/3rdparty/stout/include -I../include -I../include/mesos -I../3rdparty/libprocess/3rdparty/boost-1.53.0 -I../3rdparty/libprocess/3rdparty/picojson-1.3.0 -DPICOJSON_USE_INT64 -D__STDC_FORMAT_MACROS -I../3rdparty/libprocess/3rdparty/protobuf-2.5.0/src -I../3rdparty/libprocess/3rdparty/glog-0.3.3/src -I../3rdparty/libprocess/3rdparty/glog-0.3.3/src -I../3rdparty/leveldb/include -I../3rdparty/zookeeper-3.4.5/src/c/include -I../3rdparty/zookeeper-3.4.5/src/c/generated -I../3rdparty/libprocess/3rdparty/protobuf-2.5.0/src -DSOURCE_DIR=\"/mesos/mesos-0.26.0/_build/..\" -DBUILD_DIR=\"/mesos/mesos-0.26.0/_build\" -I../3rdparty/libprocess/3rdparty/gmock-1.7.0/gtest/include -I../3rdparty/libprocess/3rdparty/gmock-1.7.0/include -I/usr/lib/jvm/java-1.7.0-openjdk-1.7.0.91-2.6.2.1.el7_1.x86_64/include -I/usr/lib/jvm/java-1.7.0-openjdk-1.7.0.91-2.6.2.1.el7_1.x86_64/include/linux -DZOOKEEPER_VERSION=\"3.4.5\" -I/usr/include/subversion-1 -I/usr/include/apr-1 -I/usr/include/apr-1.0  -pthread -g1 -O0 -Wno-unused-local-typedefs -std=c++11 -MT tests/mesos_tests-gc_tests.o -MD -MP -MF tests/.deps/mesos_tests-gc_tests.Tpo -c -o tests/mesos_tests-gc_tests.o `test -f 'tests/gc_tests.cpp' || echo '../../src/'`tests/gc_tests.cpp
mv -f tests/.deps/mesos_tests-flags.Tpo tests/.deps/mesos_tests-flags.Po
g++ -DPACKAGE_NAME=\"mesos\" -DPACKAGE_TARNAME=\"mesos\" -DPACKAGE_VERSION=\"0.26.0\" -DPACKAGE_STRING=\"mesos\ 0.26.0\" -DPACKAGE_BUGREPORT=\"\" -DPACKAGE_URL=\"\" -DPACKAGE=\"mesos\" -DVERSION=\"0.26.0\" -DSTDC_HEADERS=1 -DHAVE_SYS_TYPES_H=1 -DHAVE_SYS_STAT_H=1 -DHAVE_STDLIB_H=1 -DHAVE_STRING_H=1 -DHAVE_MEMORY_H=1 -DHAVE_STRINGS_H=1 -DHAVE_INTTYPES_H=1 -DHAVE_STDINT_H=1 -DHAVE_UNISTD_H=1 -DHAVE_DLFCN_H=1 -DLT_OBJDIR=\".libs/\" -DHAVE_PTHREAD_PRIO_INHERIT=1 -DHAVE_PTHREAD=1 -DHAVE_LIBZ=1 -DHAVE_LIBCURL=1 -DHAVE_APR_POOLS_H=1 -DHAVE_LIBAPR_1=1 -DHAVE_SVN_VERSION_H=1 -DHAVE_LIBSVN_SUBR_1=1 -DHAVE_SVN_DELTA_H=1 -DHAVE_LIBSVN_DELTA_1=1 -DHAVE_LIBSASL2=1 -DMESOS_HAS_JAVA=1 -DHAVE_PYTHON=\"2.7\" -DMESOS_HAS_PYTHON=1 -I. -I../../src   -Wall -Werror -DLIBDIR=\"/mesos/mesos-0.26.0/_inst/lib\" -DPKGLIBEXECDIR=\"/mesos/mesos-0.26.0/_inst/libexec/mesos\" -DPKGDATADIR=\"/mesos/mesos-0.26.0/_inst/share/mesos\" -I../../include -I../../3rdparty/libprocess/include -I../../3rdparty/libprocess/3rdparty/stout/include -I../include -I../include/mesos -I../3rdparty/libprocess/3rdparty/boost-1.53.0 -I../3rdparty/libprocess/3rdparty/picojson-1.3.0 -DPICOJSON_USE_INT64 -D__STDC_FORMAT_MACROS -I../3rdparty/libprocess/3rdparty/protobuf-2.5.0/src -I../3rdparty/libprocess/3rdparty/glog-0.3.3/src -I../3rdparty/libprocess/3rdparty/glog-0.3.3/src -I../3rdparty/leveldb/include -I../3rdparty/zookeeper-3.4.5/src/c/include -I../3rdparty/zookeeper-3.4.5/src/c/generated -I../3rdparty/libprocess/3rdparty/protobuf-2.5.0/src -DSOURCE_DIR=\"/mesos/mesos-0.26.0/_build/..\" -DBUILD_DIR=\"/mesos/mesos-0.26.0/_build\" -I../3rdparty/libprocess/3rdparty/gmock-1.7.0/gtest/include -I../3rdparty/libprocess/3rdparty/gmock-1.7.0/include -I/usr/lib/jvm/java-1.7.0-openjdk-1.7.0.91-2.6.2.1.el7_1.x86_64/include -I/usr/lib/jvm/java-1.7.0-openjdk-1.7.0.91-2.6.2.1.el7_1.x86_64/include/linux -DZOOKEEPER_VERSION=\"3.4.5\" -I/usr/include/subversion-1 -I/usr/include/apr-1 -I/usr/include/apr-1.0  -pthread -g1 -O0 -Wno-unused-local-typedefs -std=c++11 -MT tests/mesos_tests-hierarchical_allocator_tests.o -MD -MP -MF tests/.deps/mesos_tests-hierarchical_allocator_tests.Tpo -c -o tests/mesos_tests-hierarchical_allocator_tests.o `test -f 'tests/hierarchical_allocator_tests.cpp' || echo '../../src/'`tests/hierarchical_allocator_tests.cpp
mv -f tests/.deps/mesos_tests-exception_tests.Tpo tests/.deps/mesos_tests-exception_tests.Po
g++ -DPACKAGE_NAME=\"mesos\" -DPACKAGE_TARNAME=\"mesos\" -DPACKAGE_VERSION=\"0.26.0\" -DPACKAGE_STRING=\"mesos\ 0.26.0\" -DPACKAGE_BUGREPORT=\"\" -DPACKAGE_URL=\"\" -DPACKAGE=\"mesos\" -DVERSION=\"0.26.0\" -DSTDC_HEADERS=1 -DHAVE_SYS_TYPES_H=1 -DHAVE_SYS_STAT_H=1 -DHAVE_STDLIB_H=1 -DHAVE_STRING_H=1 -DHAVE_MEMORY_H=1 -DHAVE_STRINGS_H=1 -DHAVE_INTTYPES_H=1 -DHAVE_STDINT_H=1 -DHAVE_UNISTD_H=1 -DHAVE_DLFCN_H=1 -DLT_OBJDIR=\".libs/\" -DHAVE_PTHREAD_PRIO_INHERIT=1 -DHAVE_PTHREAD=1 -DHAVE_LIBZ=1 -DHAVE_LIBCURL=1 -DHAVE_APR_POOLS_H=1 -DHAVE_LIBAPR_1=1 -DHAVE_SVN_VERSION_H=1 -DHAVE_LIBSVN_SUBR_1=1 -DHAVE_SVN_DELTA_H=1 -DHAVE_LIBSVN_DELTA_1=1 -DHAVE_LIBSASL2=1 -DMESOS_HAS_JAVA=1 -DHAVE_PYTHON=\"2.7\" -DMESOS_HAS_PYTHON=1 -I. -I../../src   -Wall -Werror -DLIBDIR=\"/mesos/mesos-0.26.0/_inst/lib\" -DPKGLIBEXECDIR=\"/mesos/mesos-0.26.0/_inst/libexec/mesos\" -DPKGDATADIR=\"/mesos/mesos-0.26.0/_inst/share/mesos\" -I../../include -I../../3rdparty/libprocess/include -I../../3rdparty/libprocess/3rdparty/stout/include -I../include -I../include/mesos -I../3rdparty/libprocess/3rdparty/boost-1.53.0 -I../3rdparty/libprocess/3rdparty/picojson-1.3.0 -DPICOJSON_USE_INT64 -D__STDC_FORMAT_MACROS -I../3rdparty/libprocess/3rdparty/protobuf-2.5.0/src -I../3rdparty/libprocess/3rdparty/glog-0.3.3/src -I../3rdparty/libprocess/3rdparty/glog-0.3.3/src -I../3rdparty/leveldb/include -I../3rdparty/zookeeper-3.4.5/src/c/include -I../3rdparty/zookeeper-3.4.5/src/c/generated -I../3rdparty/libprocess/3rdparty/protobuf-2.5.0/src -DSOURCE_DIR=\"/mesos/mesos-0.26.0/_build/..\" -DBUILD_DIR=\"/mesos/mesos-0.26.0/_build\" -I../3rdparty/libprocess/3rdparty/gmock-1.7.0/gtest/include -I../3rdparty/libprocess/3rdparty/gmock-1.7.0/include -I/usr/lib/jvm/java-1.7.0-openjdk-1.7.0.91-2.6.2.1.el7_1.x86_64/include -I/usr/lib/jvm/java-1.7.0-openjdk-1.7.0.91-2.6.2.1.el7_1.x86_64/include/linux -DZOOKEEPER_VERSION=\"3.4.5\" -I/usr/include/subversion-1 -I/usr/include/apr-1 -I/usr/include/apr-1.0  -pthread -g1 -O0 -Wno-unused-local-typedefs -std=c++11 -MT tests/mesos_tests-hook_tests.o -MD -MP -MF tests/.deps/mesos_tests-hook_tests.Tpo -c -o tests/mesos_tests-hook_tests.o `test -f 'tests/hook_tests.cpp' || echo '../../src/'`tests/hook_tests.cpp
mv -f tests/.deps/mesos_tests-executor_http_api_tests.Tpo tests/.deps/mesos_tests-executor_http_api_tests.Po
g++ -DPACKAGE_NAME=\"mesos\" -DPACKAGE_TARNAME=\"mesos\" -DPACKAGE_VERSION=\"0.26.0\" -DPACKAGE_STRING=\"mesos\ 0.26.0\" -DPACKAGE_BUGREPORT=\"\" -DPACKAGE_URL=\"\" -DPACKAGE=\"mesos\" -DVERSION=\"0.26.0\" -DSTDC_HEADERS=1 -DHAVE_SYS_TYPES_H=1 -DHAVE_SYS_STAT_H=1 -DHAVE_STDLIB_H=1 -DHAVE_STRING_H=1 -DHAVE_MEMORY_H=1 -DHAVE_STRINGS_H=1 -DHAVE_INTTYPES_H=1 -DHAVE_STDINT_H=1 -DHAVE_UNISTD_H=1 -DHAVE_DLFCN_H=1 -DLT_OBJDIR=\".libs/\" -DHAVE_PTHREAD_PRIO_INHERIT=1 -DHAVE_PTHREAD=1 -DHAVE_LIBZ=1 -DHAVE_LIBCURL=1 -DHAVE_APR_POOLS_H=1 -DHAVE_LIBAPR_1=1 -DHAVE_SVN_VERSION_H=1 -DHAVE_LIBSVN_SUBR_1=1 -DHAVE_SVN_DELTA_H=1 -DHAVE_LIBSVN_DELTA_1=1 -DHAVE_LIBSASL2=1 -DMESOS_HAS_JAVA=1 -DHAVE_PYTHON=\"2.7\" -DMESOS_HAS_PYTHON=1 -I. -I../../src   -Wall -Werror -DLIBDIR=\"/mesos/mesos-0.26.0/_inst/lib\" -DPKGLIBEXECDIR=\"/mesos/mesos-0.26.0/_inst/libexec/mesos\" -DPKGDATADIR=\"/mesos/mesos-0.26.0/_inst/share/mesos\" -I../../include -I../../3rdparty/libprocess/include -I../../3rdparty/libprocess/3rdparty/stout/include -I../include -I../include/mesos -I../3rdparty/libprocess/3rdparty/boost-1.53.0 -I../3rdparty/libprocess/3rdparty/picojson-1.3.0 -DPICOJSON_USE_INT64 -D__STDC_FORMAT_MACROS -I../3rdparty/libprocess/3rdparty/protobuf-2.5.0/src -I../3rdparty/libprocess/3rdparty/glog-0.3.3/src -I../3rdparty/libprocess/3rdparty/glog-0.3.3/src -I../3rdparty/leveldb/include -I../3rdparty/zookeeper-3.4.5/src/c/include -I../3rdparty/zookeeper-3.4.5/src/c/generated -I../3rdparty/libprocess/3rdparty/protobuf-2.5.0/src -DSOURCE_DIR=\"/mesos/mesos-0.26.0/_build/..\" -DBUILD_DIR=\"/mesos/mesos-0.26.0/_build\" -I../3rdparty/libprocess/3rdparty/gmock-1.7.0/gtest/include -I../3rdparty/libprocess/3rdparty/gmock-1.7.0/include -I/usr/lib/jvm/java-1.7.0-openjdk-1.7.0.91-2.6.2.1.el7_1.x86_64/include -I/usr/lib/jvm/java-1.7.0-openjdk-1.7.0.91-2.6.2.1.el7_1.x86_64/include/linux -DZOOKEEPER_VERSION=\"3.4.5\" -I/usr/include/subversion-1 -I/usr/include/apr-1 -I/usr/include/apr-1.0  -pthread -g1 -O0 -Wno-unused-local-typedefs -std=c++11 -MT tests/mesos_tests-log_tests.o -MD -MP -MF tests/.deps/mesos_tests-log_tests.Tpo -c -o tests/mesos_tests-log_tests.o `test -f 'tests/log_tests.cpp' || echo '../../src/'`tests/log_tests.cpp
mv -f tests/.deps/mesos_tests-health_check_tests.Tpo tests/.deps/mesos_tests-health_check_tests.Po
g++ -DPACKAGE_NAME=\"mesos\" -DPACKAGE_TARNAME=\"mesos\" -DPACKAGE_VERSION=\"0.26.0\" -DPACKAGE_STRING=\"mesos\ 0.26.0\" -DPACKAGE_BUGREPORT=\"\" -DPACKAGE_URL=\"\" -DPACKAGE=\"mesos\" -DVERSION=\"0.26.0\" -DSTDC_HEADERS=1 -DHAVE_SYS_TYPES_H=1 -DHAVE_SYS_STAT_H=1 -DHAVE_STDLIB_H=1 -DHAVE_STRING_H=1 -DHAVE_MEMORY_H=1 -DHAVE_STRINGS_H=1 -DHAVE_INTTYPES_H=1 -DHAVE_STDINT_H=1 -DHAVE_UNISTD_H=1 -DHAVE_DLFCN_H=1 -DLT_OBJDIR=\".libs/\" -DHAVE_PTHREAD_PRIO_INHERIT=1 -DHAVE_PTHREAD=1 -DHAVE_LIBZ=1 -DHAVE_LIBCURL=1 -DHAVE_APR_POOLS_H=1 -DHAVE_LIBAPR_1=1 -DHAVE_SVN_VERSION_H=1 -DHAVE_LIBSVN_SUBR_1=1 -DHAVE_SVN_DELTA_H=1 -DHAVE_LIBSVN_DELTA_1=1 -DHAVE_LIBSASL2=1 -DMESOS_HAS_JAVA=1 -DHAVE_PYTHON=\"2.7\" -DMESOS_HAS_PYTHON=1 -I. -I../../src   -Wall -Werror -DLIBDIR=\"/mesos/mesos-0.26.0/_inst/lib\" -DPKGLIBEXECDIR=\"/mesos/mesos-0.26.0/_inst/libexec/mesos\" -DPKGDATADIR=\"/mesos/mesos-0.26.0/_inst/share/mesos\" -I../../include -I../../3rdparty/libprocess/include -I../../3rdparty/libprocess/3rdparty/stout/include -I../include -I../include/mesos -I../3rdparty/libprocess/3rdparty/boost-1.53.0 -I../3rdparty/libprocess/3rdparty/picojson-1.3.0 -DPICOJSON_USE_INT64 -D__STDC_FORMAT_MACROS -I../3rdparty/libprocess/3rdparty/protobuf-2.5.0/src -I../3rdparty/libprocess/3rdparty/glog-0.3.3/src -I../3rdparty/libprocess/3rdparty/glog-0.3.3/src -I../3rdparty/leveldb/include -I../3rdparty/zookeeper-3.4.5/src/c/include -I../3rdparty/zookeeper-3.4.5/src/c/generated -I../3rdparty/libprocess/3rdparty/protobuf-2.5.0/src -DSOURCE_DIR=\"/mesos/mesos-0.26.0/_build/..\" -DBUILD_DIR=\"/mesos/mesos-0.26.0/_build\" -I../3rdparty/libprocess/3rdparty/gmock-1.7.0/gtest/include -I../3rdparty/libprocess/3rdparty/gmock-1.7.0/include -I/usr/lib/jvm/java-1.7.0-openjdk-1.7.0.91-2.6.2.1.el7_1.x86_64/include -I/usr/lib/jvm/java-1.7.0-openjdk-1.7.0.91-2.6.2.1.el7_1.x86_64/include/linux -DZOOKEEPER_VERSION=\"3.4.5\" -I/usr/include/subversion-1 -I/usr/include/apr-1 -I/usr/include/apr-1.0  -pthread -g1 -O0 -Wno-unused-local-typedefs -std=c++11 -MT tests/mesos_tests-logging_tests.o -MD -MP -MF tests/.deps/mesos_tests-logging_tests.Tpo -c -o tests/mesos_tests-logging_tests.o `test -f 'tests/logging_tests.cpp' || echo '../../src/'`tests/logging_tests.cpp
mv -f tests/.deps/mesos_tests-fetcher_tests.Tpo tests/.deps/mesos_tests-fetcher_tests.Po
g++ -DPACKAGE_NAME=\"mesos\" -DPACKAGE_TARNAME=\"mesos\" -DPACKAGE_VERSION=\"0.26.0\" -DPACKAGE_STRING=\"mesos\ 0.26.0\" -DPACKAGE_BUGREPORT=\"\" -DPACKAGE_URL=\"\" -DPACKAGE=\"mesos\" -DVERSION=\"0.26.0\" -DSTDC_HEADERS=1 -DHAVE_SYS_TYPES_H=1 -DHAVE_SYS_STAT_H=1 -DHAVE_STDLIB_H=1 -DHAVE_STRING_H=1 -DHAVE_MEMORY_H=1 -DHAVE_STRINGS_H=1 -DHAVE_INTTYPES_H=1 -DHAVE_STDINT_H=1 -DHAVE_UNISTD_H=1 -DHAVE_DLFCN_H=1 -DLT_OBJDIR=\".libs/\" -DHAVE_PTHREAD_PRIO_INHERIT=1 -DHAVE_PTHREAD=1 -DHAVE_LIBZ=1 -DHAVE_LIBCURL=1 -DHAVE_APR_POOLS_H=1 -DHAVE_LIBAPR_1=1 -DHAVE_SVN_VERSION_H=1 -DHAVE_LIBSVN_SUBR_1=1 -DHAVE_SVN_DELTA_H=1 -DHAVE_LIBSVN_DELTA_1=1 -DHAVE_LIBSASL2=1 -DMESOS_HAS_JAVA=1 -DHAVE_PYTHON=\"2.7\" -DMESOS_HAS_PYTHON=1 -I. -I../../src   -Wall -Werror -DLIBDIR=\"/mesos/mesos-0.26.0/_inst/lib\" -DPKGLIBEXECDIR=\"/mesos/mesos-0.26.0/_inst/libexec/mesos\" -DPKGDATADIR=\"/mesos/mesos-0.26.0/_inst/share/mesos\" -I../../include -I../../3rdparty/libprocess/include -I../../3rdparty/libprocess/3rdparty/stout/include -I../include -I../include/mesos -I../3rdparty/libprocess/3rdparty/boost-1.53.0 -I../3rdparty/libprocess/3rdparty/picojson-1.3.0 -DPICOJSON_USE_INT64 -D__STDC_FORMAT_MACROS -I../3rdparty/libprocess/3rdparty/protobuf-2.5.0/src -I../3rdparty/libprocess/3rdparty/glog-0.3.3/src -I../3rdparty/libprocess/3rdparty/glog-0.3.3/src -I../3rdparty/leveldb/include -I../3rdparty/zookeeper-3.4.5/src/c/include -I../3rdparty/zookeeper-3.4.5/src/c/generated -I../3rdparty/libprocess/3rdparty/protobuf-2.5.0/src -DSOURCE_DIR=\"/mesos/mesos-0.26.0/_build/..\" -DBUILD_DIR=\"/mesos/mesos-0.26.0/_build\" -I../3rdparty/libprocess/3rdparty/gmock-1.7.0/gtest/include -I../3rdparty/libprocess/3rdparty/gmock-1.7.0/include -I/usr/lib/jvm/java-1.7.0-openjdk-1.7.0.91-2.6.2.1.el7_1.x86_64/include -I/usr/lib/jvm/java-1.7.0-openjdk-1.7.0.91-2.6.2.1.el7_1.x86_64/include/linux -DZOOKEEPER_VERSION=\"3.4.5\" -I/usr/include/subversion-1 -I/usr/include/apr-1 -I/usr/include/apr-1.0  -pthread -g1 -O0 -Wno-unused-local-typedefs -std=c++11 -MT tests/mesos_tests-main.o -MD -MP -MF tests/.deps/mesos_tests-main.Tpo -c -o tests/mesos_tests-main.o `test -f 'tests/main.cpp' || echo '../../src/'`tests/main.cpp
mv -f tests/.deps/mesos_tests-logging_tests.Tpo tests/.deps/mesos_tests-logging_tests.Po
g++ -DPACKAGE_NAME=\"mesos\" -DPACKAGE_TARNAME=\"mesos\" -DPACKAGE_VERSION=\"0.26.0\" -DPACKAGE_STRING=\"mesos\ 0.26.0\" -DPACKAGE_BUGREPORT=\"\" -DPACKAGE_URL=\"\" -DPACKAGE=\"mesos\" -DVERSION=\"0.26.0\" -DSTDC_HEADERS=1 -DHAVE_SYS_TYPES_H=1 -DHAVE_SYS_STAT_H=1 -DHAVE_STDLIB_H=1 -DHAVE_STRING_H=1 -DHAVE_MEMORY_H=1 -DHAVE_STRINGS_H=1 -DHAVE_INTTYPES_H=1 -DHAVE_STDINT_H=1 -DHAVE_UNISTD_H=1 -DHAVE_DLFCN_H=1 -DLT_OBJDIR=\".libs/\" -DHAVE_PTHREAD_PRIO_INHERIT=1 -DHAVE_PTHREAD=1 -DHAVE_LIBZ=1 -DHAVE_LIBCURL=1 -DHAVE_APR_POOLS_H=1 -DHAVE_LIBAPR_1=1 -DHAVE_SVN_VERSION_H=1 -DHAVE_LIBSVN_SUBR_1=1 -DHAVE_SVN_DELTA_H=1 -DHAVE_LIBSVN_DELTA_1=1 -DHAVE_LIBSASL2=1 -DMESOS_HAS_JAVA=1 -DHAVE_PYTHON=\"2.7\" -DMESOS_HAS_PYTHON=1 -I. -I../../src   -Wall -Werror -DLIBDIR=\"/mesos/mesos-0.26.0/_inst/lib\" -DPKGLIBEXECDIR=\"/mesos/mesos-0.26.0/_inst/libexec/mesos\" -DPKGDATADIR=\"/mesos/mesos-0.26.0/_inst/share/mesos\" -I../../include -I../../3rdparty/libprocess/include -I../../3rdparty/libprocess/3rdparty/stout/include -I../include -I../include/mesos -I../3rdparty/libprocess/3rdparty/boost-1.53.0 -I../3rdparty/libprocess/3rdparty/picojson-1.3.0 -DPICOJSON_USE_INT64 -D__STDC_FORMAT_MACROS -I../3rdparty/libprocess/3rdparty/protobuf-2.5.0/src -I../3rdparty/libprocess/3rdparty/glog-0.3.3/src -I../3rdparty/libprocess/3rdparty/glog-0.3.3/src -I../3rdparty/leveldb/include -I../3rdparty/zookeeper-3.4.5/src/c/include -I../3rdparty/zookeeper-3.4.5/src/c/generated -I../3rdparty/libprocess/3rdparty/protobuf-2.5.0/src -DSOURCE_DIR=\"/mesos/mesos-0.26.0/_build/..\" -DBUILD_DIR=\"/mesos/mesos-0.26.0/_build\" -I../3rdparty/libprocess/3rdparty/gmock-1.7.0/gtest/include -I../3rdparty/libprocess/3rdparty/gmock-1.7.0/include -I/usr/lib/jvm/java-1.7.0-openjdk-1.7.0.91-2.6.2.1.el7_1.x86_64/include -I/usr/lib/jvm/java-1.7.0-openjdk-1.7.0.91-2.6.2.1.el7_1.x86_64/include/linux -DZOOKEEPER_VERSION=\"3.4.5\" -I/usr/include/subversion-1 -I/usr/include/apr-1 -I/usr/include/apr-1.0  -pthread -g1 -O0 -Wno-unused-local-typedefs -std=c++11 -MT tests/mesos_tests-master_allocator_tests.o -MD -MP -MF tests/.deps/mesos_tests-master_allocator_tests.Tpo -c -o tests/mesos_tests-master_allocator_tests.o `test -f 'tests/master_allocator_tests.cpp' || echo '../../src/'`tests/master_allocator_tests.cpp
mv -f tests/.deps/mesos_tests-fetcher_cache_tests.Tpo tests/.deps/mesos_tests-fetcher_cache_tests.Po
g++ -DPACKAGE_NAME=\"mesos\" -DPACKAGE_TARNAME=\"mesos\" -DPACKAGE_VERSION=\"0.26.0\" -DPACKAGE_STRING=\"mesos\ 0.26.0\" -DPACKAGE_BUGREPORT=\"\" -DPACKAGE_URL=\"\" -DPACKAGE=\"mesos\" -DVERSION=\"0.26.0\" -DSTDC_HEADERS=1 -DHAVE_SYS_TYPES_H=1 -DHAVE_SYS_STAT_H=1 -DHAVE_STDLIB_H=1 -DHAVE_STRING_H=1 -DHAVE_MEMORY_H=1 -DHAVE_STRINGS_H=1 -DHAVE_INTTYPES_H=1 -DHAVE_STDINT_H=1 -DHAVE_UNISTD_H=1 -DHAVE_DLFCN_H=1 -DLT_OBJDIR=\".libs/\" -DHAVE_PTHREAD_PRIO_INHERIT=1 -DHAVE_PTHREAD=1 -DHAVE_LIBZ=1 -DHAVE_LIBCURL=1 -DHAVE_APR_POOLS_H=1 -DHAVE_LIBAPR_1=1 -DHAVE_SVN_VERSION_H=1 -DHAVE_LIBSVN_SUBR_1=1 -DHAVE_SVN_DELTA_H=1 -DHAVE_LIBSVN_DELTA_1=1 -DHAVE_LIBSASL2=1 -DMESOS_HAS_JAVA=1 -DHAVE_PYTHON=\"2.7\" -DMESOS_HAS_PYTHON=1 -I. -I../../src   -Wall -Werror -DLIBDIR=\"/mesos/mesos-0.26.0/_inst/lib\" -DPKGLIBEXECDIR=\"/mesos/mesos-0.26.0/_inst/libexec/mesos\" -DPKGDATADIR=\"/mesos/mesos-0.26.0/_inst/share/mesos\" -I../../include -I../../3rdparty/libprocess/include -I../../3rdparty/libprocess/3rdparty/stout/include -I../include -I../include/mesos -I../3rdparty/libprocess/3rdparty/boost-1.53.0 -I../3rdparty/libprocess/3rdparty/picojson-1.3.0 -DPICOJSON_USE_INT64 -D__STDC_FORMAT_MACROS -I../3rdparty/libprocess/3rdparty/protobuf-2.5.0/src -I../3rdparty/libprocess/3rdparty/glog-0.3.3/src -I../3rdparty/libprocess/3rdparty/glog-0.3.3/src -I../3rdparty/leveldb/include -I../3rdparty/zookeeper-3.4.5/src/c/include -I../3rdparty/zookeeper-3.4.5/src/c/generated -I../3rdparty/libprocess/3rdparty/protobuf-2.5.0/src -DSOURCE_DIR=\"/mesos/mesos-0.26.0/_build/..\" -DBUILD_DIR=\"/mesos/mesos-0.26.0/_build\" -I../3rdparty/libprocess/3rdparty/gmock-1.7.0/gtest/include -I../3rdparty/libprocess/3rdparty/gmock-1.7.0/include -I/usr/lib/jvm/java-1.7.0-openjdk-1.7.0.91-2.6.2.1.el7_1.x86_64/include -I/usr/lib/jvm/java-1.7.0-openjdk-1.7.0.91-2.6.2.1.el7_1.x86_64/include/linux -DZOOKEEPER_VERSION=\"3.4.5\" -I/usr/include/subversion-1 -I/usr/include/apr-1 -I/usr/include/apr-1.0  -pthread -g1 -O0 -Wno-unused-local-typedefs -std=c++11 -MT tests/mesos_tests-master_authorization_tests.o -MD -MP -MF tests/.deps/mesos_tests-master_authorization_tests.Tpo -c -o tests/mesos_tests-master_authorization_tests.o `test -f 'tests/master_authorization_tests.cpp' || echo '../../src/'`tests/master_authorization_tests.cpp
mv -f tests/.deps/mesos_tests-log_tests.Tpo tests/.deps/mesos_tests-log_tests.Po
g++ -DPACKAGE_NAME=\"mesos\" -DPACKAGE_TARNAME=\"mesos\" -DPACKAGE_VERSION=\"0.26.0\" -DPACKAGE_STRING=\"mesos\ 0.26.0\" -DPACKAGE_BUGREPORT=\"\" -DPACKAGE_URL=\"\" -DPACKAGE=\"mesos\" -DVERSION=\"0.26.0\" -DSTDC_HEADERS=1 -DHAVE_SYS_TYPES_H=1 -DHAVE_SYS_STAT_H=1 -DHAVE_STDLIB_H=1 -DHAVE_STRING_H=1 -DHAVE_MEMORY_H=1 -DHAVE_STRINGS_H=1 -DHAVE_INTTYPES_H=1 -DHAVE_STDINT_H=1 -DHAVE_UNISTD_H=1 -DHAVE_DLFCN_H=1 -DLT_OBJDIR=\".libs/\" -DHAVE_PTHREAD_PRIO_INHERIT=1 -DHAVE_PTHREAD=1 -DHAVE_LIBZ=1 -DHAVE_LIBCURL=1 -DHAVE_APR_POOLS_H=1 -DHAVE_LIBAPR_1=1 -DHAVE_SVN_VERSION_H=1 -DHAVE_LIBSVN_SUBR_1=1 -DHAVE_SVN_DELTA_H=1 -DHAVE_LIBSVN_DELTA_1=1 -DHAVE_LIBSASL2=1 -DMESOS_HAS_JAVA=1 -DHAVE_PYTHON=\"2.7\" -DMESOS_HAS_PYTHON=1 -I. -I../../src   -Wall -Werror -DLIBDIR=\"/mesos/mesos-0.26.0/_inst/lib\" -DPKGLIBEXECDIR=\"/mesos/mesos-0.26.0/_inst/libexec/mesos\" -DPKGDATADIR=\"/mesos/mesos-0.26.0/_inst/share/mesos\" -I../../include -I../../3rdparty/libprocess/include -I../../3rdparty/libprocess/3rdparty/stout/include -I../include -I../include/mesos -I../3rdparty/libprocess/3rdparty/boost-1.53.0 -I../3rdparty/libprocess/3rdparty/picojson-1.3.0 -DPICOJSON_USE_INT64 -D__STDC_FORMAT_MACROS -I../3rdparty/libprocess/3rdparty/protobuf-2.5.0/src -I../3rdparty/libprocess/3rdparty/glog-0.3.3/src -I../3rdparty/libprocess/3rdparty/glog-0.3.3/src -I../3rdparty/leveldb/include -I../3rdparty/zookeeper-3.4.5/src/c/include -I../3rdparty/zookeeper-3.4.5/src/c/generated -I../3rdparty/libprocess/3rdparty/protobuf-2.5.0/src -DSOURCE_DIR=\"/mesos/mesos-0.26.0/_build/..\" -DBUILD_DIR=\"/mesos/mesos-0.26.0/_build\" -I../3rdparty/libprocess/3rdparty/gmock-1.7.0/gtest/include -I../3rdparty/libprocess/3rdparty/gmock-1.7.0/include -I/usr/lib/jvm/java-1.7.0-openjdk-1.7.0.91-2.6.2.1.el7_1.x86_64/include -I/usr/lib/jvm/java-1.7.0-openjdk-1.7.0.91-2.6.2.1.el7_1.x86_64/include/linux -DZOOKEEPER_VERSION=\"3.4.5\" -I/usr/include/subversion-1 -I/usr/include/apr-1 -I/usr/include/apr-1.0  -pthread -g1 -O0 -Wno-unused-local-typedefs -std=c++11 -MT tests/mesos_tests-master_contender_detector_tests.o -MD -MP -MF tests/.deps/mesos_tests-master_contender_detector_tests.Tpo -c -o tests/mesos_tests-master_contender_detector_tests.o `test -f 'tests/master_contender_detector_tests.cpp' || echo '../../src/'`tests/master_contender_detector_tests.cpp
mv -f tests/.deps/mesos_tests-hierarchical_allocator_tests.Tpo tests/.deps/mesos_tests-hierarchical_allocator_tests.Po
g++ -DPACKAGE_NAME=\"mesos\" -DPACKAGE_TARNAME=\"mesos\" -DPACKAGE_VERSION=\"0.26.0\" -DPACKAGE_STRING=\"mesos\ 0.26.0\" -DPACKAGE_BUGREPORT=\"\" -DPACKAGE_URL=\"\" -DPACKAGE=\"mesos\" -DVERSION=\"0.26.0\" -DSTDC_HEADERS=1 -DHAVE_SYS_TYPES_H=1 -DHAVE_SYS_STAT_H=1 -DHAVE_STDLIB_H=1 -DHAVE_STRING_H=1 -DHAVE_MEMORY_H=1 -DHAVE_STRINGS_H=1 -DHAVE_INTTYPES_H=1 -DHAVE_STDINT_H=1 -DHAVE_UNISTD_H=1 -DHAVE_DLFCN_H=1 -DLT_OBJDIR=\".libs/\" -DHAVE_PTHREAD_PRIO_INHERIT=1 -DHAVE_PTHREAD=1 -DHAVE_LIBZ=1 -DHAVE_LIBCURL=1 -DHAVE_APR_POOLS_H=1 -DHAVE_LIBAPR_1=1 -DHAVE_SVN_VERSION_H=1 -DHAVE_LIBSVN_SUBR_1=1 -DHAVE_SVN_DELTA_H=1 -DHAVE_LIBSVN_DELTA_1=1 -DHAVE_LIBSASL2=1 -DMESOS_HAS_JAVA=1 -DHAVE_PYTHON=\"2.7\" -DMESOS_HAS_PYTHON=1 -I. -I../../src   -Wall -Werror -DLIBDIR=\"/mesos/mesos-0.26.0/_inst/lib\" -DPKGLIBEXECDIR=\"/mesos/mesos-0.26.0/_inst/libexec/mesos\" -DPKGDATADIR=\"/mesos/mesos-0.26.0/_inst/share/mesos\" -I../../include -I../../3rdparty/libprocess/include -I../../3rdparty/libprocess/3rdparty/stout/include -I../include -I../include/mesos -I../3rdparty/libprocess/3rdparty/boost-1.53.0 -I../3rdparty/libprocess/3rdparty/picojson-1.3.0 -DPICOJSON_USE_INT64 -D__STDC_FORMAT_MACROS -I../3rdparty/libprocess/3rdparty/protobuf-2.5.0/src -I../3rdparty/libprocess/3rdparty/glog-0.3.3/src -I../3rdparty/libprocess/3rdparty/glog-0.3.3/src -I../3rdparty/leveldb/include -I../3rdparty/zookeeper-3.4.5/src/c/include -I../3rdparty/zookeeper-3.4.5/src/c/generated -I../3rdparty/libprocess/3rdparty/protobuf-2.5.0/src -DSOURCE_DIR=\"/mesos/mesos-0.26.0/_build/..\" -DBUILD_DIR=\"/mesos/mesos-0.26.0/_build\" -I../3rdparty/libprocess/3rdparty/gmock-1.7.0/gtest/include -I../3rdparty/libprocess/3rdparty/gmock-1.7.0/include -I/usr/lib/jvm/java-1.7.0-openjdk-1.7.0.91-2.6.2.1.el7_1.x86_64/include -I/usr/lib/jvm/java-1.7.0-openjdk-1.7.0.91-2.6.2.1.el7_1.x86_64/include/linux -DZOOKEEPER_VERSION=\"3.4.5\" -I/usr/include/subversion-1 -I/usr/include/apr-1 -I/usr/include/apr-1.0  -pthread -g1 -O0 -Wno-unused-local-typedefs -std=c++11 -MT tests/mesos_tests-master_maintenance_tests.o -MD -MP -MF tests/.deps/mesos_tests-master_maintenance_tests.Tpo -c -o tests/mesos_tests-master_maintenance_tests.o `test -f 'tests/master_maintenance_tests.cpp' || echo '../../src/'`tests/master_maintenance_tests.cpp
mv -f tests/.deps/mesos_tests-gc_tests.Tpo tests/.deps/mesos_tests-gc_tests.Po
g++ -DPACKAGE_NAME=\"mesos\" -DPACKAGE_TARNAME=\"mesos\" -DPACKAGE_VERSION=\"0.26.0\" -DPACKAGE_STRING=\"mesos\ 0.26.0\" -DPACKAGE_BUGREPORT=\"\" -DPACKAGE_URL=\"\" -DPACKAGE=\"mesos\" -DVERSION=\"0.26.0\" -DSTDC_HEADERS=1 -DHAVE_SYS_TYPES_H=1 -DHAVE_SYS_STAT_H=1 -DHAVE_STDLIB_H=1 -DHAVE_STRING_H=1 -DHAVE_MEMORY_H=1 -DHAVE_STRINGS_H=1 -DHAVE_INTTYPES_H=1 -DHAVE_STDINT_H=1 -DHAVE_UNISTD_H=1 -DHAVE_DLFCN_H=1 -DLT_OBJDIR=\".libs/\" -DHAVE_PTHREAD_PRIO_INHERIT=1 -DHAVE_PTHREAD=1 -DHAVE_LIBZ=1 -DHAVE_LIBCURL=1 -DHAVE_APR_POOLS_H=1 -DHAVE_LIBAPR_1=1 -DHAVE_SVN_VERSION_H=1 -DHAVE_LIBSVN_SUBR_1=1 -DHAVE_SVN_DELTA_H=1 -DHAVE_LIBSVN_DELTA_1=1 -DHAVE_LIBSASL2=1 -DMESOS_HAS_JAVA=1 -DHAVE_PYTHON=\"2.7\" -DMESOS_HAS_PYTHON=1 -I. -I../../src   -Wall -Werror -DLIBDIR=\"/mesos/mesos-0.26.0/_inst/lib\" -DPKGLIBEXECDIR=\"/mesos/mesos-0.26.0/_inst/libexec/mesos\" -DPKGDATADIR=\"/mesos/mesos-0.26.0/_inst/share/mesos\" -I../../include -I../../3rdparty/libprocess/include -I../../3rdparty/libprocess/3rdparty/stout/include -I../include -I../include/mesos -I../3rdparty/libprocess/3rdparty/boost-1.53.0 -I../3rdparty/libprocess/3rdparty/picojson-1.3.0 -DPICOJSON_USE_INT64 -D__STDC_FORMAT_MACROS -I../3rdparty/libprocess/3rdparty/protobuf-2.5.0/src -I../3rdparty/libprocess/3rdparty/glog-0.3.3/src -I../3rdparty/libprocess/3rdparty/glog-0.3.3/src -I../3rdparty/leveldb/include -I../3rdparty/zookeeper-3.4.5/src/c/include -I../3rdparty/zookeeper-3.4.5/src/c/generated -I../3rdparty/libprocess/3rdparty/protobuf-2.5.0/src -DSOURCE_DIR=\"/mesos/mesos-0.26.0/_build/..\" -DBUILD_DIR=\"/mesos/mesos-0.26.0/_build\" -I../3rdparty/libprocess/3rdparty/gmock-1.7.0/gtest/include -I../3rdparty/libprocess/3rdparty/gmock-1.7.0/include -I/usr/lib/jvm/java-1.7.0-openjdk-1.7.0.91-2.6.2.1.el7_1.x86_64/include -I/usr/lib/jvm/java-1.7.0-openjdk-1.7.0.91-2.6.2.1.el7_1.x86_64/include/linux -DZOOKEEPER_VERSION=\"3.4.5\" -I/usr/include/subversion-1 -I/usr/include/apr-1 -I/usr/include/apr-1.0  -pthread -g1 -O0 -Wno-unused-local-typedefs -std=c++11 -MT tests/mesos_tests-master_slave_reconciliation_tests.o -MD -MP -MF tests/.deps/mesos_tests-master_slave_reconciliation_tests.Tpo -c -o tests/mesos_tests-master_slave_reconciliation_tests.o `test -f 'tests/master_slave_reconciliation_tests.cpp' || echo '../../src/'`tests/master_slave_reconciliation_tests.cpp
mv -f tests/.deps/mesos_tests-fault_tolerance_tests.Tpo tests/.deps/mesos_tests-fault_tolerance_tests.Po
g++ -DPACKAGE_NAME=\"mesos\" -DPACKAGE_TARNAME=\"mesos\" -DPACKAGE_VERSION=\"0.26.0\" -DPACKAGE_STRING=\"mesos\ 0.26.0\" -DPACKAGE_BUGREPORT=\"\" -DPACKAGE_URL=\"\" -DPACKAGE=\"mesos\" -DVERSION=\"0.26.0\" -DSTDC_HEADERS=1 -DHAVE_SYS_TYPES_H=1 -DHAVE_SYS_STAT_H=1 -DHAVE_STDLIB_H=1 -DHAVE_STRING_H=1 -DHAVE_MEMORY_H=1 -DHAVE_STRINGS_H=1 -DHAVE_INTTYPES_H=1 -DHAVE_STDINT_H=1 -DHAVE_UNISTD_H=1 -DHAVE_DLFCN_H=1 -DLT_OBJDIR=\".libs/\" -DHAVE_PTHREAD_PRIO_INHERIT=1 -DHAVE_PTHREAD=1 -DHAVE_LIBZ=1 -DHAVE_LIBCURL=1 -DHAVE_APR_POOLS_H=1 -DHAVE_LIBAPR_1=1 -DHAVE_SVN_VERSION_H=1 -DHAVE_LIBSVN_SUBR_1=1 -DHAVE_SVN_DELTA_H=1 -DHAVE_LIBSVN_DELTA_1=1 -DHAVE_LIBSASL2=1 -DMESOS_HAS_JAVA=1 -DHAVE_PYTHON=\"2.7\" -DMESOS_HAS_PYTHON=1 -I. -I../../src   -Wall -Werror -DLIBDIR=\"/mesos/mesos-0.26.0/_inst/lib\" -DPKGLIBEXECDIR=\"/mesos/mesos-0.26.0/_inst/libexec/mesos\" -DPKGDATADIR=\"/mesos/mesos-0.26.0/_inst/share/mesos\" -I../../include -I../../3rdparty/libprocess/include -I../../3rdparty/libprocess/3rdparty/stout/include -I../include -I../include/mesos -I../3rdparty/libprocess/3rdparty/boost-1.53.0 -I../3rdparty/libprocess/3rdparty/picojson-1.3.0 -DPICOJSON_USE_INT64 -D__STDC_FORMAT_MACROS -I../3rdparty/libprocess/3rdparty/protobuf-2.5.0/src -I../3rdparty/libprocess/3rdparty/glog-0.3.3/src -I../3rdparty/libprocess/3rdparty/glog-0.3.3/src -I../3rdparty/leveldb/include -I../3rdparty/zookeeper-3.4.5/src/c/include -I../3rdparty/zookeeper-3.4.5/src/c/generated -I../3rdparty/libprocess/3rdparty/protobuf-2.5.0/src -DSOURCE_DIR=\"/mesos/mesos-0.26.0/_build/..\" -DBUILD_DIR=\"/mesos/mesos-0.26.0/_build\" -I../3rdparty/libprocess/3rdparty/gmock-1.7.0/gtest/include -I../3rdparty/libprocess/3rdparty/gmock-1.7.0/include -I/usr/lib/jvm/java-1.7.0-openjdk-1.7.0.91-2.6.2.1.el7_1.x86_64/include -I/usr/lib/jvm/java-1.7.0-openjdk-1.7.0.91-2.6.2.1.el7_1.x86_64/include/linux -DZOOKEEPER_VERSION=\"3.4.5\" -I/usr/include/subversion-1 -I/usr/include/apr-1 -I/usr/include/apr-1.0  -pthread -g1 -O0 -Wno-unused-local-typedefs -std=c++11 -MT tests/mesos_tests-master_tests.o -MD -MP -MF tests/.deps/mesos_tests-master_tests.Tpo -c -o tests/mesos_tests-master_tests.o `test -f 'tests/master_tests.cpp' || echo '../../src/'`tests/master_tests.cpp
mv -f tests/.deps/mesos_tests-main.Tpo tests/.deps/mesos_tests-main.Po
g++ -DPACKAGE_NAME=\"mesos\" -DPACKAGE_TARNAME=\"mesos\" -DPACKAGE_VERSION=\"0.26.0\" -DPACKAGE_STRING=\"mesos\ 0.26.0\" -DPACKAGE_BUGREPORT=\"\" -DPACKAGE_URL=\"\" -DPACKAGE=\"mesos\" -DVERSION=\"0.26.0\" -DSTDC_HEADERS=1 -DHAVE_SYS_TYPES_H=1 -DHAVE_SYS_STAT_H=1 -DHAVE_STDLIB_H=1 -DHAVE_STRING_H=1 -DHAVE_MEMORY_H=1 -DHAVE_STRINGS_H=1 -DHAVE_INTTYPES_H=1 -DHAVE_STDINT_H=1 -DHAVE_UNISTD_H=1 -DHAVE_DLFCN_H=1 -DLT_OBJDIR=\".libs/\" -DHAVE_PTHREAD_PRIO_INHERIT=1 -DHAVE_PTHREAD=1 -DHAVE_LIBZ=1 -DHAVE_LIBCURL=1 -DHAVE_APR_POOLS_H=1 -DHAVE_LIBAPR_1=1 -DHAVE_SVN_VERSION_H=1 -DHAVE_LIBSVN_SUBR_1=1 -DHAVE_SVN_DELTA_H=1 -DHAVE_LIBSVN_DELTA_1=1 -DHAVE_LIBSASL2=1 -DMESOS_HAS_JAVA=1 -DHAVE_PYTHON=\"2.7\" -DMESOS_HAS_PYTHON=1 -I. -I../../src   -Wall -Werror -DLIBDIR=\"/mesos/mesos-0.26.0/_inst/lib\" -DPKGLIBEXECDIR=\"/mesos/mesos-0.26.0/_inst/libexec/mesos\" -DPKGDATADIR=\"/mesos/mesos-0.26.0/_inst/share/mesos\" -I../../include -I../../3rdparty/libprocess/include -I../../3rdparty/libprocess/3rdparty/stout/include -I../include -I../include/mesos -I../3rdparty/libprocess/3rdparty/boost-1.53.0 -I../3rdparty/libprocess/3rdparty/picojson-1.3.0 -DPICOJSON_USE_INT64 -D__STDC_FORMAT_MACROS -I../3rdparty/libprocess/3rdparty/protobuf-2.5.0/src -I../3rdparty/libprocess/3rdparty/glog-0.3.3/src -I../3rdparty/libprocess/3rdparty/glog-0.3.3/src -I../3rdparty/leveldb/include -I../3rdparty/zookeeper-3.4.5/src/c/include -I../3rdparty/zookeeper-3.4.5/src/c/generated -I../3rdparty/libprocess/3rdparty/protobuf-2.5.0/src -DSOURCE_DIR=\"/mesos/mesos-0.26.0/_build/..\" -DBUILD_DIR=\"/mesos/mesos-0.26.0/_build\" -I../3rdparty/libprocess/3rdparty/gmock-1.7.0/gtest/include -I../3rdparty/libprocess/3rdparty/gmock-1.7.0/include -I/usr/lib/jvm/java-1.7.0-openjdk-1.7.0.91-2.6.2.1.el7_1.x86_64/include -I/usr/lib/jvm/java-1.7.0-openjdk-1.7.0.91-2.6.2.1.el7_1.x86_64/include/linux -DZOOKEEPER_VERSION=\"3.4.5\" -I/usr/include/subversion-1 -I/usr/include/apr-1 -I/usr/include/apr-1.0  -pthread -g1 -O0 -Wno-unused-local-typedefs -std=c++11 -MT tests/mesos_tests-master_validation_tests.o -MD -MP -MF tests/.deps/mesos_tests-master_validation_tests.Tpo -c -o tests/mesos_tests-master_validation_tests.o `test -f 'tests/master_validation_tests.cpp' || echo '../../src/'`tests/master_validation_tests.cpp
mv -f tests/.deps/mesos_tests-hook_tests.Tpo tests/.deps/mesos_tests-hook_tests.Po
g++ -DPACKAGE_NAME=\"mesos\" -DPACKAGE_TARNAME=\"mesos\" -DPACKAGE_VERSION=\"0.26.0\" -DPACKAGE_STRING=\"mesos\ 0.26.0\" -DPACKAGE_BUGREPORT=\"\" -DPACKAGE_URL=\"\" -DPACKAGE=\"mesos\" -DVERSION=\"0.26.0\" -DSTDC_HEADERS=1 -DHAVE_SYS_TYPES_H=1 -DHAVE_SYS_STAT_H=1 -DHAVE_STDLIB_H=1 -DHAVE_STRING_H=1 -DHAVE_MEMORY_H=1 -DHAVE_STRINGS_H=1 -DHAVE_INTTYPES_H=1 -DHAVE_STDINT_H=1 -DHAVE_UNISTD_H=1 -DHAVE_DLFCN_H=1 -DLT_OBJDIR=\".libs/\" -DHAVE_PTHREAD_PRIO_INHERIT=1 -DHAVE_PTHREAD=1 -DHAVE_LIBZ=1 -DHAVE_LIBCURL=1 -DHAVE_APR_POOLS_H=1 -DHAVE_LIBAPR_1=1 -DHAVE_SVN_VERSION_H=1 -DHAVE_LIBSVN_SUBR_1=1 -DHAVE_SVN_DELTA_H=1 -DHAVE_LIBSVN_DELTA_1=1 -DHAVE_LIBSASL2=1 -DMESOS_HAS_JAVA=1 -DHAVE_PYTHON=\"2.7\" -DMESOS_HAS_PYTHON=1 -I. -I../../src   -Wall -Werror -DLIBDIR=\"/mesos/mesos-0.26.0/_inst/lib\" -DPKGLIBEXECDIR=\"/mesos/mesos-0.26.0/_inst/libexec/mesos\" -DPKGDATADIR=\"/mesos/mesos-0.26.0/_inst/share/mesos\" -I../../include -I../../3rdparty/libprocess/include -I../../3rdparty/libprocess/3rdparty/stout/include -I../include -I../include/mesos -I../3rdparty/libprocess/3rdparty/boost-1.53.0 -I../3rdparty/libprocess/3rdparty/picojson-1.3.0 -DPICOJSON_USE_INT64 -D__STDC_FORMAT_MACROS -I../3rdparty/libprocess/3rdparty/protobuf-2.5.0/src -I../3rdparty/libprocess/3rdparty/glog-0.3.3/src -I../3rdparty/libprocess/3rdparty/glog-0.3.3/src -I../3rdparty/leveldb/include -I../3rdparty/zookeeper-3.4.5/src/c/include -I../3rdparty/zookeeper-3.4.5/src/c/generated -I../3rdparty/libprocess/3rdparty/protobuf-2.5.0/src -DSOURCE_DIR=\"/mesos/mesos-0.26.0/_build/..\" -DBUILD_DIR=\"/mesos/mesos-0.26.0/_build\" -I../3rdparty/libprocess/3rdparty/gmock-1.7.0/gtest/include -I../3rdparty/libprocess/3rdparty/gmock-1.7.0/include -I/usr/lib/jvm/java-1.7.0-openjdk-1.7.0.91-2.6.2.1.el7_1.x86_64/include -I/usr/lib/jvm/java-1.7.0-openjdk-1.7.0.91-2.6.2.1.el7_1.x86_64/include/linux -DZOOKEEPER_VERSION=\"3.4.5\" -I/usr/include/subversion-1 -I/usr/include/apr-1 -I/usr/include/apr-1.0  -pthread -g1 -O0 -Wno-unused-local-typedefs -std=c++11 -MT tests/mesos_tests-mesos.o -MD -MP -MF tests/.deps/mesos_tests-mesos.Tpo -c -o tests/mesos_tests-mesos.o `test -f 'tests/mesos.cpp' || echo '../../src/'`tests/mesos.cpp
mv -f tests/.deps/mesos_tests-master_authorization_tests.Tpo tests/.deps/mesos_tests-master_authorization_tests.Po
g++ -DPACKAGE_NAME=\"mesos\" -DPACKAGE_TARNAME=\"mesos\" -DPACKAGE_VERSION=\"0.26.0\" -DPACKAGE_STRING=\"mesos\ 0.26.0\" -DPACKAGE_BUGREPORT=\"\" -DPACKAGE_URL=\"\" -DPACKAGE=\"mesos\" -DVERSION=\"0.26.0\" -DSTDC_HEADERS=1 -DHAVE_SYS_TYPES_H=1 -DHAVE_SYS_STAT_H=1 -DHAVE_STDLIB_H=1 -DHAVE_STRING_H=1 -DHAVE_MEMORY_H=1 -DHAVE_STRINGS_H=1 -DHAVE_INTTYPES_H=1 -DHAVE_STDINT_H=1 -DHAVE_UNISTD_H=1 -DHAVE_DLFCN_H=1 -DLT_OBJDIR=\".libs/\" -DHAVE_PTHREAD_PRIO_INHERIT=1 -DHAVE_PTHREAD=1 -DHAVE_LIBZ=1 -DHAVE_LIBCURL=1 -DHAVE_APR_POOLS_H=1 -DHAVE_LIBAPR_1=1 -DHAVE_SVN_VERSION_H=1 -DHAVE_LIBSVN_SUBR_1=1 -DHAVE_SVN_DELTA_H=1 -DHAVE_LIBSVN_DELTA_1=1 -DHAVE_LIBSASL2=1 -DMESOS_HAS_JAVA=1 -DHAVE_PYTHON=\"2.7\" -DMESOS_HAS_PYTHON=1 -I. -I../../src   -Wall -Werror -DLIBDIR=\"/mesos/mesos-0.26.0/_inst/lib\" -DPKGLIBEXECDIR=\"/mesos/mesos-0.26.0/_inst/libexec/mesos\" -DPKGDATADIR=\"/mesos/mesos-0.26.0/_inst/share/mesos\" -I../../include -I../../3rdparty/libprocess/include -I../../3rdparty/libprocess/3rdparty/stout/include -I../include -I../include/mesos -I../3rdparty/libprocess/3rdparty/boost-1.53.0 -I../3rdparty/libprocess/3rdparty/picojson-1.3.0 -DPICOJSON_USE_INT64 -D__STDC_FORMAT_MACROS -I../3rdparty/libprocess/3rdparty/protobuf-2.5.0/src -I../3rdparty/libprocess/3rdparty/glog-0.3.3/src -I../3rdparty/libprocess/3rdparty/glog-0.3.3/src -I../3rdparty/leveldb/include -I../3rdparty/zookeeper-3.4.5/src/c/include -I../3rdparty/zookeeper-3.4.5/src/c/generated -I../3rdparty/libprocess/3rdparty/protobuf-2.5.0/src -DSOURCE_DIR=\"/mesos/mesos-0.26.0/_build/..\" -DBUILD_DIR=\"/mesos/mesos-0.26.0/_build\" -I../3rdparty/libprocess/3rdparty/gmock-1.7.0/gtest/include -I../3rdparty/libprocess/3rdparty/gmock-1.7.0/include -I/usr/lib/jvm/java-1.7.0-openjdk-1.7.0.91-2.6.2.1.el7_1.x86_64/include -I/usr/lib/jvm/java-1.7.0-openjdk-1.7.0.91-2.6.2.1.el7_1.x86_64/include/linux -DZOOKEEPER_VERSION=\"3.4.5\" -I/usr/include/subversion-1 -I/usr/include/apr-1 -I/usr/include/apr-1.0  -pthread -g1 -O0 -Wno-unused-local-typedefs -std=c++11 -MT tests/mesos_tests-metrics_tests.o -MD -MP -MF tests/.deps/mesos_tests-metrics_tests.Tpo -c -o tests/mesos_tests-metrics_tests.o `test -f 'tests/metrics_tests.cpp' || echo '../../src/'`tests/metrics_tests.cpp
mv -f tests/.deps/mesos_tests-master_contender_detector_tests.Tpo tests/.deps/mesos_tests-master_contender_detector_tests.Po
g++ -DPACKAGE_NAME=\"mesos\" -DPACKAGE_TARNAME=\"mesos\" -DPACKAGE_VERSION=\"0.26.0\" -DPACKAGE_STRING=\"mesos\ 0.26.0\" -DPACKAGE_BUGREPORT=\"\" -DPACKAGE_URL=\"\" -DPACKAGE=\"mesos\" -DVERSION=\"0.26.0\" -DSTDC_HEADERS=1 -DHAVE_SYS_TYPES_H=1 -DHAVE_SYS_STAT_H=1 -DHAVE_STDLIB_H=1 -DHAVE_STRING_H=1 -DHAVE_MEMORY_H=1 -DHAVE_STRINGS_H=1 -DHAVE_INTTYPES_H=1 -DHAVE_STDINT_H=1 -DHAVE_UNISTD_H=1 -DHAVE_DLFCN_H=1 -DLT_OBJDIR=\".libs/\" -DHAVE_PTHREAD_PRIO_INHERIT=1 -DHAVE_PTHREAD=1 -DHAVE_LIBZ=1 -DHAVE_LIBCURL=1 -DHAVE_APR_POOLS_H=1 -DHAVE_LIBAPR_1=1 -DHAVE_SVN_VERSION_H=1 -DHAVE_LIBSVN_SUBR_1=1 -DHAVE_SVN_DELTA_H=1 -DHAVE_LIBSVN_DELTA_1=1 -DHAVE_LIBSASL2=1 -DMESOS_HAS_JAVA=1 -DHAVE_PYTHON=\"2.7\" -DMESOS_HAS_PYTHON=1 -I. -I../../src   -Wall -Werror -DLIBDIR=\"/mesos/mesos-0.26.0/_inst/lib\" -DPKGLIBEXECDIR=\"/mesos/mesos-0.26.0/_inst/libexec/mesos\" -DPKGDATADIR=\"/mesos/mesos-0.26.0/_inst/share/mesos\" -I../../include -I../../3rdparty/libprocess/include -I../../3rdparty/libprocess/3rdparty/stout/include -I../include -I../include/mesos -I../3rdparty/libprocess/3rdparty/boost-1.53.0 -I../3rdparty/libprocess/3rdparty/picojson-1.3.0 -DPICOJSON_USE_INT64 -D__STDC_FORMAT_MACROS -I../3rdparty/libprocess/3rdparty/protobuf-2.5.0/src -I../3rdparty/libprocess/3rdparty/glog-0.3.3/src -I../3rdparty/libprocess/3rdparty/glog-0.3.3/src -I../3rdparty/leveldb/include -I../3rdparty/zookeeper-3.4.5/src/c/include -I../3rdparty/zookeeper-3.4.5/src/c/generated -I../3rdparty/libprocess/3rdparty/protobuf-2.5.0/src -DSOURCE_DIR=\"/mesos/mesos-0.26.0/_build/..\" -DBUILD_DIR=\"/mesos/mesos-0.26.0/_build\" -I../3rdparty/libprocess/3rdparty/gmock-1.7.0/gtest/include -I../3rdparty/libprocess/3rdparty/gmock-1.7.0/include -I/usr/lib/jvm/java-1.7.0-openjdk-1.7.0.91-2.6.2.1.el7_1.x86_64/include -I/usr/lib/jvm/java-1.7.0-openjdk-1.7.0.91-2.6.2.1.el7_1.x86_64/include/linux -DZOOKEEPER_VERSION=\"3.4.5\" -I/usr/include/subversion-1 -I/usr/include/apr-1 -I/usr/include/apr-1.0  -pthread -g1 -O0 -Wno-unused-local-typedefs -std=c++11 -MT tests/mesos_tests-module.o -MD -MP -MF tests/.deps/mesos_tests-module.Tpo -c -o tests/mesos_tests-module.o `test -f 'tests/module.cpp' || echo '../../src/'`tests/module.cpp
mv -f tests/.deps/mesos_tests-master_allocator_tests.Tpo tests/.deps/mesos_tests-master_allocator_tests.Po
g++ -DPACKAGE_NAME=\"mesos\" -DPACKAGE_TARNAME=\"mesos\" -DPACKAGE_VERSION=\"0.26.0\" -DPACKAGE_STRING=\"mesos\ 0.26.0\" -DPACKAGE_BUGREPORT=\"\" -DPACKAGE_URL=\"\" -DPACKAGE=\"mesos\" -DVERSION=\"0.26.0\" -DSTDC_HEADERS=1 -DHAVE_SYS_TYPES_H=1 -DHAVE_SYS_STAT_H=1 -DHAVE_STDLIB_H=1 -DHAVE_STRING_H=1 -DHAVE_MEMORY_H=1 -DHAVE_STRINGS_H=1 -DHAVE_INTTYPES_H=1 -DHAVE_STDINT_H=1 -DHAVE_UNISTD_H=1 -DHAVE_DLFCN_H=1 -DLT_OBJDIR=\".libs/\" -DHAVE_PTHREAD_PRIO_INHERIT=1 -DHAVE_PTHREAD=1 -DHAVE_LIBZ=1 -DHAVE_LIBCURL=1 -DHAVE_APR_POOLS_H=1 -DHAVE_LIBAPR_1=1 -DHAVE_SVN_VERSION_H=1 -DHAVE_LIBSVN_SUBR_1=1 -DHAVE_SVN_DELTA_H=1 -DHAVE_LIBSVN_DELTA_1=1 -DHAVE_LIBSASL2=1 -DMESOS_HAS_JAVA=1 -DHAVE_PYTHON=\"2.7\" -DMESOS_HAS_PYTHON=1 -I. -I../../src   -Wall -Werror -DLIBDIR=\"/mesos/mesos-0.26.0/_inst/lib\" -DPKGLIBEXECDIR=\"/mesos/mesos-0.26.0/_inst/libexec/mesos\" -DPKGDATADIR=\"/mesos/mesos-0.26.0/_inst/share/mesos\" -I../../include -I../../3rdparty/libprocess/include -I../../3rdparty/libprocess/3rdparty/stout/include -I../include -I../include/mesos -I../3rdparty/libprocess/3rdparty/boost-1.53.0 -I../3rdparty/libprocess/3rdparty/picojson-1.3.0 -DPICOJSON_USE_INT64 -D__STDC_FORMAT_MACROS -I../3rdparty/libprocess/3rdparty/protobuf-2.5.0/src -I../3rdparty/libprocess/3rdparty/glog-0.3.3/src -I../3rdparty/libprocess/3rdparty/glog-0.3.3/src -I../3rdparty/leveldb/include -I../3rdparty/zookeeper-3.4.5/src/c/include -I../3rdparty/zookeeper-3.4.5/src/c/generated -I../3rdparty/libprocess/3rdparty/protobuf-2.5.0/src -DSOURCE_DIR=\"/mesos/mesos-0.26.0/_build/..\" -DBUILD_DIR=\"/mesos/mesos-0.26.0/_build\" -I../3rdparty/libprocess/3rdparty/gmock-1.7.0/gtest/include -I../3rdparty/libprocess/3rdparty/gmock-1.7.0/include -I/usr/lib/jvm/java-1.7.0-openjdk-1.7.0.91-2.6.2.1.el7_1.x86_64/include -I/usr/lib/jvm/java-1.7.0-openjdk-1.7.0.91-2.6.2.1.el7_1.x86_64/include/linux -DZOOKEEPER_VERSION=\"3.4.5\" -I/usr/include/subversion-1 -I/usr/include/apr-1 -I/usr/include/apr-1.0  -pthread -g1 -O0 -Wno-unused-local-typedefs -std=c++11 -MT tests/mesos_tests-module_tests.o -MD -MP -MF tests/.deps/mesos_tests-module_tests.Tpo -c -o tests/mesos_tests-module_tests.o `test -f 'tests/module_tests.cpp' || echo '../../src/'`tests/module_tests.cpp
mv -f tests/.deps/mesos_tests-master_maintenance_tests.Tpo tests/.deps/mesos_tests-master_maintenance_tests.Po
g++ -DPACKAGE_NAME=\"mesos\" -DPACKAGE_TARNAME=\"mesos\" -DPACKAGE_VERSION=\"0.26.0\" -DPACKAGE_STRING=\"mesos\ 0.26.0\" -DPACKAGE_BUGREPORT=\"\" -DPACKAGE_URL=\"\" -DPACKAGE=\"mesos\" -DVERSION=\"0.26.0\" -DSTDC_HEADERS=1 -DHAVE_SYS_TYPES_H=1 -DHAVE_SYS_STAT_H=1 -DHAVE_STDLIB_H=1 -DHAVE_STRING_H=1 -DHAVE_MEMORY_H=1 -DHAVE_STRINGS_H=1 -DHAVE_INTTYPES_H=1 -DHAVE_STDINT_H=1 -DHAVE_UNISTD_H=1 -DHAVE_DLFCN_H=1 -DLT_OBJDIR=\".libs/\" -DHAVE_PTHREAD_PRIO_INHERIT=1 -DHAVE_PTHREAD=1 -DHAVE_LIBZ=1 -DHAVE_LIBCURL=1 -DHAVE_APR_POOLS_H=1 -DHAVE_LIBAPR_1=1 -DHAVE_SVN_VERSION_H=1 -DHAVE_LIBSVN_SUBR_1=1 -DHAVE_SVN_DELTA_H=1 -DHAVE_LIBSVN_DELTA_1=1 -DHAVE_LIBSASL2=1 -DMESOS_HAS_JAVA=1 -DHAVE_PYTHON=\"2.7\" -DMESOS_HAS_PYTHON=1 -I. -I../../src   -Wall -Werror -DLIBDIR=\"/mesos/mesos-0.26.0/_inst/lib\" -DPKGLIBEXECDIR=\"/mesos/mesos-0.26.0/_inst/libexec/mesos\" -DPKGDATADIR=\"/mesos/mesos-0.26.0/_inst/share/mesos\" -I../../include -I../../3rdparty/libprocess/include -I../../3rdparty/libprocess/3rdparty/stout/include -I../include -I../include/mesos -I../3rdparty/libprocess/3rdparty/boost-1.53.0 -I../3rdparty/libprocess/3rdparty/picojson-1.3.0 -DPICOJSON_USE_INT64 -D__STDC_FORMAT_MACROS -I../3rdparty/libprocess/3rdparty/protobuf-2.5.0/src -I../3rdparty/libprocess/3rdparty/glog-0.3.3/src -I../3rdparty/libprocess/3rdparty/glog-0.3.3/src -I../3rdparty/leveldb/include -I../3rdparty/zookeeper-3.4.5/src/c/include -I../3rdparty/zookeeper-3.4.5/src/c/generated -I../3rdparty/libprocess/3rdparty/protobuf-2.5.0/src -DSOURCE_DIR=\"/mesos/mesos-0.26.0/_build/..\" -DBUILD_DIR=\"/mesos/mesos-0.26.0/_build\" -I../3rdparty/libprocess/3rdparty/gmock-1.7.0/gtest/include -I../3rdparty/libprocess/3rdparty/gmock-1.7.0/include -I/usr/lib/jvm/java-1.7.0-openjdk-1.7.0.91-2.6.2.1.el7_1.x86_64/include -I/usr/lib/jvm/java-1.7.0-openjdk-1.7.0.91-2.6.2.1.el7_1.x86_64/include/linux -DZOOKEEPER_VERSION=\"3.4.5\" -I/usr/include/subversion-1 -I/usr/include/apr-1 -I/usr/include/apr-1.0  -pthread -g1 -O0 -Wno-unused-local-typedefs -std=c++11 -MT tests/mesos_tests-monitor_tests.o -MD -MP -MF tests/.deps/mesos_tests-monitor_tests.Tpo -c -o tests/mesos_tests-monitor_tests.o `test -f 'tests/monitor_tests.cpp' || echo '../../src/'`tests/monitor_tests.cpp
mv -f tests/.deps/mesos_tests-master_validation_tests.Tpo tests/.deps/mesos_tests-master_validation_tests.Po
g++ -DPACKAGE_NAME=\"mesos\" -DPACKAGE_TARNAME=\"mesos\" -DPACKAGE_VERSION=\"0.26.0\" -DPACKAGE_STRING=\"mesos\ 0.26.0\" -DPACKAGE_BUGREPORT=\"\" -DPACKAGE_URL=\"\" -DPACKAGE=\"mesos\" -DVERSION=\"0.26.0\" -DSTDC_HEADERS=1 -DHAVE_SYS_TYPES_H=1 -DHAVE_SYS_STAT_H=1 -DHAVE_STDLIB_H=1 -DHAVE_STRING_H=1 -DHAVE_MEMORY_H=1 -DHAVE_STRINGS_H=1 -DHAVE_INTTYPES_H=1 -DHAVE_STDINT_H=1 -DHAVE_UNISTD_H=1 -DHAVE_DLFCN_H=1 -DLT_OBJDIR=\".libs/\" -DHAVE_PTHREAD_PRIO_INHERIT=1 -DHAVE_PTHREAD=1 -DHAVE_LIBZ=1 -DHAVE_LIBCURL=1 -DHAVE_APR_POOLS_H=1 -DHAVE_LIBAPR_1=1 -DHAVE_SVN_VERSION_H=1 -DHAVE_LIBSVN_SUBR_1=1 -DHAVE_SVN_DELTA_H=1 -DHAVE_LIBSVN_DELTA_1=1 -DHAVE_LIBSASL2=1 -DMESOS_HAS_JAVA=1 -DHAVE_PYTHON=\"2.7\" -DMESOS_HAS_PYTHON=1 -I. -I../../src   -Wall -Werror -DLIBDIR=\"/mesos/mesos-0.26.0/_inst/lib\" -DPKGLIBEXECDIR=\"/mesos/mesos-0.26.0/_inst/libexec/mesos\" -DPKGDATADIR=\"/mesos/mesos-0.26.0/_inst/share/mesos\" -I../../include -I../../3rdparty/libprocess/include -I../../3rdparty/libprocess/3rdparty/stout/include -I../include -I../include/mesos -I../3rdparty/libprocess/3rdparty/boost-1.53.0 -I../3rdparty/libprocess/3rdparty/picojson-1.3.0 -DPICOJSON_USE_INT64 -D__STDC_FORMAT_MACROS -I../3rdparty/libprocess/3rdparty/protobuf-2.5.0/src -I../3rdparty/libprocess/3rdparty/glog-0.3.3/src -I../3rdparty/libprocess/3rdparty/glog-0.3.3/src -I../3rdparty/leveldb/include -I../3rdparty/zookeeper-3.4.5/src/c/include -I../3rdparty/zookeeper-3.4.5/src/c/generated -I../3rdparty/libprocess/3rdparty/protobuf-2.5.0/src -DSOURCE_DIR=\"/mesos/mesos-0.26.0/_build/..\" -DBUILD_DIR=\"/mesos/mesos-0.26.0/_build\" -I../3rdparty/libprocess/3rdparty/gmock-1.7.0/gtest/include -I../3rdparty/libprocess/3rdparty/gmock-1.7.0/include -I/usr/lib/jvm/java-1.7.0-openjdk-1.7.0.91-2.6.2.1.el7_1.x86_64/include -I/usr/lib/jvm/java-1.7.0-openjdk-1.7.0.91-2.6.2.1.el7_1.x86_64/include/linux -DZOOKEEPER_VERSION=\"3.4.5\" -I/usr/include/subversion-1 -I/usr/include/apr-1 -I/usr/include/apr-1.0  -pthread -g1 -O0 -Wno-unused-local-typedefs -std=c++11 -MT tests/mesos_tests-oversubscription_tests.o -MD -MP -MF tests/.deps/mesos_tests-oversubscription_tests.Tpo -c -o tests/mesos_tests-oversubscription_tests.o `test -f 'tests/oversubscription_tests.cpp' || echo '../../src/'`tests/oversubscription_tests.cpp
mv -f tests/.deps/mesos_tests-master_slave_reconciliation_tests.Tpo tests/.deps/mesos_tests-master_slave_reconciliation_tests.Po
g++ -DPACKAGE_NAME=\"mesos\" -DPACKAGE_TARNAME=\"mesos\" -DPACKAGE_VERSION=\"0.26.0\" -DPACKAGE_STRING=\"mesos\ 0.26.0\" -DPACKAGE_BUGREPORT=\"\" -DPACKAGE_URL=\"\" -DPACKAGE=\"mesos\" -DVERSION=\"0.26.0\" -DSTDC_HEADERS=1 -DHAVE_SYS_TYPES_H=1 -DHAVE_SYS_STAT_H=1 -DHAVE_STDLIB_H=1 -DHAVE_STRING_H=1 -DHAVE_MEMORY_H=1 -DHAVE_STRINGS_H=1 -DHAVE_INTTYPES_H=1 -DHAVE_STDINT_H=1 -DHAVE_UNISTD_H=1 -DHAVE_DLFCN_H=1 -DLT_OBJDIR=\".libs/\" -DHAVE_PTHREAD_PRIO_INHERIT=1 -DHAVE_PTHREAD=1 -DHAVE_LIBZ=1 -DHAVE_LIBCURL=1 -DHAVE_APR_POOLS_H=1 -DHAVE_LIBAPR_1=1 -DHAVE_SVN_VERSION_H=1 -DHAVE_LIBSVN_SUBR_1=1 -DHAVE_SVN_DELTA_H=1 -DHAVE_LIBSVN_DELTA_1=1 -DHAVE_LIBSASL2=1 -DMESOS_HAS_JAVA=1 -DHAVE_PYTHON=\"2.7\" -DMESOS_HAS_PYTHON=1 -I. -I../../src   -Wall -Werror -DLIBDIR=\"/mesos/mesos-0.26.0/_inst/lib\" -DPKGLIBEXECDIR=\"/mesos/mesos-0.26.0/_inst/libexec/mesos\" -DPKGDATADIR=\"/mesos/mesos-0.26.0/_inst/share/mesos\" -I../../include -I../../3rdparty/libprocess/include -I../../3rdparty/libprocess/3rdparty/stout/include -I../include -I../include/mesos -I../3rdparty/libprocess/3rdparty/boost-1.53.0 -I../3rdparty/libprocess/3rdparty/picojson-1.3.0 -DPICOJSON_USE_INT64 -D__STDC_FORMAT_MACROS -I../3rdparty/libprocess/3rdparty/protobuf-2.5.0/src -I../3rdparty/libprocess/3rdparty/glog-0.3.3/src -I../3rdparty/libprocess/3rdparty/glog-0.3.3/src -I../3rdparty/leveldb/include -I../3rdparty/zookeeper-3.4.5/src/c/include -I../3rdparty/zookeeper-3.4.5/src/c/generated -I../3rdparty/libprocess/3rdparty/protobuf-2.5.0/src -DSOURCE_DIR=\"/mesos/mesos-0.26.0/_build/..\" -DBUILD_DIR=\"/mesos/mesos-0.26.0/_build\" -I../3rdparty/libprocess/3rdparty/gmock-1.7.0/gtest/include -I../3rdparty/libprocess/3rdparty/gmock-1.7.0/include -I/usr/lib/jvm/java-1.7.0-openjdk-1.7.0.91-2.6.2.1.el7_1.x86_64/include -I/usr/lib/jvm/java-1.7.0-openjdk-1.7.0.91-2.6.2.1.el7_1.x86_64/include/linux -DZOOKEEPER_VERSION=\"3.4.5\" -I/usr/include/subversion-1 -I/usr/include/apr-1 -I/usr/include/apr-1.0  -pthread -g1 -O0 -Wno-unused-local-typedefs -std=c++11 -MT tests/mesos_tests-partition_tests.o -MD -MP -MF tests/.deps/mesos_tests-partition_tests.Tpo -c -o tests/mesos_tests-partition_tests.o `test -f 'tests/partition_tests.cpp' || echo '../../src/'`tests/partition_tests.cpp
mv -f tests/.deps/mesos_tests-mesos.Tpo tests/.deps/mesos_tests-mesos.Po
g++ -DPACKAGE_NAME=\"mesos\" -DPACKAGE_TARNAME=\"mesos\" -DPACKAGE_VERSION=\"0.26.0\" -DPACKAGE_STRING=\"mesos\ 0.26.0\" -DPACKAGE_BUGREPORT=\"\" -DPACKAGE_URL=\"\" -DPACKAGE=\"mesos\" -DVERSION=\"0.26.0\" -DSTDC_HEADERS=1 -DHAVE_SYS_TYPES_H=1 -DHAVE_SYS_STAT_H=1 -DHAVE_STDLIB_H=1 -DHAVE_STRING_H=1 -DHAVE_MEMORY_H=1 -DHAVE_STRINGS_H=1 -DHAVE_INTTYPES_H=1 -DHAVE_STDINT_H=1 -DHAVE_UNISTD_H=1 -DHAVE_DLFCN_H=1 -DLT_OBJDIR=\".libs/\" -DHAVE_PTHREAD_PRIO_INHERIT=1 -DHAVE_PTHREAD=1 -DHAVE_LIBZ=1 -DHAVE_LIBCURL=1 -DHAVE_APR_POOLS_H=1 -DHAVE_LIBAPR_1=1 -DHAVE_SVN_VERSION_H=1 -DHAVE_LIBSVN_SUBR_1=1 -DHAVE_SVN_DELTA_H=1 -DHAVE_LIBSVN_DELTA_1=1 -DHAVE_LIBSASL2=1 -DMESOS_HAS_JAVA=1 -DHAVE_PYTHON=\"2.7\" -DMESOS_HAS_PYTHON=1 -I. -I../../src   -Wall -Werror -DLIBDIR=\"/mesos/mesos-0.26.0/_inst/lib\" -DPKGLIBEXECDIR=\"/mesos/mesos-0.26.0/_inst/libexec/mesos\" -DPKGDATADIR=\"/mesos/mesos-0.26.0/_inst/share/mesos\" -I../../include -I../../3rdparty/libprocess/include -I../../3rdparty/libprocess/3rdparty/stout/include -I../include -I../include/mesos -I../3rdparty/libprocess/3rdparty/boost-1.53.0 -I../3rdparty/libprocess/3rdparty/picojson-1.3.0 -DPICOJSON_USE_INT64 -D__STDC_FORMAT_MACROS -I../3rdparty/libprocess/3rdparty/protobuf-2.5.0/src -I../3rdparty/libprocess/3rdparty/glog-0.3.3/src -I../3rdparty/libprocess/3rdparty/glog-0.3.3/src -I../3rdparty/leveldb/include -I../3rdparty/zookeeper-3.4.5/src/c/include -I../3rdparty/zookeeper-3.4.5/src/c/generated -I../3rdparty/libprocess/3rdparty/protobuf-2.5.0/src -DSOURCE_DIR=\"/mesos/mesos-0.26.0/_build/..\" -DBUILD_DIR=\"/mesos/mesos-0.26.0/_build\" -I../3rdparty/libprocess/3rdparty/gmock-1.7.0/gtest/include -I../3rdparty/libprocess/3rdparty/gmock-1.7.0/include -I/usr/lib/jvm/java-1.7.0-openjdk-1.7.0.91-2.6.2.1.el7_1.x86_64/include -I/usr/lib/jvm/java-1.7.0-openjdk-1.7.0.91-2.6.2.1.el7_1.x86_64/include/linux -DZOOKEEPER_VERSION=\"3.4.5\" -I/usr/include/subversion-1 -I/usr/include/apr-1 -I/usr/include/apr-1.0  -pthread -g1 -O0 -Wno-unused-local-typedefs -std=c++11 -MT tests/mesos_tests-paths_tests.o -MD -MP -MF tests/.deps/mesos_tests-paths_tests.Tpo -c -o tests/mesos_tests-paths_tests.o `test -f 'tests/paths_tests.cpp' || echo '../../src/'`tests/paths_tests.cpp
mv -f tests/.deps/mesos_tests-metrics_tests.Tpo tests/.deps/mesos_tests-metrics_tests.Po
g++ -DPACKAGE_NAME=\"mesos\" -DPACKAGE_TARNAME=\"mesos\" -DPACKAGE_VERSION=\"0.26.0\" -DPACKAGE_STRING=\"mesos\ 0.26.0\" -DPACKAGE_BUGREPORT=\"\" -DPACKAGE_URL=\"\" -DPACKAGE=\"mesos\" -DVERSION=\"0.26.0\" -DSTDC_HEADERS=1 -DHAVE_SYS_TYPES_H=1 -DHAVE_SYS_STAT_H=1 -DHAVE_STDLIB_H=1 -DHAVE_STRING_H=1 -DHAVE_MEMORY_H=1 -DHAVE_STRINGS_H=1 -DHAVE_INTTYPES_H=1 -DHAVE_STDINT_H=1 -DHAVE_UNISTD_H=1 -DHAVE_DLFCN_H=1 -DLT_OBJDIR=\".libs/\" -DHAVE_PTHREAD_PRIO_INHERIT=1 -DHAVE_PTHREAD=1 -DHAVE_LIBZ=1 -DHAVE_LIBCURL=1 -DHAVE_APR_POOLS_H=1 -DHAVE_LIBAPR_1=1 -DHAVE_SVN_VERSION_H=1 -DHAVE_LIBSVN_SUBR_1=1 -DHAVE_SVN_DELTA_H=1 -DHAVE_LIBSVN_DELTA_1=1 -DHAVE_LIBSASL2=1 -DMESOS_HAS_JAVA=1 -DHAVE_PYTHON=\"2.7\" -DMESOS_HAS_PYTHON=1 -I. -I../../src   -Wall -Werror -DLIBDIR=\"/mesos/mesos-0.26.0/_inst/lib\" -DPKGLIBEXECDIR=\"/mesos/mesos-0.26.0/_inst/libexec/mesos\" -DPKGDATADIR=\"/mesos/mesos-0.26.0/_inst/share/mesos\" -I../../include -I../../3rdparty/libprocess/include -I../../3rdparty/libprocess/3rdparty/stout/include -I../include -I../include/mesos -I../3rdparty/libprocess/3rdparty/boost-1.53.0 -I../3rdparty/libprocess/3rdparty/picojson-1.3.0 -DPICOJSON_USE_INT64 -D__STDC_FORMAT_MACROS -I../3rdparty/libprocess/3rdparty/protobuf-2.5.0/src -I../3rdparty/libprocess/3rdparty/glog-0.3.3/src -I../3rdparty/libprocess/3rdparty/glog-0.3.3/src -I../3rdparty/leveldb/include -I../3rdparty/zookeeper-3.4.5/src/c/include -I../3rdparty/zookeeper-3.4.5/src/c/generated -I../3rdparty/libprocess/3rdparty/protobuf-2.5.0/src -DSOURCE_DIR=\"/mesos/mesos-0.26.0/_build/..\" -DBUILD_DIR=\"/mesos/mesos-0.26.0/_build\" -I../3rdparty/libprocess/3rdparty/gmock-1.7.0/gtest/include -I../3rdparty/libprocess/3rdparty/gmock-1.7.0/include -I/usr/lib/jvm/java-1.7.0-openjdk-1.7.0.91-2.6.2.1.el7_1.x86_64/include -I/usr/lib/jvm/java-1.7.0-openjdk-1.7.0.91-2.6.2.1.el7_1.x86_64/include/linux -DZOOKEEPER_VERSION=\"3.4.5\" -I/usr/include/subversion-1 -I/usr/include/apr-1 -I/usr/include/apr-1.0  -pthread -g1 -O0 -Wno-unused-local-typedefs -std=c++11 -MT tests/mesos_tests-persistent_volume_tests.o -MD -MP -MF tests/.deps/mesos_tests-persistent_volume_tests.Tpo -c -o tests/mesos_tests-persistent_volume_tests.o `test -f 'tests/persistent_volume_tests.cpp' || echo '../../src/'`tests/persistent_volume_tests.cpp
mv -f tests/.deps/mesos_tests-paths_tests.Tpo tests/.deps/mesos_tests-paths_tests.Po
g++ -DPACKAGE_NAME=\"mesos\" -DPACKAGE_TARNAME=\"mesos\" -DPACKAGE_VERSION=\"0.26.0\" -DPACKAGE_STRING=\"mesos\ 0.26.0\" -DPACKAGE_BUGREPORT=\"\" -DPACKAGE_URL=\"\" -DPACKAGE=\"mesos\" -DVERSION=\"0.26.0\" -DSTDC_HEADERS=1 -DHAVE_SYS_TYPES_H=1 -DHAVE_SYS_STAT_H=1 -DHAVE_STDLIB_H=1 -DHAVE_STRING_H=1 -DHAVE_MEMORY_H=1 -DHAVE_STRINGS_H=1 -DHAVE_INTTYPES_H=1 -DHAVE_STDINT_H=1 -DHAVE_UNISTD_H=1 -DHAVE_DLFCN_H=1 -DLT_OBJDIR=\".libs/\" -DHAVE_PTHREAD_PRIO_INHERIT=1 -DHAVE_PTHREAD=1 -DHAVE_LIBZ=1 -DHAVE_LIBCURL=1 -DHAVE_APR_POOLS_H=1 -DHAVE_LIBAPR_1=1 -DHAVE_SVN_VERSION_H=1 -DHAVE_LIBSVN_SUBR_1=1 -DHAVE_SVN_DELTA_H=1 -DHAVE_LIBSVN_DELTA_1=1 -DHAVE_LIBSASL2=1 -DMESOS_HAS_JAVA=1 -DHAVE_PYTHON=\"2.7\" -DMESOS_HAS_PYTHON=1 -I. -I../../src   -Wall -Werror -DLIBDIR=\"/mesos/mesos-0.26.0/_inst/lib\" -DPKGLIBEXECDIR=\"/mesos/mesos-0.26.0/_inst/libexec/mesos\" -DPKGDATADIR=\"/mesos/mesos-0.26.0/_inst/share/mesos\" -I../../include -I../../3rdparty/libprocess/include -I../../3rdparty/libprocess/3rdparty/stout/include -I../include -I../include/mesos -I../3rdparty/libprocess/3rdparty/boost-1.53.0 -I../3rdparty/libprocess/3rdparty/picojson-1.3.0 -DPICOJSON_USE_INT64 -D__STDC_FORMAT_MACROS -I../3rdparty/libprocess/3rdparty/protobuf-2.5.0/src -I../3rdparty/libprocess/3rdparty/glog-0.3.3/src -I../3rdparty/libprocess/3rdparty/glog-0.3.3/src -I../3rdparty/leveldb/include -I../3rdparty/zookeeper-3.4.5/src/c/include -I../3rdparty/zookeeper-3.4.5/src/c/generated -I../3rdparty/libprocess/3rdparty/protobuf-2.5.0/src -DSOURCE_DIR=\"/mesos/mesos-0.26.0/_build/..\" -DBUILD_DIR=\"/mesos/mesos-0.26.0/_build\" -I../3rdparty/libprocess/3rdparty/gmock-1.7.0/gtest/include -I../3rdparty/libprocess/3rdparty/gmock-1.7.0/include -I/usr/lib/jvm/java-1.7.0-openjdk-1.7.0.91-2.6.2.1.el7_1.x86_64/include -I/usr/lib/jvm/java-1.7.0-openjdk-1.7.0.91-2.6.2.1.el7_1.x86_64/include/linux -DZOOKEEPER_VERSION=\"3.4.5\" -I/usr/include/subversion-1 -I/usr/include/apr-1 -I/usr/include/apr-1.0  -pthread -g1 -O0 -Wno-unused-local-typedefs -std=c++11 -MT tests/mesos_tests-protobuf_io_tests.o -MD -MP -MF tests/.deps/mesos_tests-protobuf_io_tests.Tpo -c -o tests/mesos_tests-protobuf_io_tests.o `test -f 'tests/protobuf_io_tests.cpp' || echo '../../src/'`tests/protobuf_io_tests.cpp
mv -f tests/.deps/mesos_tests-module.Tpo tests/.deps/mesos_tests-module.Po
g++ -DPACKAGE_NAME=\"mesos\" -DPACKAGE_TARNAME=\"mesos\" -DPACKAGE_VERSION=\"0.26.0\" -DPACKAGE_STRING=\"mesos\ 0.26.0\" -DPACKAGE_BUGREPORT=\"\" -DPACKAGE_URL=\"\" -DPACKAGE=\"mesos\" -DVERSION=\"0.26.0\" -DSTDC_HEADERS=1 -DHAVE_SYS_TYPES_H=1 -DHAVE_SYS_STAT_H=1 -DHAVE_STDLIB_H=1 -DHAVE_STRING_H=1 -DHAVE_MEMORY_H=1 -DHAVE_STRINGS_H=1 -DHAVE_INTTYPES_H=1 -DHAVE_STDINT_H=1 -DHAVE_UNISTD_H=1 -DHAVE_DLFCN_H=1 -DLT_OBJDIR=\".libs/\" -DHAVE_PTHREAD_PRIO_INHERIT=1 -DHAVE_PTHREAD=1 -DHAVE_LIBZ=1 -DHAVE_LIBCURL=1 -DHAVE_APR_POOLS_H=1 -DHAVE_LIBAPR_1=1 -DHAVE_SVN_VERSION_H=1 -DHAVE_LIBSVN_SUBR_1=1 -DHAVE_SVN_DELTA_H=1 -DHAVE_LIBSVN_DELTA_1=1 -DHAVE_LIBSASL2=1 -DMESOS_HAS_JAVA=1 -DHAVE_PYTHON=\"2.7\" -DMESOS_HAS_PYTHON=1 -I. -I../../src   -Wall -Werror -DLIBDIR=\"/mesos/mesos-0.26.0/_inst/lib\" -DPKGLIBEXECDIR=\"/mesos/mesos-0.26.0/_inst/libexec/mesos\" -DPKGDATADIR=\"/mesos/mesos-0.26.0/_inst/share/mesos\" -I../../include -I../../3rdparty/libprocess/include -I../../3rdparty/libprocess/3rdparty/stout/include -I../include -I../include/mesos -I../3rdparty/libprocess/3rdparty/boost-1.53.0 -I../3rdparty/libprocess/3rdparty/picojson-1.3.0 -DPICOJSON_USE_INT64 -D__STDC_FORMAT_MACROS -I../3rdparty/libprocess/3rdparty/protobuf-2.5.0/src -I../3rdparty/libprocess/3rdparty/glog-0.3.3/src -I../3rdparty/libprocess/3rdparty/glog-0.3.3/src -I../3rdparty/leveldb/include -I../3rdparty/zookeeper-3.4.5/src/c/include -I../3rdparty/zookeeper-3.4.5/src/c/generated -I../3rdparty/libprocess/3rdparty/protobuf-2.5.0/src -DSOURCE_DIR=\"/mesos/mesos-0.26.0/_build/..\" -DBUILD_DIR=\"/mesos/mesos-0.26.0/_build\" -I../3rdparty/libprocess/3rdparty/gmock-1.7.0/gtest/include -I../3rdparty/libprocess/3rdparty/gmock-1.7.0/include -I/usr/lib/jvm/java-1.7.0-openjdk-1.7.0.91-2.6.2.1.el7_1.x86_64/include -I/usr/lib/jvm/java-1.7.0-openjdk-1.7.0.91-2.6.2.1.el7_1.x86_64/include/linux -DZOOKEEPER_VERSION=\"3.4.5\" -I/usr/include/subversion-1 -I/usr/include/apr-1 -I/usr/include/apr-1.0  -pthread -g1 -O0 -Wno-unused-local-typedefs -std=c++11 -MT tests/mesos_tests-rate_limiting_tests.o -MD -MP -MF tests/.deps/mesos_tests-rate_limiting_tests.Tpo -c -o tests/mesos_tests-rate_limiting_tests.o `test -f 'tests/rate_limiting_tests.cpp' || echo '../../src/'`tests/rate_limiting_tests.cpp
mv -f tests/.deps/mesos_tests-master_tests.Tpo tests/.deps/mesos_tests-master_tests.Po
g++ -DPACKAGE_NAME=\"mesos\" -DPACKAGE_TARNAME=\"mesos\" -DPACKAGE_VERSION=\"0.26.0\" -DPACKAGE_STRING=\"mesos\ 0.26.0\" -DPACKAGE_BUGREPORT=\"\" -DPACKAGE_URL=\"\" -DPACKAGE=\"mesos\" -DVERSION=\"0.26.0\" -DSTDC_HEADERS=1 -DHAVE_SYS_TYPES_H=1 -DHAVE_SYS_STAT_H=1 -DHAVE_STDLIB_H=1 -DHAVE_STRING_H=1 -DHAVE_MEMORY_H=1 -DHAVE_STRINGS_H=1 -DHAVE_INTTYPES_H=1 -DHAVE_STDINT_H=1 -DHAVE_UNISTD_H=1 -DHAVE_DLFCN_H=1 -DLT_OBJDIR=\".libs/\" -DHAVE_PTHREAD_PRIO_INHERIT=1 -DHAVE_PTHREAD=1 -DHAVE_LIBZ=1 -DHAVE_LIBCURL=1 -DHAVE_APR_POOLS_H=1 -DHAVE_LIBAPR_1=1 -DHAVE_SVN_VERSION_H=1 -DHAVE_LIBSVN_SUBR_1=1 -DHAVE_SVN_DELTA_H=1 -DHAVE_LIBSVN_DELTA_1=1 -DHAVE_LIBSASL2=1 -DMESOS_HAS_JAVA=1 -DHAVE_PYTHON=\"2.7\" -DMESOS_HAS_PYTHON=1 -I. -I../../src   -Wall -Werror -DLIBDIR=\"/mesos/mesos-0.26.0/_inst/lib\" -DPKGLIBEXECDIR=\"/mesos/mesos-0.26.0/_inst/libexec/mesos\" -DPKGDATADIR=\"/mesos/mesos-0.26.0/_inst/share/mesos\" -I../../include -I../../3rdparty/libprocess/include -I../../3rdparty/libprocess/3rdparty/stout/include -I../include -I../include/mesos -I../3rdparty/libprocess/3rdparty/boost-1.53.0 -I../3rdparty/libprocess/3rdparty/picojson-1.3.0 -DPICOJSON_USE_INT64 -D__STDC_FORMAT_MACROS -I../3rdparty/libprocess/3rdparty/protobuf-2.5.0/src -I../3rdparty/libprocess/3rdparty/glog-0.3.3/src -I../3rdparty/libprocess/3rdparty/glog-0.3.3/src -I../3rdparty/leveldb/include -I../3rdparty/zookeeper-3.4.5/src/c/include -I../3rdparty/zookeeper-3.4.5/src/c/generated -I../3rdparty/libprocess/3rdparty/protobuf-2.5.0/src -DSOURCE_DIR=\"/mesos/mesos-0.26.0/_build/..\" -DBUILD_DIR=\"/mesos/mesos-0.26.0/_build\" -I../3rdparty/libprocess/3rdparty/gmock-1.7.0/gtest/include -I../3rdparty/libprocess/3rdparty/gmock-1.7.0/include -I/usr/lib/jvm/java-1.7.0-openjdk-1.7.0.91-2.6.2.1.el7_1.x86_64/include -I/usr/lib/jvm/java-1.7.0-openjdk-1.7.0.91-2.6.2.1.el7_1.x86_64/include/linux -DZOOKEEPER_VERSION=\"3.4.5\" -I/usr/include/subversion-1 -I/usr/include/apr-1 -I/usr/include/apr-1.0  -pthread -g1 -O0 -Wno-unused-local-typedefs -std=c++11 -MT tests/mesos_tests-reconciliation_tests.o -MD -MP -MF tests/.deps/mesos_tests-reconciliation_tests.Tpo -c -o tests/mesos_tests-reconciliation_tests.o `test -f 'tests/reconciliation_tests.cpp' || echo '../../src/'`tests/reconciliation_tests.cpp
mv -f tests/.deps/mesos_tests-protobuf_io_tests.Tpo tests/.deps/mesos_tests-protobuf_io_tests.Po
g++ -DPACKAGE_NAME=\"mesos\" -DPACKAGE_TARNAME=\"mesos\" -DPACKAGE_VERSION=\"0.26.0\" -DPACKAGE_STRING=\"mesos\ 0.26.0\" -DPACKAGE_BUGREPORT=\"\" -DPACKAGE_URL=\"\" -DPACKAGE=\"mesos\" -DVERSION=\"0.26.0\" -DSTDC_HEADERS=1 -DHAVE_SYS_TYPES_H=1 -DHAVE_SYS_STAT_H=1 -DHAVE_STDLIB_H=1 -DHAVE_STRING_H=1 -DHAVE_MEMORY_H=1 -DHAVE_STRINGS_H=1 -DHAVE_INTTYPES_H=1 -DHAVE_STDINT_H=1 -DHAVE_UNISTD_H=1 -DHAVE_DLFCN_H=1 -DLT_OBJDIR=\".libs/\" -DHAVE_PTHREAD_PRIO_INHERIT=1 -DHAVE_PTHREAD=1 -DHAVE_LIBZ=1 -DHAVE_LIBCURL=1 -DHAVE_APR_POOLS_H=1 -DHAVE_LIBAPR_1=1 -DHAVE_SVN_VERSION_H=1 -DHAVE_LIBSVN_SUBR_1=1 -DHAVE_SVN_DELTA_H=1 -DHAVE_LIBSVN_DELTA_1=1 -DHAVE_LIBSASL2=1 -DMESOS_HAS_JAVA=1 -DHAVE_PYTHON=\"2.7\" -DMESOS_HAS_PYTHON=1 -I. -I../../src   -Wall -Werror -DLIBDIR=\"/mesos/mesos-0.26.0/_inst/lib\" -DPKGLIBEXECDIR=\"/mesos/mesos-0.26.0/_inst/libexec/mesos\" -DPKGDATADIR=\"/mesos/mesos-0.26.0/_inst/share/mesos\" -I../../include -I../../3rdparty/libprocess/include -I../../3rdparty/libprocess/3rdparty/stout/include -I../include -I../include/mesos -I../3rdparty/libprocess/3rdparty/boost-1.53.0 -I../3rdparty/libprocess/3rdparty/picojson-1.3.0 -DPICOJSON_USE_INT64 -D__STDC_FORMAT_MACROS -I../3rdparty/libprocess/3rdparty/protobuf-2.5.0/src -I../3rdparty/libprocess/3rdparty/glog-0.3.3/src -I../3rdparty/libprocess/3rdparty/glog-0.3.3/src -I../3rdparty/leveldb/include -I../3rdparty/zookeeper-3.4.5/src/c/include -I../3rdparty/zookeeper-3.4.5/src/c/generated -I../3rdparty/libprocess/3rdparty/protobuf-2.5.0/src -DSOURCE_DIR=\"/mesos/mesos-0.26.0/_build/..\" -DBUILD_DIR=\"/mesos/mesos-0.26.0/_build\" -I../3rdparty/libprocess/3rdparty/gmock-1.7.0/gtest/include -I../3rdparty/libprocess/3rdparty/gmock-1.7.0/include -I/usr/lib/jvm/java-1.7.0-openjdk-1.7.0.91-2.6.2.1.el7_1.x86_64/include -I/usr/lib/jvm/java-1.7.0-openjdk-1.7.0.91-2.6.2.1.el7_1.x86_64/include/linux -DZOOKEEPER_VERSION=\"3.4.5\" -I/usr/include/subversion-1 -I/usr/include/apr-1 -I/usr/include/apr-1.0  -pthread -g1 -O0 -Wno-unused-local-typedefs -std=c++11 -MT tests/mesos_tests-registrar_tests.o -MD -MP -MF tests/.deps/mesos_tests-registrar_tests.Tpo -c -o tests/mesos_tests-registrar_tests.o `test -f 'tests/registrar_tests.cpp' || echo '../../src/'`tests/registrar_tests.cpp
mv -f tests/.deps/mesos_tests-module_tests.Tpo tests/.deps/mesos_tests-module_tests.Po
g++ -DPACKAGE_NAME=\"mesos\" -DPACKAGE_TARNAME=\"mesos\" -DPACKAGE_VERSION=\"0.26.0\" -DPACKAGE_STRING=\"mesos\ 0.26.0\" -DPACKAGE_BUGREPORT=\"\" -DPACKAGE_URL=\"\" -DPACKAGE=\"mesos\" -DVERSION=\"0.26.0\" -DSTDC_HEADERS=1 -DHAVE_SYS_TYPES_H=1 -DHAVE_SYS_STAT_H=1 -DHAVE_STDLIB_H=1 -DHAVE_STRING_H=1 -DHAVE_MEMORY_H=1 -DHAVE_STRINGS_H=1 -DHAVE_INTTYPES_H=1 -DHAVE_STDINT_H=1 -DHAVE_UNISTD_H=1 -DHAVE_DLFCN_H=1 -DLT_OBJDIR=\".libs/\" -DHAVE_PTHREAD_PRIO_INHERIT=1 -DHAVE_PTHREAD=1 -DHAVE_LIBZ=1 -DHAVE_LIBCURL=1 -DHAVE_APR_POOLS_H=1 -DHAVE_LIBAPR_1=1 -DHAVE_SVN_VERSION_H=1 -DHAVE_LIBSVN_SUBR_1=1 -DHAVE_SVN_DELTA_H=1 -DHAVE_LIBSVN_DELTA_1=1 -DHAVE_LIBSASL2=1 -DMESOS_HAS_JAVA=1 -DHAVE_PYTHON=\"2.7\" -DMESOS_HAS_PYTHON=1 -I. -I../../src   -Wall -Werror -DLIBDIR=\"/mesos/mesos-0.26.0/_inst/lib\" -DPKGLIBEXECDIR=\"/mesos/mesos-0.26.0/_inst/libexec/mesos\" -DPKGDATADIR=\"/mesos/mesos-0.26.0/_inst/share/mesos\" -I../../include -I../../3rdparty/libprocess/include -I../../3rdparty/libprocess/3rdparty/stout/include -I../include -I../include/mesos -I../3rdparty/libprocess/3rdparty/boost-1.53.0 -I../3rdparty/libprocess/3rdparty/picojson-1.3.0 -DPICOJSON_USE_INT64 -D__STDC_FORMAT_MACROS -I../3rdparty/libprocess/3rdparty/protobuf-2.5.0/src -I../3rdparty/libprocess/3rdparty/glog-0.3.3/src -I../3rdparty/libprocess/3rdparty/glog-0.3.3/src -I../3rdparty/leveldb/include -I../3rdparty/zookeeper-3.4.5/src/c/include -I../3rdparty/zookeeper-3.4.5/src/c/generated -I../3rdparty/libprocess/3rdparty/protobuf-2.5.0/src -DSOURCE_DIR=\"/mesos/mesos-0.26.0/_build/..\" -DBUILD_DIR=\"/mesos/mesos-0.26.0/_build\" -I../3rdparty/libprocess/3rdparty/gmock-1.7.0/gtest/include -I../3rdparty/libprocess/3rdparty/gmock-1.7.0/include -I/usr/lib/jvm/java-1.7.0-openjdk-1.7.0.91-2.6.2.1.el7_1.x86_64/include -I/usr/lib/jvm/java-1.7.0-openjdk-1.7.0.91-2.6.2.1.el7_1.x86_64/include/linux -DZOOKEEPER_VERSION=\"3.4.5\" -I/usr/include/subversion-1 -I/usr/include/apr-1 -I/usr/include/apr-1.0  -pthread -g1 -O0 -Wno-unused-local-typedefs -std=c++11 -MT tests/mesos_tests-repair_tests.o -MD -MP -MF tests/.deps/mesos_tests-repair_tests.Tpo -c -o tests/mesos_tests-repair_tests.o `test -f 'tests/repair_tests.cpp' || echo '../../src/'`tests/repair_tests.cpp
mv -f tests/.deps/mesos_tests-monitor_tests.Tpo tests/.deps/mesos_tests-monitor_tests.Po
g++ -DPACKAGE_NAME=\"mesos\" -DPACKAGE_TARNAME=\"mesos\" -DPACKAGE_VERSION=\"0.26.0\" -DPACKAGE_STRING=\"mesos\ 0.26.0\" -DPACKAGE_BUGREPORT=\"\" -DPACKAGE_URL=\"\" -DPACKAGE=\"mesos\" -DVERSION=\"0.26.0\" -DSTDC_HEADERS=1 -DHAVE_SYS_TYPES_H=1 -DHAVE_SYS_STAT_H=1 -DHAVE_STDLIB_H=1 -DHAVE_STRING_H=1 -DHAVE_MEMORY_H=1 -DHAVE_STRINGS_H=1 -DHAVE_INTTYPES_H=1 -DHAVE_STDINT_H=1 -DHAVE_UNISTD_H=1 -DHAVE_DLFCN_H=1 -DLT_OBJDIR=\".libs/\" -DHAVE_PTHREAD_PRIO_INHERIT=1 -DHAVE_PTHREAD=1 -DHAVE_LIBZ=1 -DHAVE_LIBCURL=1 -DHAVE_APR_POOLS_H=1 -DHAVE_LIBAPR_1=1 -DHAVE_SVN_VERSION_H=1 -DHAVE_LIBSVN_SUBR_1=1 -DHAVE_SVN_DELTA_H=1 -DHAVE_LIBSVN_DELTA_1=1 -DHAVE_LIBSASL2=1 -DMESOS_HAS_JAVA=1 -DHAVE_PYTHON=\"2.7\" -DMESOS_HAS_PYTHON=1 -I. -I../../src   -Wall -Werror -DLIBDIR=\"/mesos/mesos-0.26.0/_inst/lib\" -DPKGLIBEXECDIR=\"/mesos/mesos-0.26.0/_inst/libexec/mesos\" -DPKGDATADIR=\"/mesos/mesos-0.26.0/_inst/share/mesos\" -I../../include -I../../3rdparty/libprocess/include -I../../3rdparty/libprocess/3rdparty/stout/include -I../include -I../include/mesos -I../3rdparty/libprocess/3rdparty/boost-1.53.0 -I../3rdparty/libprocess/3rdparty/picojson-1.3.0 -DPICOJSON_USE_INT64 -D__STDC_FORMAT_MACROS -I../3rdparty/libprocess/3rdparty/protobuf-2.5.0/src -I../3rdparty/libprocess/3rdparty/glog-0.3.3/src -I../3rdparty/libprocess/3rdparty/glog-0.3.3/src -I../3rdparty/leveldb/include -I../3rdparty/zookeeper-3.4.5/src/c/include -I../3rdparty/zookeeper-3.4.5/src/c/generated -I../3rdparty/libprocess/3rdparty/protobuf-2.5.0/src -DSOURCE_DIR=\"/mesos/mesos-0.26.0/_build/..\" -DBUILD_DIR=\"/mesos/mesos-0.26.0/_build\" -I../3rdparty/libprocess/3rdparty/gmock-1.7.0/gtest/include -I../3rdparty/libprocess/3rdparty/gmock-1.7.0/include -I/usr/lib/jvm/java-1.7.0-openjdk-1.7.0.91-2.6.2.1.el7_1.x86_64/include -I/usr/lib/jvm/java-1.7.0-openjdk-1.7.0.91-2.6.2.1.el7_1.x86_64/include/linux -DZOOKEEPER_VERSION=\"3.4.5\" -I/usr/include/subversion-1 -I/usr/include/apr-1 -I/usr/include/apr-1.0  -pthread -g1 -O0 -Wno-unused-local-typedefs -std=c++11 -MT tests/mesos_tests-reservation_tests.o -MD -MP -MF tests/.deps/mesos_tests-reservation_tests.Tpo -c -o tests/mesos_tests-reservation_tests.o `test -f 'tests/reservation_tests.cpp' || echo '../../src/'`tests/reservation_tests.cpp
mv -f tests/.deps/mesos_tests-registrar_tests.Tpo tests/.deps/mesos_tests-registrar_tests.Po
g++ -DPACKAGE_NAME=\"mesos\" -DPACKAGE_TARNAME=\"mesos\" -DPACKAGE_VERSION=\"0.26.0\" -DPACKAGE_STRING=\"mesos\ 0.26.0\" -DPACKAGE_BUGREPORT=\"\" -DPACKAGE_URL=\"\" -DPACKAGE=\"mesos\" -DVERSION=\"0.26.0\" -DSTDC_HEADERS=1 -DHAVE_SYS_TYPES_H=1 -DHAVE_SYS_STAT_H=1 -DHAVE_STDLIB_H=1 -DHAVE_STRING_H=1 -DHAVE_MEMORY_H=1 -DHAVE_STRINGS_H=1 -DHAVE_INTTYPES_H=1 -DHAVE_STDINT_H=1 -DHAVE_UNISTD_H=1 -DHAVE_DLFCN_H=1 -DLT_OBJDIR=\".libs/\" -DHAVE_PTHREAD_PRIO_INHERIT=1 -DHAVE_PTHREAD=1 -DHAVE_LIBZ=1 -DHAVE_LIBCURL=1 -DHAVE_APR_POOLS_H=1 -DHAVE_LIBAPR_1=1 -DHAVE_SVN_VERSION_H=1 -DHAVE_LIBSVN_SUBR_1=1 -DHAVE_SVN_DELTA_H=1 -DHAVE_LIBSVN_DELTA_1=1 -DHAVE_LIBSASL2=1 -DMESOS_HAS_JAVA=1 -DHAVE_PYTHON=\"2.7\" -DMESOS_HAS_PYTHON=1 -I. -I../../src   -Wall -Werror -DLIBDIR=\"/mesos/mesos-0.26.0/_inst/lib\" -DPKGLIBEXECDIR=\"/mesos/mesos-0.26.0/_inst/libexec/mesos\" -DPKGDATADIR=\"/mesos/mesos-0.26.0/_inst/share/mesos\" -I../../include -I../../3rdparty/libprocess/include -I../../3rdparty/libprocess/3rdparty/stout/include -I../include -I../include/mesos -I../3rdparty/libprocess/3rdparty/boost-1.53.0 -I../3rdparty/libprocess/3rdparty/picojson-1.3.0 -DPICOJSON_USE_INT64 -D__STDC_FORMAT_MACROS -I../3rdparty/libprocess/3rdparty/protobuf-2.5.0/src -I../3rdparty/libprocess/3rdparty/glog-0.3.3/src -I../3rdparty/libprocess/3rdparty/glog-0.3.3/src -I../3rdparty/leveldb/include -I../3rdparty/zookeeper-3.4.5/src/c/include -I../3rdparty/zookeeper-3.4.5/src/c/generated -I../3rdparty/libprocess/3rdparty/protobuf-2.5.0/src -DSOURCE_DIR=\"/mesos/mesos-0.26.0/_build/..\" -DBUILD_DIR=\"/mesos/mesos-0.26.0/_build\" -I../3rdparty/libprocess/3rdparty/gmock-1.7.0/gtest/include -I../3rdparty/libprocess/3rdparty/gmock-1.7.0/include -I/usr/lib/jvm/java-1.7.0-openjdk-1.7.0.91-2.6.2.1.el7_1.x86_64/include -I/usr/lib/jvm/java-1.7.0-openjdk-1.7.0.91-2.6.2.1.el7_1.x86_64/include/linux -DZOOKEEPER_VERSION=\"3.4.5\" -I/usr/include/subversion-1 -I/usr/include/apr-1 -I/usr/include/apr-1.0  -pthread -g1 -O0 -Wno-unused-local-typedefs -std=c++11 -MT tests/mesos_tests-reservation_endpoints_tests.o -MD -MP -MF tests/.deps/mesos_tests-reservation_endpoints_tests.Tpo -c -o tests/mesos_tests-reservation_endpoints_tests.o `test -f 'tests/reservation_endpoints_tests.cpp' || echo '../../src/'`tests/reservation_endpoints_tests.cpp
mv -f tests/.deps/mesos_tests-oversubscription_tests.Tpo tests/.deps/mesos_tests-oversubscription_tests.Po
g++ -DPACKAGE_NAME=\"mesos\" -DPACKAGE_TARNAME=\"mesos\" -DPACKAGE_VERSION=\"0.26.0\" -DPACKAGE_STRING=\"mesos\ 0.26.0\" -DPACKAGE_BUGREPORT=\"\" -DPACKAGE_URL=\"\" -DPACKAGE=\"mesos\" -DVERSION=\"0.26.0\" -DSTDC_HEADERS=1 -DHAVE_SYS_TYPES_H=1 -DHAVE_SYS_STAT_H=1 -DHAVE_STDLIB_H=1 -DHAVE_STRING_H=1 -DHAVE_MEMORY_H=1 -DHAVE_STRINGS_H=1 -DHAVE_INTTYPES_H=1 -DHAVE_STDINT_H=1 -DHAVE_UNISTD_H=1 -DHAVE_DLFCN_H=1 -DLT_OBJDIR=\".libs/\" -DHAVE_PTHREAD_PRIO_INHERIT=1 -DHAVE_PTHREAD=1 -DHAVE_LIBZ=1 -DHAVE_LIBCURL=1 -DHAVE_APR_POOLS_H=1 -DHAVE_LIBAPR_1=1 -DHAVE_SVN_VERSION_H=1 -DHAVE_LIBSVN_SUBR_1=1 -DHAVE_SVN_DELTA_H=1 -DHAVE_LIBSVN_DELTA_1=1 -DHAVE_LIBSASL2=1 -DMESOS_HAS_JAVA=1 -DHAVE_PYTHON=\"2.7\" -DMESOS_HAS_PYTHON=1 -I. -I../../src   -Wall -Werror -DLIBDIR=\"/mesos/mesos-0.26.0/_inst/lib\" -DPKGLIBEXECDIR=\"/mesos/mesos-0.26.0/_inst/libexec/mesos\" -DPKGDATADIR=\"/mesos/mesos-0.26.0/_inst/share/mesos\" -I../../include -I../../3rdparty/libprocess/include -I../../3rdparty/libprocess/3rdparty/stout/include -I../include -I../include/mesos -I../3rdparty/libprocess/3rdparty/boost-1.53.0 -I../3rdparty/libprocess/3rdparty/picojson-1.3.0 -DPICOJSON_USE_INT64 -D__STDC_FORMAT_MACROS -I../3rdparty/libprocess/3rdparty/protobuf-2.5.0/src -I../3rdparty/libprocess/3rdparty/glog-0.3.3/src -I../3rdparty/libprocess/3rdparty/glog-0.3.3/src -I../3rdparty/leveldb/include -I../3rdparty/zookeeper-3.4.5/src/c/include -I../3rdparty/zookeeper-3.4.5/src/c/generated -I../3rdparty/libprocess/3rdparty/protobuf-2.5.0/src -DSOURCE_DIR=\"/mesos/mesos-0.26.0/_build/..\" -DBUILD_DIR=\"/mesos/mesos-0.26.0/_build\" -I../3rdparty/libprocess/3rdparty/gmock-1.7.0/gtest/include -I../3rdparty/libprocess/3rdparty/gmock-1.7.0/include -I/usr/lib/jvm/java-1.7.0-openjdk-1.7.0.91-2.6.2.1.el7_1.x86_64/include -I/usr/lib/jvm/java-1.7.0-openjdk-1.7.0.91-2.6.2.1.el7_1.x86_64/include/linux -DZOOKEEPER_VERSION=\"3.4.5\" -I/usr/include/subversion-1 -I/usr/include/apr-1 -I/usr/include/apr-1.0  -pthread -g1 -O0 -Wno-unused-local-typedefs -std=c++11 -MT tests/mesos_tests-resource_offers_tests.o -MD -MP -MF tests/.deps/mesos_tests-resource_offers_tests.Tpo -c -o tests/mesos_tests-resource_offers_tests.o `test -f 'tests/resource_offers_tests.cpp' || echo '../../src/'`tests/resource_offers_tests.cpp
mv -f tests/.deps/mesos_tests-partition_tests.Tpo tests/.deps/mesos_tests-partition_tests.Po
g++ -DPACKAGE_NAME=\"mesos\" -DPACKAGE_TARNAME=\"mesos\" -DPACKAGE_VERSION=\"0.26.0\" -DPACKAGE_STRING=\"mesos\ 0.26.0\" -DPACKAGE_BUGREPORT=\"\" -DPACKAGE_URL=\"\" -DPACKAGE=\"mesos\" -DVERSION=\"0.26.0\" -DSTDC_HEADERS=1 -DHAVE_SYS_TYPES_H=1 -DHAVE_SYS_STAT_H=1 -DHAVE_STDLIB_H=1 -DHAVE_STRING_H=1 -DHAVE_MEMORY_H=1 -DHAVE_STRINGS_H=1 -DHAVE_INTTYPES_H=1 -DHAVE_STDINT_H=1 -DHAVE_UNISTD_H=1 -DHAVE_DLFCN_H=1 -DLT_OBJDIR=\".libs/\" -DHAVE_PTHREAD_PRIO_INHERIT=1 -DHAVE_PTHREAD=1 -DHAVE_LIBZ=1 -DHAVE_LIBCURL=1 -DHAVE_APR_POOLS_H=1 -DHAVE_LIBAPR_1=1 -DHAVE_SVN_VERSION_H=1 -DHAVE_LIBSVN_SUBR_1=1 -DHAVE_SVN_DELTA_H=1 -DHAVE_LIBSVN_DELTA_1=1 -DHAVE_LIBSASL2=1 -DMESOS_HAS_JAVA=1 -DHAVE_PYTHON=\"2.7\" -DMESOS_HAS_PYTHON=1 -I. -I../../src   -Wall -Werror -DLIBDIR=\"/mesos/mesos-0.26.0/_inst/lib\" -DPKGLIBEXECDIR=\"/mesos/mesos-0.26.0/_inst/libexec/mesos\" -DPKGDATADIR=\"/mesos/mesos-0.26.0/_inst/share/mesos\" -I../../include -I../../3rdparty/libprocess/include -I../../3rdparty/libprocess/3rdparty/stout/include -I../include -I../include/mesos -I../3rdparty/libprocess/3rdparty/boost-1.53.0 -I../3rdparty/libprocess/3rdparty/picojson-1.3.0 -DPICOJSON_USE_INT64 -D__STDC_FORMAT_MACROS -I../3rdparty/libprocess/3rdparty/protobuf-2.5.0/src -I../3rdparty/libprocess/3rdparty/glog-0.3.3/src -I../3rdparty/libprocess/3rdparty/glog-0.3.3/src -I../3rdparty/leveldb/include -I../3rdparty/zookeeper-3.4.5/src/c/include -I../3rdparty/zookeeper-3.4.5/src/c/generated -I../3rdparty/libprocess/3rdparty/protobuf-2.5.0/src -DSOURCE_DIR=\"/mesos/mesos-0.26.0/_build/..\" -DBUILD_DIR=\"/mesos/mesos-0.26.0/_build\" -I../3rdparty/libprocess/3rdparty/gmock-1.7.0/gtest/include -I../3rdparty/libprocess/3rdparty/gmock-1.7.0/include -I/usr/lib/jvm/java-1.7.0-openjdk-1.7.0.91-2.6.2.1.el7_1.x86_64/include -I/usr/lib/jvm/java-1.7.0-openjdk-1.7.0.91-2.6.2.1.el7_1.x86_64/include/linux -DZOOKEEPER_VERSION=\"3.4.5\" -I/usr/include/subversion-1 -I/usr/include/apr-1 -I/usr/include/apr-1.0  -pthread -g1 -O0 -Wno-unused-local-typedefs -std=c++11 -MT tests/mesos_tests-resources_tests.o -MD -MP -MF tests/.deps/mesos_tests-resources_tests.Tpo -c -o tests/mesos_tests-resources_tests.o `test -f 'tests/resources_tests.cpp' || echo '../../src/'`tests/resources_tests.cpp
mv -f tests/.deps/mesos_tests-repair_tests.Tpo tests/.deps/mesos_tests-repair_tests.Po
g++ -DPACKAGE_NAME=\"mesos\" -DPACKAGE_TARNAME=\"mesos\" -DPACKAGE_VERSION=\"0.26.0\" -DPACKAGE_STRING=\"mesos\ 0.26.0\" -DPACKAGE_BUGREPORT=\"\" -DPACKAGE_URL=\"\" -DPACKAGE=\"mesos\" -DVERSION=\"0.26.0\" -DSTDC_HEADERS=1 -DHAVE_SYS_TYPES_H=1 -DHAVE_SYS_STAT_H=1 -DHAVE_STDLIB_H=1 -DHAVE_STRING_H=1 -DHAVE_MEMORY_H=1 -DHAVE_STRINGS_H=1 -DHAVE_INTTYPES_H=1 -DHAVE_STDINT_H=1 -DHAVE_UNISTD_H=1 -DHAVE_DLFCN_H=1 -DLT_OBJDIR=\".libs/\" -DHAVE_PTHREAD_PRIO_INHERIT=1 -DHAVE_PTHREAD=1 -DHAVE_LIBZ=1 -DHAVE_LIBCURL=1 -DHAVE_APR_POOLS_H=1 -DHAVE_LIBAPR_1=1 -DHAVE_SVN_VERSION_H=1 -DHAVE_LIBSVN_SUBR_1=1 -DHAVE_SVN_DELTA_H=1 -DHAVE_LIBSVN_DELTA_1=1 -DHAVE_LIBSASL2=1 -DMESOS_HAS_JAVA=1 -DHAVE_PYTHON=\"2.7\" -DMESOS_HAS_PYTHON=1 -I. -I../../src   -Wall -Werror -DLIBDIR=\"/mesos/mesos-0.26.0/_inst/lib\" -DPKGLIBEXECDIR=\"/mesos/mesos-0.26.0/_inst/libexec/mesos\" -DPKGDATADIR=\"/mesos/mesos-0.26.0/_inst/share/mesos\" -I../../include -I../../3rdparty/libprocess/include -I../../3rdparty/libprocess/3rdparty/stout/include -I../include -I../include/mesos -I../3rdparty/libprocess/3rdparty/boost-1.53.0 -I../3rdparty/libprocess/3rdparty/picojson-1.3.0 -DPICOJSON_USE_INT64 -D__STDC_FORMAT_MACROS -I../3rdparty/libprocess/3rdparty/protobuf-2.5.0/src -I../3rdparty/libprocess/3rdparty/glog-0.3.3/src -I../3rdparty/libprocess/3rdparty/glog-0.3.3/src -I../3rdparty/leveldb/include -I../3rdparty/zookeeper-3.4.5/src/c/include -I../3rdparty/zookeeper-3.4.5/src/c/generated -I../3rdparty/libprocess/3rdparty/protobuf-2.5.0/src -DSOURCE_DIR=\"/mesos/mesos-0.26.0/_build/..\" -DBUILD_DIR=\"/mesos/mesos-0.26.0/_build\" -I../3rdparty/libprocess/3rdparty/gmock-1.7.0/gtest/include -I../3rdparty/libprocess/3rdparty/gmock-1.7.0/include -I/usr/lib/jvm/java-1.7.0-openjdk-1.7.0.91-2.6.2.1.el7_1.x86_64/include -I/usr/lib/jvm/java-1.7.0-openjdk-1.7.0.91-2.6.2.1.el7_1.x86_64/include/linux -DZOOKEEPER_VERSION=\"3.4.5\" -I/usr/include/subversion-1 -I/usr/include/apr-1 -I/usr/include/apr-1.0  -pthread -g1 -O0 -Wno-unused-local-typedefs -std=c++11 -MT tests/mesos_tests-scheduler_tests.o -MD -MP -MF tests/.deps/mesos_tests-scheduler_tests.Tpo -c -o tests/mesos_tests-scheduler_tests.o `test -f 'tests/scheduler_tests.cpp' || echo '../../src/'`tests/scheduler_tests.cpp
mv -f tests/.deps/mesos_tests-rate_limiting_tests.Tpo tests/.deps/mesos_tests-rate_limiting_tests.Po
g++ -DPACKAGE_NAME=\"mesos\" -DPACKAGE_TARNAME=\"mesos\" -DPACKAGE_VERSION=\"0.26.0\" -DPACKAGE_STRING=\"mesos\ 0.26.0\" -DPACKAGE_BUGREPORT=\"\" -DPACKAGE_URL=\"\" -DPACKAGE=\"mesos\" -DVERSION=\"0.26.0\" -DSTDC_HEADERS=1 -DHAVE_SYS_TYPES_H=1 -DHAVE_SYS_STAT_H=1 -DHAVE_STDLIB_H=1 -DHAVE_STRING_H=1 -DHAVE_MEMORY_H=1 -DHAVE_STRINGS_H=1 -DHAVE_INTTYPES_H=1 -DHAVE_STDINT_H=1 -DHAVE_UNISTD_H=1 -DHAVE_DLFCN_H=1 -DLT_OBJDIR=\".libs/\" -DHAVE_PTHREAD_PRIO_INHERIT=1 -DHAVE_PTHREAD=1 -DHAVE_LIBZ=1 -DHAVE_LIBCURL=1 -DHAVE_APR_POOLS_H=1 -DHAVE_LIBAPR_1=1 -DHAVE_SVN_VERSION_H=1 -DHAVE_LIBSVN_SUBR_1=1 -DHAVE_SVN_DELTA_H=1 -DHAVE_LIBSVN_DELTA_1=1 -DHAVE_LIBSASL2=1 -DMESOS_HAS_JAVA=1 -DHAVE_PYTHON=\"2.7\" -DMESOS_HAS_PYTHON=1 -I. -I../../src   -Wall -Werror -DLIBDIR=\"/mesos/mesos-0.26.0/_inst/lib\" -DPKGLIBEXECDIR=\"/mesos/mesos-0.26.0/_inst/libexec/mesos\" -DPKGDATADIR=\"/mesos/mesos-0.26.0/_inst/share/mesos\" -I../../include -I../../3rdparty/libprocess/include -I../../3rdparty/libprocess/3rdparty/stout/include -I../include -I../include/mesos -I../3rdparty/libprocess/3rdparty/boost-1.53.0 -I../3rdparty/libprocess/3rdparty/picojson-1.3.0 -DPICOJSON_USE_INT64 -D__STDC_FORMAT_MACROS -I../3rdparty/libprocess/3rdparty/protobuf-2.5.0/src -I../3rdparty/libprocess/3rdparty/glog-0.3.3/src -I../3rdparty/libprocess/3rdparty/glog-0.3.3/src -I../3rdparty/leveldb/include -I../3rdparty/zookeeper-3.4.5/src/c/include -I../3rdparty/zookeeper-3.4.5/src/c/generated -I../3rdparty/libprocess/3rdparty/protobuf-2.5.0/src -DSOURCE_DIR=\"/mesos/mesos-0.26.0/_build/..\" -DBUILD_DIR=\"/mesos/mesos-0.26.0/_build\" -I../3rdparty/libprocess/3rdparty/gmock-1.7.0/gtest/include -I../3rdparty/libprocess/3rdparty/gmock-1.7.0/include -I/usr/lib/jvm/java-1.7.0-openjdk-1.7.0.91-2.6.2.1.el7_1.x86_64/include -I/usr/lib/jvm/java-1.7.0-openjdk-1.7.0.91-2.6.2.1.el7_1.x86_64/include/linux -DZOOKEEPER_VERSION=\"3.4.5\" -I/usr/include/subversion-1 -I/usr/include/apr-1 -I/usr/include/apr-1.0  -pthread -g1 -O0 -Wno-unused-local-typedefs -std=c++11 -MT tests/mesos_tests-scheduler_driver_tests.o -MD -MP -MF tests/.deps/mesos_tests-scheduler_driver_tests.Tpo -c -o tests/mesos_tests-scheduler_driver_tests.o `test -f 'tests/scheduler_driver_tests.cpp' || echo '../../src/'`tests/scheduler_driver_tests.cpp
mv -f tests/.deps/mesos_tests-persistent_volume_tests.Tpo tests/.deps/mesos_tests-persistent_volume_tests.Po
g++ -DPACKAGE_NAME=\"mesos\" -DPACKAGE_TARNAME=\"mesos\" -DPACKAGE_VERSION=\"0.26.0\" -DPACKAGE_STRING=\"mesos\ 0.26.0\" -DPACKAGE_BUGREPORT=\"\" -DPACKAGE_URL=\"\" -DPACKAGE=\"mesos\" -DVERSION=\"0.26.0\" -DSTDC_HEADERS=1 -DHAVE_SYS_TYPES_H=1 -DHAVE_SYS_STAT_H=1 -DHAVE_STDLIB_H=1 -DHAVE_STRING_H=1 -DHAVE_MEMORY_H=1 -DHAVE_STRINGS_H=1 -DHAVE_INTTYPES_H=1 -DHAVE_STDINT_H=1 -DHAVE_UNISTD_H=1 -DHAVE_DLFCN_H=1 -DLT_OBJDIR=\".libs/\" -DHAVE_PTHREAD_PRIO_INHERIT=1 -DHAVE_PTHREAD=1 -DHAVE_LIBZ=1 -DHAVE_LIBCURL=1 -DHAVE_APR_POOLS_H=1 -DHAVE_LIBAPR_1=1 -DHAVE_SVN_VERSION_H=1 -DHAVE_LIBSVN_SUBR_1=1 -DHAVE_SVN_DELTA_H=1 -DHAVE_LIBSVN_DELTA_1=1 -DHAVE_LIBSASL2=1 -DMESOS_HAS_JAVA=1 -DHAVE_PYTHON=\"2.7\" -DMESOS_HAS_PYTHON=1 -I. -I../../src   -Wall -Werror -DLIBDIR=\"/mesos/mesos-0.26.0/_inst/lib\" -DPKGLIBEXECDIR=\"/mesos/mesos-0.26.0/_inst/libexec/mesos\" -DPKGDATADIR=\"/mesos/mesos-0.26.0/_inst/share/mesos\" -I../../include -I../../3rdparty/libprocess/include -I../../3rdparty/libprocess/3rdparty/stout/include -I../include -I../include/mesos -I../3rdparty/libprocess/3rdparty/boost-1.53.0 -I../3rdparty/libprocess/3rdparty/picojson-1.3.0 -DPICOJSON_USE_INT64 -D__STDC_FORMAT_MACROS -I../3rdparty/libprocess/3rdparty/protobuf-2.5.0/src -I../3rdparty/libprocess/3rdparty/glog-0.3.3/src -I../3rdparty/libprocess/3rdparty/glog-0.3.3/src -I../3rdparty/leveldb/include -I../3rdparty/zookeeper-3.4.5/src/c/include -I../3rdparty/zookeeper-3.4.5/src/c/generated -I../3rdparty/libprocess/3rdparty/protobuf-2.5.0/src -DSOURCE_DIR=\"/mesos/mesos-0.26.0/_build/..\" -DBUILD_DIR=\"/mesos/mesos-0.26.0/_build\" -I../3rdparty/libprocess/3rdparty/gmock-1.7.0/gtest/include -I../3rdparty/libprocess/3rdparty/gmock-1.7.0/include -I/usr/lib/jvm/java-1.7.0-openjdk-1.7.0.91-2.6.2.1.el7_1.x86_64/include -I/usr/lib/jvm/java-1.7.0-openjdk-1.7.0.91-2.6.2.1.el7_1.x86_64/include/linux -DZOOKEEPER_VERSION=\"3.4.5\" -I/usr/include/subversion-1 -I/usr/include/apr-1 -I/usr/include/apr-1.0  -pthread -g1 -O0 -Wno-unused-local-typedefs -std=c++11 -MT tests/mesos_tests-scheduler_event_call_tests.o -MD -MP -MF tests/.deps/mesos_tests-scheduler_event_call_tests.Tpo -c -o tests/mesos_tests-scheduler_event_call_tests.o `test -f 'tests/scheduler_event_call_tests.cpp' || echo '../../src/'`tests/scheduler_event_call_tests.cpp
mv -f tests/.deps/mesos_tests-reconciliation_tests.Tpo tests/.deps/mesos_tests-reconciliation_tests.Po
g++ -DPACKAGE_NAME=\"mesos\" -DPACKAGE_TARNAME=\"mesos\" -DPACKAGE_VERSION=\"0.26.0\" -DPACKAGE_STRING=\"mesos\ 0.26.0\" -DPACKAGE_BUGREPORT=\"\" -DPACKAGE_URL=\"\" -DPACKAGE=\"mesos\" -DVERSION=\"0.26.0\" -DSTDC_HEADERS=1 -DHAVE_SYS_TYPES_H=1 -DHAVE_SYS_STAT_H=1 -DHAVE_STDLIB_H=1 -DHAVE_STRING_H=1 -DHAVE_MEMORY_H=1 -DHAVE_STRINGS_H=1 -DHAVE_INTTYPES_H=1 -DHAVE_STDINT_H=1 -DHAVE_UNISTD_H=1 -DHAVE_DLFCN_H=1 -DLT_OBJDIR=\".libs/\" -DHAVE_PTHREAD_PRIO_INHERIT=1 -DHAVE_PTHREAD=1 -DHAVE_LIBZ=1 -DHAVE_LIBCURL=1 -DHAVE_APR_POOLS_H=1 -DHAVE_LIBAPR_1=1 -DHAVE_SVN_VERSION_H=1 -DHAVE_LIBSVN_SUBR_1=1 -DHAVE_SVN_DELTA_H=1 -DHAVE_LIBSVN_DELTA_1=1 -DHAVE_LIBSASL2=1 -DMESOS_HAS_JAVA=1 -DHAVE_PYTHON=\"2.7\" -DMESOS_HAS_PYTHON=1 -I. -I../../src   -Wall -Werror -DLIBDIR=\"/mesos/mesos-0.26.0/_inst/lib\" -DPKGLIBEXECDIR=\"/mesos/mesos-0.26.0/_inst/libexec/mesos\" -DPKGDATADIR=\"/mesos/mesos-0.26.0/_inst/share/mesos\" -I../../include -I../../3rdparty/libprocess/include -I../../3rdparty/libprocess/3rdparty/stout/include -I../include -I../include/mesos -I../3rdparty/libprocess/3rdparty/boost-1.53.0 -I../3rdparty/libprocess/3rdparty/picojson-1.3.0 -DPICOJSON_USE_INT64 -D__STDC_FORMAT_MACROS -I../3rdparty/libprocess/3rdparty/protobuf-2.5.0/src -I../3rdparty/libprocess/3rdparty/glog-0.3.3/src -I../3rdparty/libprocess/3rdparty/glog-0.3.3/src -I../3rdparty/leveldb/include -I../3rdparty/zookeeper-3.4.5/src/c/include -I../3rdparty/zookeeper-3.4.5/src/c/generated -I../3rdparty/libprocess/3rdparty/protobuf-2.5.0/src -DSOURCE_DIR=\"/mesos/mesos-0.26.0/_build/..\" -DBUILD_DIR=\"/mesos/mesos-0.26.0/_build\" -I../3rdparty/libprocess/3rdparty/gmock-1.7.0/gtest/include -I../3rdparty/libprocess/3rdparty/gmock-1.7.0/include -I/usr/lib/jvm/java-1.7.0-openjdk-1.7.0.91-2.6.2.1.el7_1.x86_64/include -I/usr/lib/jvm/java-1.7.0-openjdk-1.7.0.91-2.6.2.1.el7_1.x86_64/include/linux -DZOOKEEPER_VERSION=\"3.4.5\" -I/usr/include/subversion-1 -I/usr/include/apr-1 -I/usr/include/apr-1.0  -pthread -g1 -O0 -Wno-unused-local-typedefs -std=c++11 -MT tests/mesos_tests-scheduler_http_api_tests.o -MD -MP -MF tests/.deps/mesos_tests-scheduler_http_api_tests.Tpo -c -o tests/mesos_tests-scheduler_http_api_tests.o `test -f 'tests/scheduler_http_api_tests.cpp' || echo '../../src/'`tests/scheduler_http_api_tests.cpp
mv -f tests/.deps/mesos_tests-resources_tests.Tpo tests/.deps/mesos_tests-resources_tests.Po
g++ -DPACKAGE_NAME=\"mesos\" -DPACKAGE_TARNAME=\"mesos\" -DPACKAGE_VERSION=\"0.26.0\" -DPACKAGE_STRING=\"mesos\ 0.26.0\" -DPACKAGE_BUGREPORT=\"\" -DPACKAGE_URL=\"\" -DPACKAGE=\"mesos\" -DVERSION=\"0.26.0\" -DSTDC_HEADERS=1 -DHAVE_SYS_TYPES_H=1 -DHAVE_SYS_STAT_H=1 -DHAVE_STDLIB_H=1 -DHAVE_STRING_H=1 -DHAVE_MEMORY_H=1 -DHAVE_STRINGS_H=1 -DHAVE_INTTYPES_H=1 -DHAVE_STDINT_H=1 -DHAVE_UNISTD_H=1 -DHAVE_DLFCN_H=1 -DLT_OBJDIR=\".libs/\" -DHAVE_PTHREAD_PRIO_INHERIT=1 -DHAVE_PTHREAD=1 -DHAVE_LIBZ=1 -DHAVE_LIBCURL=1 -DHAVE_APR_POOLS_H=1 -DHAVE_LIBAPR_1=1 -DHAVE_SVN_VERSION_H=1 -DHAVE_LIBSVN_SUBR_1=1 -DHAVE_SVN_DELTA_H=1 -DHAVE_LIBSVN_DELTA_1=1 -DHAVE_LIBSASL2=1 -DMESOS_HAS_JAVA=1 -DHAVE_PYTHON=\"2.7\" -DMESOS_HAS_PYTHON=1 -I. -I../../src   -Wall -Werror -DLIBDIR=\"/mesos/mesos-0.26.0/_inst/lib\" -DPKGLIBEXECDIR=\"/mesos/mesos-0.26.0/_inst/libexec/mesos\" -DPKGDATADIR=\"/mesos/mesos-0.26.0/_inst/share/mesos\" -I../../include -I../../3rdparty/libprocess/include -I../../3rdparty/libprocess/3rdparty/stout/include -I../include -I../include/mesos -I../3rdparty/libprocess/3rdparty/boost-1.53.0 -I../3rdparty/libprocess/3rdparty/picojson-1.3.0 -DPICOJSON_USE_INT64 -D__STDC_FORMAT_MACROS -I../3rdparty/libprocess/3rdparty/protobuf-2.5.0/src -I../3rdparty/libprocess/3rdparty/glog-0.3.3/src -I../3rdparty/libprocess/3rdparty/glog-0.3.3/src -I../3rdparty/leveldb/include -I../3rdparty/zookeeper-3.4.5/src/c/include -I../3rdparty/zookeeper-3.4.5/src/c/generated -I../3rdparty/libprocess/3rdparty/protobuf-2.5.0/src -DSOURCE_DIR=\"/mesos/mesos-0.26.0/_build/..\" -DBUILD_DIR=\"/mesos/mesos-0.26.0/_build\" -I../3rdparty/libprocess/3rdparty/gmock-1.7.0/gtest/include -I../3rdparty/libprocess/3rdparty/gmock-1.7.0/include -I/usr/lib/jvm/java-1.7.0-openjdk-1.7.0.91-2.6.2.1.el7_1.x86_64/include -I/usr/lib/jvm/java-1.7.0-openjdk-1.7.0.91-2.6.2.1.el7_1.x86_64/include/linux -DZOOKEEPER_VERSION=\"3.4.5\" -I/usr/include/subversion-1 -I/usr/include/apr-1 -I/usr/include/apr-1.0  -pthread -g1 -O0 -Wno-unused-local-typedefs -std=c++11 -MT tests/mesos_tests-script.o -MD -MP -MF tests/.deps/mesos_tests-script.Tpo -c -o tests/mesos_tests-script.o `test -f 'tests/script.cpp' || echo '../../src/'`tests/script.cpp
mv -f tests/.deps/mesos_tests-reservation_tests.Tpo tests/.deps/mesos_tests-reservation_tests.Po
g++ -DPACKAGE_NAME=\"mesos\" -DPACKAGE_TARNAME=\"mesos\" -DPACKAGE_VERSION=\"0.26.0\" -DPACKAGE_STRING=\"mesos\ 0.26.0\" -DPACKAGE_BUGREPORT=\"\" -DPACKAGE_URL=\"\" -DPACKAGE=\"mesos\" -DVERSION=\"0.26.0\" -DSTDC_HEADERS=1 -DHAVE_SYS_TYPES_H=1 -DHAVE_SYS_STAT_H=1 -DHAVE_STDLIB_H=1 -DHAVE_STRING_H=1 -DHAVE_MEMORY_H=1 -DHAVE_STRINGS_H=1 -DHAVE_INTTYPES_H=1 -DHAVE_STDINT_H=1 -DHAVE_UNISTD_H=1 -DHAVE_DLFCN_H=1 -DLT_OBJDIR=\".libs/\" -DHAVE_PTHREAD_PRIO_INHERIT=1 -DHAVE_PTHREAD=1 -DHAVE_LIBZ=1 -DHAVE_LIBCURL=1 -DHAVE_APR_POOLS_H=1 -DHAVE_LIBAPR_1=1 -DHAVE_SVN_VERSION_H=1 -DHAVE_LIBSVN_SUBR_1=1 -DHAVE_SVN_DELTA_H=1 -DHAVE_LIBSVN_DELTA_1=1 -DHAVE_LIBSASL2=1 -DMESOS_HAS_JAVA=1 -DHAVE_PYTHON=\"2.7\" -DMESOS_HAS_PYTHON=1 -I. -I../../src   -Wall -Werror -DLIBDIR=\"/mesos/mesos-0.26.0/_inst/lib\" -DPKGLIBEXECDIR=\"/mesos/mesos-0.26.0/_inst/libexec/mesos\" -DPKGDATADIR=\"/mesos/mesos-0.26.0/_inst/share/mesos\" -I../../include -I../../3rdparty/libprocess/include -I../../3rdparty/libprocess/3rdparty/stout/include -I../include -I../include/mesos -I../3rdparty/libprocess/3rdparty/boost-1.53.0 -I../3rdparty/libprocess/3rdparty/picojson-1.3.0 -DPICOJSON_USE_INT64 -D__STDC_FORMAT_MACROS -I../3rdparty/libprocess/3rdparty/protobuf-2.5.0/src -I../3rdparty/libprocess/3rdparty/glog-0.3.3/src -I../3rdparty/libprocess/3rdparty/glog-0.3.3/src -I../3rdparty/leveldb/include -I../3rdparty/zookeeper-3.4.5/src/c/include -I../3rdparty/zookeeper-3.4.5/src/c/generated -I../3rdparty/libprocess/3rdparty/protobuf-2.5.0/src -DSOURCE_DIR=\"/mesos/mesos-0.26.0/_build/..\" -DBUILD_DIR=\"/mesos/mesos-0.26.0/_build\" -I../3rdparty/libprocess/3rdparty/gmock-1.7.0/gtest/include -I../3rdparty/libprocess/3rdparty/gmock-1.7.0/include -I/usr/lib/jvm/java-1.7.0-openjdk-1.7.0.91-2.6.2.1.el7_1.x86_64/include -I/usr/lib/jvm/java-1.7.0-openjdk-1.7.0.91-2.6.2.1.el7_1.x86_64/include/linux -DZOOKEEPER_VERSION=\"3.4.5\" -I/usr/include/subversion-1 -I/usr/include/apr-1 -I/usr/include/apr-1.0  -pthread -g1 -O0 -Wno-unused-local-typedefs -std=c++11 -MT tests/mesos_tests-slave_recovery_tests.o -MD -MP -MF tests/.deps/mesos_tests-slave_recovery_tests.Tpo -c -o tests/mesos_tests-slave_recovery_tests.o `test -f 'tests/slave_recovery_tests.cpp' || echo '../../src/'`tests/slave_recovery_tests.cpp
mv -f tests/.deps/mesos_tests-resource_offers_tests.Tpo tests/.deps/mesos_tests-resource_offers_tests.Po
g++ -DPACKAGE_NAME=\"mesos\" -DPACKAGE_TARNAME=\"mesos\" -DPACKAGE_VERSION=\"0.26.0\" -DPACKAGE_STRING=\"mesos\ 0.26.0\" -DPACKAGE_BUGREPORT=\"\" -DPACKAGE_URL=\"\" -DPACKAGE=\"mesos\" -DVERSION=\"0.26.0\" -DSTDC_HEADERS=1 -DHAVE_SYS_TYPES_H=1 -DHAVE_SYS_STAT_H=1 -DHAVE_STDLIB_H=1 -DHAVE_STRING_H=1 -DHAVE_MEMORY_H=1 -DHAVE_STRINGS_H=1 -DHAVE_INTTYPES_H=1 -DHAVE_STDINT_H=1 -DHAVE_UNISTD_H=1 -DHAVE_DLFCN_H=1 -DLT_OBJDIR=\".libs/\" -DHAVE_PTHREAD_PRIO_INHERIT=1 -DHAVE_PTHREAD=1 -DHAVE_LIBZ=1 -DHAVE_LIBCURL=1 -DHAVE_APR_POOLS_H=1 -DHAVE_LIBAPR_1=1 -DHAVE_SVN_VERSION_H=1 -DHAVE_LIBSVN_SUBR_1=1 -DHAVE_SVN_DELTA_H=1 -DHAVE_LIBSVN_DELTA_1=1 -DHAVE_LIBSASL2=1 -DMESOS_HAS_JAVA=1 -DHAVE_PYTHON=\"2.7\" -DMESOS_HAS_PYTHON=1 -I. -I../../src   -Wall -Werror -DLIBDIR=\"/mesos/mesos-0.26.0/_inst/lib\" -DPKGLIBEXECDIR=\"/mesos/mesos-0.26.0/_inst/libexec/mesos\" -DPKGDATADIR=\"/mesos/mesos-0.26.0/_inst/share/mesos\" -I../../include -I../../3rdparty/libprocess/include -I../../3rdparty/libprocess/3rdparty/stout/include -I../include -I../include/mesos -I../3rdparty/libprocess/3rdparty/boost-1.53.0 -I../3rdparty/libprocess/3rdparty/picojson-1.3.0 -DPICOJSON_USE_INT64 -D__STDC_FORMAT_MACROS -I../3rdparty/libprocess/3rdparty/protobuf-2.5.0/src -I../3rdparty/libprocess/3rdparty/glog-0.3.3/src -I../3rdparty/libprocess/3rdparty/glog-0.3.3/src -I../3rdparty/leveldb/include -I../3rdparty/zookeeper-3.4.5/src/c/include -I../3rdparty/zookeeper-3.4.5/src/c/generated -I../3rdparty/libprocess/3rdparty/protobuf-2.5.0/src -DSOURCE_DIR=\"/mesos/mesos-0.26.0/_build/..\" -DBUILD_DIR=\"/mesos/mesos-0.26.0/_build\" -I../3rdparty/libprocess/3rdparty/gmock-1.7.0/gtest/include -I../3rdparty/libprocess/3rdparty/gmock-1.7.0/include -I/usr/lib/jvm/java-1.7.0-openjdk-1.7.0.91-2.6.2.1.el7_1.x86_64/include -I/usr/lib/jvm/java-1.7.0-openjdk-1.7.0.91-2.6.2.1.el7_1.x86_64/include/linux -DZOOKEEPER_VERSION=\"3.4.5\" -I/usr/include/subversion-1 -I/usr/include/apr-1 -I/usr/include/apr-1.0  -pthread -g1 -O0 -Wno-unused-local-typedefs -std=c++11 -MT tests/mesos_tests-slave_tests.o -MD -MP -MF tests/.deps/mesos_tests-slave_tests.Tpo -c -o tests/mesos_tests-slave_tests.o `test -f 'tests/slave_tests.cpp' || echo '../../src/'`tests/slave_tests.cpp
mv -f tests/.deps/mesos_tests-scheduler_tests.Tpo tests/.deps/mesos_tests-scheduler_tests.Po
g++ -DPACKAGE_NAME=\"mesos\" -DPACKAGE_TARNAME=\"mesos\" -DPACKAGE_VERSION=\"0.26.0\" -DPACKAGE_STRING=\"mesos\ 0.26.0\" -DPACKAGE_BUGREPORT=\"\" -DPACKAGE_URL=\"\" -DPACKAGE=\"mesos\" -DVERSION=\"0.26.0\" -DSTDC_HEADERS=1 -DHAVE_SYS_TYPES_H=1 -DHAVE_SYS_STAT_H=1 -DHAVE_STDLIB_H=1 -DHAVE_STRING_H=1 -DHAVE_MEMORY_H=1 -DHAVE_STRINGS_H=1 -DHAVE_INTTYPES_H=1 -DHAVE_STDINT_H=1 -DHAVE_UNISTD_H=1 -DHAVE_DLFCN_H=1 -DLT_OBJDIR=\".libs/\" -DHAVE_PTHREAD_PRIO_INHERIT=1 -DHAVE_PTHREAD=1 -DHAVE_LIBZ=1 -DHAVE_LIBCURL=1 -DHAVE_APR_POOLS_H=1 -DHAVE_LIBAPR_1=1 -DHAVE_SVN_VERSION_H=1 -DHAVE_LIBSVN_SUBR_1=1 -DHAVE_SVN_DELTA_H=1 -DHAVE_LIBSVN_DELTA_1=1 -DHAVE_LIBSASL2=1 -DMESOS_HAS_JAVA=1 -DHAVE_PYTHON=\"2.7\" -DMESOS_HAS_PYTHON=1 -I. -I../../src   -Wall -Werror -DLIBDIR=\"/mesos/mesos-0.26.0/_inst/lib\" -DPKGLIBEXECDIR=\"/mesos/mesos-0.26.0/_inst/libexec/mesos\" -DPKGDATADIR=\"/mesos/mesos-0.26.0/_inst/share/mesos\" -I../../include -I../../3rdparty/libprocess/include -I../../3rdparty/libprocess/3rdparty/stout/include -I../include -I../include/mesos -I../3rdparty/libprocess/3rdparty/boost-1.53.0 -I../3rdparty/libprocess/3rdparty/picojson-1.3.0 -DPICOJSON_USE_INT64 -D__STDC_FORMAT_MACROS -I../3rdparty/libprocess/3rdparty/protobuf-2.5.0/src -I../3rdparty/libprocess/3rdparty/glog-0.3.3/src -I../3rdparty/libprocess/3rdparty/glog-0.3.3/src -I../3rdparty/leveldb/include -I../3rdparty/zookeeper-3.4.5/src/c/include -I../3rdparty/zookeeper-3.4.5/src/c/generated -I../3rdparty/libprocess/3rdparty/protobuf-2.5.0/src -DSOURCE_DIR=\"/mesos/mesos-0.26.0/_build/..\" -DBUILD_DIR=\"/mesos/mesos-0.26.0/_build\" -I../3rdparty/libprocess/3rdparty/gmock-1.7.0/gtest/include -I../3rdparty/libprocess/3rdparty/gmock-1.7.0/include -I/usr/lib/jvm/java-1.7.0-openjdk-1.7.0.91-2.6.2.1.el7_1.x86_64/include -I/usr/lib/jvm/java-1.7.0-openjdk-1.7.0.91-2.6.2.1.el7_1.x86_64/include/linux -DZOOKEEPER_VERSION=\"3.4.5\" -I/usr/include/subversion-1 -I/usr/include/apr-1 -I/usr/include/apr-1.0  -pthread -g1 -O0 -Wno-unused-local-typedefs -std=c++11 -MT tests/mesos_tests-sorter_tests.o -MD -MP -MF tests/.deps/mesos_tests-sorter_tests.Tpo -c -o tests/mesos_tests-sorter_tests.o `test -f 'tests/sorter_tests.cpp' || echo '../../src/'`tests/sorter_tests.cpp
mv -f tests/.deps/mesos_tests-reservation_endpoints_tests.Tpo tests/.deps/mesos_tests-reservation_endpoints_tests.Po
g++ -DPACKAGE_NAME=\"mesos\" -DPACKAGE_TARNAME=\"mesos\" -DPACKAGE_VERSION=\"0.26.0\" -DPACKAGE_STRING=\"mesos\ 0.26.0\" -DPACKAGE_BUGREPORT=\"\" -DPACKAGE_URL=\"\" -DPACKAGE=\"mesos\" -DVERSION=\"0.26.0\" -DSTDC_HEADERS=1 -DHAVE_SYS_TYPES_H=1 -DHAVE_SYS_STAT_H=1 -DHAVE_STDLIB_H=1 -DHAVE_STRING_H=1 -DHAVE_MEMORY_H=1 -DHAVE_STRINGS_H=1 -DHAVE_INTTYPES_H=1 -DHAVE_STDINT_H=1 -DHAVE_UNISTD_H=1 -DHAVE_DLFCN_H=1 -DLT_OBJDIR=\".libs/\" -DHAVE_PTHREAD_PRIO_INHERIT=1 -DHAVE_PTHREAD=1 -DHAVE_LIBZ=1 -DHAVE_LIBCURL=1 -DHAVE_APR_POOLS_H=1 -DHAVE_LIBAPR_1=1 -DHAVE_SVN_VERSION_H=1 -DHAVE_LIBSVN_SUBR_1=1 -DHAVE_SVN_DELTA_H=1 -DHAVE_LIBSVN_DELTA_1=1 -DHAVE_LIBSASL2=1 -DMESOS_HAS_JAVA=1 -DHAVE_PYTHON=\"2.7\" -DMESOS_HAS_PYTHON=1 -I. -I../../src   -Wall -Werror -DLIBDIR=\"/mesos/mesos-0.26.0/_inst/lib\" -DPKGLIBEXECDIR=\"/mesos/mesos-0.26.0/_inst/libexec/mesos\" -DPKGDATADIR=\"/mesos/mesos-0.26.0/_inst/share/mesos\" -I../../include -I../../3rdparty/libprocess/include -I../../3rdparty/libprocess/3rdparty/stout/include -I../include -I../include/mesos -I../3rdparty/libprocess/3rdparty/boost-1.53.0 -I../3rdparty/libprocess/3rdparty/picojson-1.3.0 -DPICOJSON_USE_INT64 -D__STDC_FORMAT_MACROS -I../3rdparty/libprocess/3rdparty/protobuf-2.5.0/src -I../3rdparty/libprocess/3rdparty/glog-0.3.3/src -I../3rdparty/libprocess/3rdparty/glog-0.3.3/src -I../3rdparty/leveldb/include -I../3rdparty/zookeeper-3.4.5/src/c/include -I../3rdparty/zookeeper-3.4.5/src/c/generated -I../3rdparty/libprocess/3rdparty/protobuf-2.5.0/src -DSOURCE_DIR=\"/mesos/mesos-0.26.0/_build/..\" -DBUILD_DIR=\"/mesos/mesos-0.26.0/_build\" -I../3rdparty/libprocess/3rdparty/gmock-1.7.0/gtest/include -I../3rdparty/libprocess/3rdparty/gmock-1.7.0/include -I/usr/lib/jvm/java-1.7.0-openjdk-1.7.0.91-2.6.2.1.el7_1.x86_64/include -I/usr/lib/jvm/java-1.7.0-openjdk-1.7.0.91-2.6.2.1.el7_1.x86_64/include/linux -DZOOKEEPER_VERSION=\"3.4.5\" -I/usr/include/subversion-1 -I/usr/include/apr-1 -I/usr/include/apr-1.0  -pthread -g1 -O0 -Wno-unused-local-typedefs -std=c++11 -MT tests/mesos_tests-state_tests.o -MD -MP -MF tests/.deps/mesos_tests-state_tests.Tpo -c -o tests/mesos_tests-state_tests.o `test -f 'tests/state_tests.cpp' || echo '../../src/'`tests/state_tests.cpp
mv -f tests/.deps/mesos_tests-scheduler_driver_tests.Tpo tests/.deps/mesos_tests-scheduler_driver_tests.Po
g++ -DPACKAGE_NAME=\"mesos\" -DPACKAGE_TARNAME=\"mesos\" -DPACKAGE_VERSION=\"0.26.0\" -DPACKAGE_STRING=\"mesos\ 0.26.0\" -DPACKAGE_BUGREPORT=\"\" -DPACKAGE_URL=\"\" -DPACKAGE=\"mesos\" -DVERSION=\"0.26.0\" -DSTDC_HEADERS=1 -DHAVE_SYS_TYPES_H=1 -DHAVE_SYS_STAT_H=1 -DHAVE_STDLIB_H=1 -DHAVE_STRING_H=1 -DHAVE_MEMORY_H=1 -DHAVE_STRINGS_H=1 -DHAVE_INTTYPES_H=1 -DHAVE_STDINT_H=1 -DHAVE_UNISTD_H=1 -DHAVE_DLFCN_H=1 -DLT_OBJDIR=\".libs/\" -DHAVE_PTHREAD_PRIO_INHERIT=1 -DHAVE_PTHREAD=1 -DHAVE_LIBZ=1 -DHAVE_LIBCURL=1 -DHAVE_APR_POOLS_H=1 -DHAVE_LIBAPR_1=1 -DHAVE_SVN_VERSION_H=1 -DHAVE_LIBSVN_SUBR_1=1 -DHAVE_SVN_DELTA_H=1 -DHAVE_LIBSVN_DELTA_1=1 -DHAVE_LIBSASL2=1 -DMESOS_HAS_JAVA=1 -DHAVE_PYTHON=\"2.7\" -DMESOS_HAS_PYTHON=1 -I. -I../../src   -Wall -Werror -DLIBDIR=\"/mesos/mesos-0.26.0/_inst/lib\" -DPKGLIBEXECDIR=\"/mesos/mesos-0.26.0/_inst/libexec/mesos\" -DPKGDATADIR=\"/mesos/mesos-0.26.0/_inst/share/mesos\" -I../../include -I../../3rdparty/libprocess/include -I../../3rdparty/libprocess/3rdparty/stout/include -I../include -I../include/mesos -I../3rdparty/libprocess/3rdparty/boost-1.53.0 -I../3rdparty/libprocess/3rdparty/picojson-1.3.0 -DPICOJSON_USE_INT64 -D__STDC_FORMAT_MACROS -I../3rdparty/libprocess/3rdparty/protobuf-2.5.0/src -I../3rdparty/libprocess/3rdparty/glog-0.3.3/src -I../3rdparty/libprocess/3rdparty/glog-0.3.3/src -I../3rdparty/leveldb/include -I../3rdparty/zookeeper-3.4.5/src/c/include -I../3rdparty/zookeeper-3.4.5/src/c/generated -I../3rdparty/libprocess/3rdparty/protobuf-2.5.0/src -DSOURCE_DIR=\"/mesos/mesos-0.26.0/_build/..\" -DBUILD_DIR=\"/mesos/mesos-0.26.0/_build\" -I../3rdparty/libprocess/3rdparty/gmock-1.7.0/gtest/include -I../3rdparty/libprocess/3rdparty/gmock-1.7.0/include -I/usr/lib/jvm/java-1.7.0-openjdk-1.7.0.91-2.6.2.1.el7_1.x86_64/include -I/usr/lib/jvm/java-1.7.0-openjdk-1.7.0.91-2.6.2.1.el7_1.x86_64/include/linux -DZOOKEEPER_VERSION=\"3.4.5\" -I/usr/include/subversion-1 -I/usr/include/apr-1 -I/usr/include/apr-1.0  -pthread -g1 -O0 -Wno-unused-local-typedefs -std=c++11 -MT tests/mesos_tests-status_update_manager_tests.o -MD -MP -MF tests/.deps/mesos_tests-status_update_manager_tests.Tpo -c -o tests/mesos_tests-status_update_manager_tests.o `test -f 'tests/status_update_manager_tests.cpp' || echo '../../src/'`tests/status_update_manager_tests.cpp
mv -f tests/.deps/mesos_tests-scheduler_event_call_tests.Tpo tests/.deps/mesos_tests-scheduler_event_call_tests.Po
g++ -DPACKAGE_NAME=\"mesos\" -DPACKAGE_TARNAME=\"mesos\" -DPACKAGE_VERSION=\"0.26.0\" -DPACKAGE_STRING=\"mesos\ 0.26.0\" -DPACKAGE_BUGREPORT=\"\" -DPACKAGE_URL=\"\" -DPACKAGE=\"mesos\" -DVERSION=\"0.26.0\" -DSTDC_HEADERS=1 -DHAVE_SYS_TYPES_H=1 -DHAVE_SYS_STAT_H=1 -DHAVE_STDLIB_H=1 -DHAVE_STRING_H=1 -DHAVE_MEMORY_H=1 -DHAVE_STRINGS_H=1 -DHAVE_INTTYPES_H=1 -DHAVE_STDINT_H=1 -DHAVE_UNISTD_H=1 -DHAVE_DLFCN_H=1 -DLT_OBJDIR=\".libs/\" -DHAVE_PTHREAD_PRIO_INHERIT=1 -DHAVE_PTHREAD=1 -DHAVE_LIBZ=1 -DHAVE_LIBCURL=1 -DHAVE_APR_POOLS_H=1 -DHAVE_LIBAPR_1=1 -DHAVE_SVN_VERSION_H=1 -DHAVE_LIBSVN_SUBR_1=1 -DHAVE_SVN_DELTA_H=1 -DHAVE_LIBSVN_DELTA_1=1 -DHAVE_LIBSASL2=1 -DMESOS_HAS_JAVA=1 -DHAVE_PYTHON=\"2.7\" -DMESOS_HAS_PYTHON=1 -I. -I../../src   -Wall -Werror -DLIBDIR=\"/mesos/mesos-0.26.0/_inst/lib\" -DPKGLIBEXECDIR=\"/mesos/mesos-0.26.0/_inst/libexec/mesos\" -DPKGDATADIR=\"/mesos/mesos-0.26.0/_inst/share/mesos\" -I../../include -I../../3rdparty/libprocess/include -I../../3rdparty/libprocess/3rdparty/stout/include -I../include -I../include/mesos -I../3rdparty/libprocess/3rdparty/boost-1.53.0 -I../3rdparty/libprocess/3rdparty/picojson-1.3.0 -DPICOJSON_USE_INT64 -D__STDC_FORMAT_MACROS -I../3rdparty/libprocess/3rdparty/protobuf-2.5.0/src -I../3rdparty/libprocess/3rdparty/glog-0.3.3/src -I../3rdparty/libprocess/3rdparty/glog-0.3.3/src -I../3rdparty/leveldb/include -I../3rdparty/zookeeper-3.4.5/src/c/include -I../3rdparty/zookeeper-3.4.5/src/c/generated -I../3rdparty/libprocess/3rdparty/protobuf-2.5.0/src -DSOURCE_DIR=\"/mesos/mesos-0.26.0/_build/..\" -DBUILD_DIR=\"/mesos/mesos-0.26.0/_build\" -I../3rdparty/libprocess/3rdparty/gmock-1.7.0/gtest/include -I../3rdparty/libprocess/3rdparty/gmock-1.7.0/include -I/usr/lib/jvm/java-1.7.0-openjdk-1.7.0.91-2.6.2.1.el7_1.x86_64/include -I/usr/lib/jvm/java-1.7.0-openjdk-1.7.0.91-2.6.2.1.el7_1.x86_64/include/linux -DZOOKEEPER_VERSION=\"3.4.5\" -I/usr/include/subversion-1 -I/usr/include/apr-1 -I/usr/include/apr-1.0  -pthread -g1 -O0 -Wno-unused-local-typedefs -std=c++11 -MT tests/mesos_tests-teardown_tests.o -MD -MP -MF tests/.deps/mesos_tests-teardown_tests.Tpo -c -o tests/mesos_tests-teardown_tests.o `test -f 'tests/teardown_tests.cpp' || echo '../../src/'`tests/teardown_tests.cpp
mv -f tests/.deps/mesos_tests-scheduler_http_api_tests.Tpo tests/.deps/mesos_tests-scheduler_http_api_tests.Po
g++ -DPACKAGE_NAME=\"mesos\" -DPACKAGE_TARNAME=\"mesos\" -DPACKAGE_VERSION=\"0.26.0\" -DPACKAGE_STRING=\"mesos\ 0.26.0\" -DPACKAGE_BUGREPORT=\"\" -DPACKAGE_URL=\"\" -DPACKAGE=\"mesos\" -DVERSION=\"0.26.0\" -DSTDC_HEADERS=1 -DHAVE_SYS_TYPES_H=1 -DHAVE_SYS_STAT_H=1 -DHAVE_STDLIB_H=1 -DHAVE_STRING_H=1 -DHAVE_MEMORY_H=1 -DHAVE_STRINGS_H=1 -DHAVE_INTTYPES_H=1 -DHAVE_STDINT_H=1 -DHAVE_UNISTD_H=1 -DHAVE_DLFCN_H=1 -DLT_OBJDIR=\".libs/\" -DHAVE_PTHREAD_PRIO_INHERIT=1 -DHAVE_PTHREAD=1 -DHAVE_LIBZ=1 -DHAVE_LIBCURL=1 -DHAVE_APR_POOLS_H=1 -DHAVE_LIBAPR_1=1 -DHAVE_SVN_VERSION_H=1 -DHAVE_LIBSVN_SUBR_1=1 -DHAVE_SVN_DELTA_H=1 -DHAVE_LIBSVN_DELTA_1=1 -DHAVE_LIBSASL2=1 -DMESOS_HAS_JAVA=1 -DHAVE_PYTHON=\"2.7\" -DMESOS_HAS_PYTHON=1 -I. -I../../src   -Wall -Werror -DLIBDIR=\"/mesos/mesos-0.26.0/_inst/lib\" -DPKGLIBEXECDIR=\"/mesos/mesos-0.26.0/_inst/libexec/mesos\" -DPKGDATADIR=\"/mesos/mesos-0.26.0/_inst/share/mesos\" -I../../include -I../../3rdparty/libprocess/include -I../../3rdparty/libprocess/3rdparty/stout/include -I../include -I../include/mesos -I../3rdparty/libprocess/3rdparty/boost-1.53.0 -I../3rdparty/libprocess/3rdparty/picojson-1.3.0 -DPICOJSON_USE_INT64 -D__STDC_FORMAT_MACROS -I../3rdparty/libprocess/3rdparty/protobuf-2.5.0/src -I../3rdparty/libprocess/3rdparty/glog-0.3.3/src -I../3rdparty/libprocess/3rdparty/glog-0.3.3/src -I../3rdparty/leveldb/include -I../3rdparty/zookeeper-3.4.5/src/c/include -I../3rdparty/zookeeper-3.4.5/src/c/generated -I../3rdparty/libprocess/3rdparty/protobuf-2.5.0/src -DSOURCE_DIR=\"/mesos/mesos-0.26.0/_build/..\" -DBUILD_DIR=\"/mesos/mesos-0.26.0/_build\" -I../3rdparty/libprocess/3rdparty/gmock-1.7.0/gtest/include -I../3rdparty/libprocess/3rdparty/gmock-1.7.0/include -I/usr/lib/jvm/java-1.7.0-openjdk-1.7.0.91-2.6.2.1.el7_1.x86_64/include -I/usr/lib/jvm/java-1.7.0-openjdk-1.7.0.91-2.6.2.1.el7_1.x86_64/include/linux -DZOOKEEPER_VERSION=\"3.4.5\" -I/usr/include/subversion-1 -I/usr/include/apr-1 -I/usr/include/apr-1.0  -pthread -g1 -O0 -Wno-unused-local-typedefs -std=c++11 -MT tests/mesos_tests-utils.o -MD -MP -MF tests/.deps/mesos_tests-utils.Tpo -c -o tests/mesos_tests-utils.o `test -f 'tests/utils.cpp' || echo '../../src/'`tests/utils.cpp
mv -f tests/.deps/mesos_tests-script.Tpo tests/.deps/mesos_tests-script.Po
g++ -DPACKAGE_NAME=\"mesos\" -DPACKAGE_TARNAME=\"mesos\" -DPACKAGE_VERSION=\"0.26.0\" -DPACKAGE_STRING=\"mesos\ 0.26.0\" -DPACKAGE_BUGREPORT=\"\" -DPACKAGE_URL=\"\" -DPACKAGE=\"mesos\" -DVERSION=\"0.26.0\" -DSTDC_HEADERS=1 -DHAVE_SYS_TYPES_H=1 -DHAVE_SYS_STAT_H=1 -DHAVE_STDLIB_H=1 -DHAVE_STRING_H=1 -DHAVE_MEMORY_H=1 -DHAVE_STRINGS_H=1 -DHAVE_INTTYPES_H=1 -DHAVE_STDINT_H=1 -DHAVE_UNISTD_H=1 -DHAVE_DLFCN_H=1 -DLT_OBJDIR=\".libs/\" -DHAVE_PTHREAD_PRIO_INHERIT=1 -DHAVE_PTHREAD=1 -DHAVE_LIBZ=1 -DHAVE_LIBCURL=1 -DHAVE_APR_POOLS_H=1 -DHAVE_LIBAPR_1=1 -DHAVE_SVN_VERSION_H=1 -DHAVE_LIBSVN_SUBR_1=1 -DHAVE_SVN_DELTA_H=1 -DHAVE_LIBSVN_DELTA_1=1 -DHAVE_LIBSASL2=1 -DMESOS_HAS_JAVA=1 -DHAVE_PYTHON=\"2.7\" -DMESOS_HAS_PYTHON=1 -I. -I../../src   -Wall -Werror -DLIBDIR=\"/mesos/mesos-0.26.0/_inst/lib\" -DPKGLIBEXECDIR=\"/mesos/mesos-0.26.0/_inst/libexec/mesos\" -DPKGDATADIR=\"/mesos/mesos-0.26.0/_inst/share/mesos\" -I../../include -I../../3rdparty/libprocess/include -I../../3rdparty/libprocess/3rdparty/stout/include -I../include -I../include/mesos -I../3rdparty/libprocess/3rdparty/boost-1.53.0 -I../3rdparty/libprocess/3rdparty/picojson-1.3.0 -DPICOJSON_USE_INT64 -D__STDC_FORMAT_MACROS -I../3rdparty/libprocess/3rdparty/protobuf-2.5.0/src -I../3rdparty/libprocess/3rdparty/glog-0.3.3/src -I../3rdparty/libprocess/3rdparty/glog-0.3.3/src -I../3rdparty/leveldb/include -I../3rdparty/zookeeper-3.4.5/src/c/include -I../3rdparty/zookeeper-3.4.5/src/c/generated -I../3rdparty/libprocess/3rdparty/protobuf-2.5.0/src -DSOURCE_DIR=\"/mesos/mesos-0.26.0/_build/..\" -DBUILD_DIR=\"/mesos/mesos-0.26.0/_build\" -I../3rdparty/libprocess/3rdparty/gmock-1.7.0/gtest/include -I../3rdparty/libprocess/3rdparty/gmock-1.7.0/include -I/usr/lib/jvm/java-1.7.0-openjdk-1.7.0.91-2.6.2.1.el7_1.x86_64/include -I/usr/lib/jvm/java-1.7.0-openjdk-1.7.0.91-2.6.2.1.el7_1.x86_64/include/linux -DZOOKEEPER_VERSION=\"3.4.5\" -I/usr/include/subversion-1 -I/usr/include/apr-1 -I/usr/include/apr-1.0  -pthread -g1 -O0 -Wno-unused-local-typedefs -std=c++11 -MT tests/mesos_tests-values_tests.o -MD -MP -MF tests/.deps/mesos_tests-values_tests.Tpo -c -o tests/mesos_tests-values_tests.o `test -f 'tests/values_tests.cpp' || echo '../../src/'`tests/values_tests.cpp
mv -f tests/.deps/mesos_tests-state_tests.Tpo tests/.deps/mesos_tests-state_tests.Po
g++ -DPACKAGE_NAME=\"mesos\" -DPACKAGE_TARNAME=\"mesos\" -DPACKAGE_VERSION=\"0.26.0\" -DPACKAGE_STRING=\"mesos\ 0.26.0\" -DPACKAGE_BUGREPORT=\"\" -DPACKAGE_URL=\"\" -DPACKAGE=\"mesos\" -DVERSION=\"0.26.0\" -DSTDC_HEADERS=1 -DHAVE_SYS_TYPES_H=1 -DHAVE_SYS_STAT_H=1 -DHAVE_STDLIB_H=1 -DHAVE_STRING_H=1 -DHAVE_MEMORY_H=1 -DHAVE_STRINGS_H=1 -DHAVE_INTTYPES_H=1 -DHAVE_STDINT_H=1 -DHAVE_UNISTD_H=1 -DHAVE_DLFCN_H=1 -DLT_OBJDIR=\".libs/\" -DHAVE_PTHREAD_PRIO_INHERIT=1 -DHAVE_PTHREAD=1 -DHAVE_LIBZ=1 -DHAVE_LIBCURL=1 -DHAVE_APR_POOLS_H=1 -DHAVE_LIBAPR_1=1 -DHAVE_SVN_VERSION_H=1 -DHAVE_LIBSVN_SUBR_1=1 -DHAVE_SVN_DELTA_H=1 -DHAVE_LIBSVN_DELTA_1=1 -DHAVE_LIBSASL2=1 -DMESOS_HAS_JAVA=1 -DHAVE_PYTHON=\"2.7\" -DMESOS_HAS_PYTHON=1 -I. -I../../src   -Wall -Werror -DLIBDIR=\"/mesos/mesos-0.26.0/_inst/lib\" -DPKGLIBEXECDIR=\"/mesos/mesos-0.26.0/_inst/libexec/mesos\" -DPKGDATADIR=\"/mesos/mesos-0.26.0/_inst/share/mesos\" -I../../include -I../../3rdparty/libprocess/include -I../../3rdparty/libprocess/3rdparty/stout/include -I../include -I../include/mesos -I../3rdparty/libprocess/3rdparty/boost-1.53.0 -I../3rdparty/libprocess/3rdparty/picojson-1.3.0 -DPICOJSON_USE_INT64 -D__STDC_FORMAT_MACROS -I../3rdparty/libprocess/3rdparty/protobuf-2.5.0/src -I../3rdparty/libprocess/3rdparty/glog-0.3.3/src -I../3rdparty/libprocess/3rdparty/glog-0.3.3/src -I../3rdparty/leveldb/include -I../3rdparty/zookeeper-3.4.5/src/c/include -I../3rdparty/zookeeper-3.4.5/src/c/generated -I../3rdparty/libprocess/3rdparty/protobuf-2.5.0/src -DSOURCE_DIR=\"/mesos/mesos-0.26.0/_build/..\" -DBUILD_DIR=\"/mesos/mesos-0.26.0/_build\" -I../3rdparty/libprocess/3rdparty/gmock-1.7.0/gtest/include -I../3rdparty/libprocess/3rdparty/gmock-1.7.0/include -I/usr/lib/jvm/java-1.7.0-openjdk-1.7.0.91-2.6.2.1.el7_1.x86_64/include -I/usr/lib/jvm/java-1.7.0-openjdk-1.7.0.91-2.6.2.1.el7_1.x86_64/include/linux -DZOOKEEPER_VERSION=\"3.4.5\" -I/usr/include/subversion-1 -I/usr/include/apr-1 -I/usr/include/apr-1.0  -pthread -g1 -O0 -Wno-unused-local-typedefs -std=c++11 -MT tests/mesos_tests-zookeeper_url_tests.o -MD -MP -MF tests/.deps/mesos_tests-zookeeper_url_tests.Tpo -c -o tests/mesos_tests-zookeeper_url_tests.o `test -f 'tests/zookeeper_url_tests.cpp' || echo '../../src/'`tests/zookeeper_url_tests.cpp
mv -f tests/.deps/mesos_tests-zookeeper_url_tests.Tpo tests/.deps/mesos_tests-zookeeper_url_tests.Po
g++ -DPACKAGE_NAME=\"mesos\" -DPACKAGE_TARNAME=\"mesos\" -DPACKAGE_VERSION=\"0.26.0\" -DPACKAGE_STRING=\"mesos\ 0.26.0\" -DPACKAGE_BUGREPORT=\"\" -DPACKAGE_URL=\"\" -DPACKAGE=\"mesos\" -DVERSION=\"0.26.0\" -DSTDC_HEADERS=1 -DHAVE_SYS_TYPES_H=1 -DHAVE_SYS_STAT_H=1 -DHAVE_STDLIB_H=1 -DHAVE_STRING_H=1 -DHAVE_MEMORY_H=1 -DHAVE_STRINGS_H=1 -DHAVE_INTTYPES_H=1 -DHAVE_STDINT_H=1 -DHAVE_UNISTD_H=1 -DHAVE_DLFCN_H=1 -DLT_OBJDIR=\".libs/\" -DHAVE_PTHREAD_PRIO_INHERIT=1 -DHAVE_PTHREAD=1 -DHAVE_LIBZ=1 -DHAVE_LIBCURL=1 -DHAVE_APR_POOLS_H=1 -DHAVE_LIBAPR_1=1 -DHAVE_SVN_VERSION_H=1 -DHAVE_LIBSVN_SUBR_1=1 -DHAVE_SVN_DELTA_H=1 -DHAVE_LIBSVN_DELTA_1=1 -DHAVE_LIBSASL2=1 -DMESOS_HAS_JAVA=1 -DHAVE_PYTHON=\"2.7\" -DMESOS_HAS_PYTHON=1 -I. -I../../src   -Wall -Werror -DLIBDIR=\"/mesos/mesos-0.26.0/_inst/lib\" -DPKGLIBEXECDIR=\"/mesos/mesos-0.26.0/_inst/libexec/mesos\" -DPKGDATADIR=\"/mesos/mesos-0.26.0/_inst/share/mesos\" -I../../include -I../../3rdparty/libprocess/include -I../../3rdparty/libprocess/3rdparty/stout/include -I../include -I../include/mesos -I../3rdparty/libprocess/3rdparty/boost-1.53.0 -I../3rdparty/libprocess/3rdparty/picojson-1.3.0 -DPICOJSON_USE_INT64 -D__STDC_FORMAT_MACROS -I../3rdparty/libprocess/3rdparty/protobuf-2.5.0/src -I../3rdparty/libprocess/3rdparty/glog-0.3.3/src -I../3rdparty/libprocess/3rdparty/glog-0.3.3/src -I../3rdparty/leveldb/include -I../3rdparty/zookeeper-3.4.5/src/c/include -I../3rdparty/zookeeper-3.4.5/src/c/generated -I../3rdparty/libprocess/3rdparty/protobuf-2.5.0/src -DSOURCE_DIR=\"/mesos/mesos-0.26.0/_build/..\" -DBUILD_DIR=\"/mesos/mesos-0.26.0/_build\" -I../3rdparty/libprocess/3rdparty/gmock-1.7.0/gtest/include -I../3rdparty/libprocess/3rdparty/gmock-1.7.0/include -I/usr/lib/jvm/java-1.7.0-openjdk-1.7.0.91-2.6.2.1.el7_1.x86_64/include -I/usr/lib/jvm/java-1.7.0-openjdk-1.7.0.91-2.6.2.1.el7_1.x86_64/include/linux -DZOOKEEPER_VERSION=\"3.4.5\" -I/usr/include/subversion-1 -I/usr/include/apr-1 -I/usr/include/apr-1.0  -pthread -g1 -O0 -Wno-unused-local-typedefs -std=c++11 -MT tests/containerizer/mesos_tests-composing_containerizer_tests.o -MD -MP -MF tests/containerizer/.deps/mesos_tests-composing_containerizer_tests.Tpo -c -o tests/containerizer/mesos_tests-composing_containerizer_tests.o `test -f 'tests/containerizer/composing_containerizer_tests.cpp' || echo '../../src/'`tests/containerizer/composing_containerizer_tests.cpp
mv -f tests/.deps/mesos_tests-sorter_tests.Tpo tests/.deps/mesos_tests-sorter_tests.Po
g++ -DPACKAGE_NAME=\"mesos\" -DPACKAGE_TARNAME=\"mesos\" -DPACKAGE_VERSION=\"0.26.0\" -DPACKAGE_STRING=\"mesos\ 0.26.0\" -DPACKAGE_BUGREPORT=\"\" -DPACKAGE_URL=\"\" -DPACKAGE=\"mesos\" -DVERSION=\"0.26.0\" -DSTDC_HEADERS=1 -DHAVE_SYS_TYPES_H=1 -DHAVE_SYS_STAT_H=1 -DHAVE_STDLIB_H=1 -DHAVE_STRING_H=1 -DHAVE_MEMORY_H=1 -DHAVE_STRINGS_H=1 -DHAVE_INTTYPES_H=1 -DHAVE_STDINT_H=1 -DHAVE_UNISTD_H=1 -DHAVE_DLFCN_H=1 -DLT_OBJDIR=\".libs/\" -DHAVE_PTHREAD_PRIO_INHERIT=1 -DHAVE_PTHREAD=1 -DHAVE_LIBZ=1 -DHAVE_LIBCURL=1 -DHAVE_APR_POOLS_H=1 -DHAVE_LIBAPR_1=1 -DHAVE_SVN_VERSION_H=1 -DHAVE_LIBSVN_SUBR_1=1 -DHAVE_SVN_DELTA_H=1 -DHAVE_LIBSVN_DELTA_1=1 -DHAVE_LIBSASL2=1 -DMESOS_HAS_JAVA=1 -DHAVE_PYTHON=\"2.7\" -DMESOS_HAS_PYTHON=1 -I. -I../../src   -Wall -Werror -DLIBDIR=\"/mesos/mesos-0.26.0/_inst/lib\" -DPKGLIBEXECDIR=\"/mesos/mesos-0.26.0/_inst/libexec/mesos\" -DPKGDATADIR=\"/mesos/mesos-0.26.0/_inst/share/mesos\" -I../../include -I../../3rdparty/libprocess/include -I../../3rdparty/libprocess/3rdparty/stout/include -I../include -I../include/mesos -I../3rdparty/libprocess/3rdparty/boost-1.53.0 -I../3rdparty/libprocess/3rdparty/picojson-1.3.0 -DPICOJSON_USE_INT64 -D__STDC_FORMAT_MACROS -I../3rdparty/libprocess/3rdparty/protobuf-2.5.0/src -I../3rdparty/libprocess/3rdparty/glog-0.3.3/src -I../3rdparty/libprocess/3rdparty/glog-0.3.3/src -I../3rdparty/leveldb/include -I../3rdparty/zookeeper-3.4.5/src/c/include -I../3rdparty/zookeeper-3.4.5/src/c/generated -I../3rdparty/libprocess/3rdparty/protobuf-2.5.0/src -DSOURCE_DIR=\"/mesos/mesos-0.26.0/_build/..\" -DBUILD_DIR=\"/mesos/mesos-0.26.0/_build\" -I../3rdparty/libprocess/3rdparty/gmock-1.7.0/gtest/include -I../3rdparty/libprocess/3rdparty/gmock-1.7.0/include -I/usr/lib/jvm/java-1.7.0-openjdk-1.7.0.91-2.6.2.1.el7_1.x86_64/include -I/usr/lib/jvm/java-1.7.0-openjdk-1.7.0.91-2.6.2.1.el7_1.x86_64/include/linux -DZOOKEEPER_VERSION=\"3.4.5\" -I/usr/include/subversion-1 -I/usr/include/apr-1 -I/usr/include/apr-1.0  -pthread -g1 -O0 -Wno-unused-local-typedefs -std=c++11 -MT tests/containerizer/mesos_tests-docker_containerizer_tests.o -MD -MP -MF tests/containerizer/.deps/mesos_tests-docker_containerizer_tests.Tpo -c -o tests/containerizer/mesos_tests-docker_containerizer_tests.o `test -f 'tests/containerizer/docker_containerizer_tests.cpp' || echo '../../src/'`tests/containerizer/docker_containerizer_tests.cpp
mv -f tests/.deps/mesos_tests-utils.Tpo tests/.deps/mesos_tests-utils.Po
g++ -DPACKAGE_NAME=\"mesos\" -DPACKAGE_TARNAME=\"mesos\" -DPACKAGE_VERSION=\"0.26.0\" -DPACKAGE_STRING=\"mesos\ 0.26.0\" -DPACKAGE_BUGREPORT=\"\" -DPACKAGE_URL=\"\" -DPACKAGE=\"mesos\" -DVERSION=\"0.26.0\" -DSTDC_HEADERS=1 -DHAVE_SYS_TYPES_H=1 -DHAVE_SYS_STAT_H=1 -DHAVE_STDLIB_H=1 -DHAVE_STRING_H=1 -DHAVE_MEMORY_H=1 -DHAVE_STRINGS_H=1 -DHAVE_INTTYPES_H=1 -DHAVE_STDINT_H=1 -DHAVE_UNISTD_H=1 -DHAVE_DLFCN_H=1 -DLT_OBJDIR=\".libs/\" -DHAVE_PTHREAD_PRIO_INHERIT=1 -DHAVE_PTHREAD=1 -DHAVE_LIBZ=1 -DHAVE_LIBCURL=1 -DHAVE_APR_POOLS_H=1 -DHAVE_LIBAPR_1=1 -DHAVE_SVN_VERSION_H=1 -DHAVE_LIBSVN_SUBR_1=1 -DHAVE_SVN_DELTA_H=1 -DHAVE_LIBSVN_DELTA_1=1 -DHAVE_LIBSASL2=1 -DMESOS_HAS_JAVA=1 -DHAVE_PYTHON=\"2.7\" -DMESOS_HAS_PYTHON=1 -I. -I../../src   -Wall -Werror -DLIBDIR=\"/mesos/mesos-0.26.0/_inst/lib\" -DPKGLIBEXECDIR=\"/mesos/mesos-0.26.0/_inst/libexec/mesos\" -DPKGDATADIR=\"/mesos/mesos-0.26.0/_inst/share/mesos\" -I../../include -I../../3rdparty/libprocess/include -I../../3rdparty/libprocess/3rdparty/stout/include -I../include -I../include/mesos -I../3rdparty/libprocess/3rdparty/boost-1.53.0 -I../3rdparty/libprocess/3rdparty/picojson-1.3.0 -DPICOJSON_USE_INT64 -D__STDC_FORMAT_MACROS -I../3rdparty/libprocess/3rdparty/protobuf-2.5.0/src -I../3rdparty/libprocess/3rdparty/glog-0.3.3/src -I../3rdparty/libprocess/3rdparty/glog-0.3.3/src -I../3rdparty/leveldb/include -I../3rdparty/zookeeper-3.4.5/src/c/include -I../3rdparty/zookeeper-3.4.5/src/c/generated -I../3rdparty/libprocess/3rdparty/protobuf-2.5.0/src -DSOURCE_DIR=\"/mesos/mesos-0.26.0/_build/..\" -DBUILD_DIR=\"/mesos/mesos-0.26.0/_build\" -I../3rdparty/libprocess/3rdparty/gmock-1.7.0/gtest/include -I../3rdparty/libprocess/3rdparty/gmock-1.7.0/include -I/usr/lib/jvm/java-1.7.0-openjdk-1.7.0.91-2.6.2.1.el7_1.x86_64/include -I/usr/lib/jvm/java-1.7.0-openjdk-1.7.0.91-2.6.2.1.el7_1.x86_64/include/linux -DZOOKEEPER_VERSION=\"3.4.5\" -I/usr/include/subversion-1 -I/usr/include/apr-1 -I/usr/include/apr-1.0  -pthread -g1 -O0 -Wno-unused-local-typedefs -std=c++11 -MT tests/containerizer/mesos_tests-docker_tests.o -MD -MP -MF tests/containerizer/.deps/mesos_tests-docker_tests.Tpo -c -o tests/containerizer/mesos_tests-docker_tests.o `test -f 'tests/containerizer/docker_tests.cpp' || echo '../../src/'`tests/containerizer/docker_tests.cpp
mv -f tests/.deps/mesos_tests-values_tests.Tpo tests/.deps/mesos_tests-values_tests.Po
g++ -DPACKAGE_NAME=\"mesos\" -DPACKAGE_TARNAME=\"mesos\" -DPACKAGE_VERSION=\"0.26.0\" -DPACKAGE_STRING=\"mesos\ 0.26.0\" -DPACKAGE_BUGREPORT=\"\" -DPACKAGE_URL=\"\" -DPACKAGE=\"mesos\" -DVERSION=\"0.26.0\" -DSTDC_HEADERS=1 -DHAVE_SYS_TYPES_H=1 -DHAVE_SYS_STAT_H=1 -DHAVE_STDLIB_H=1 -DHAVE_STRING_H=1 -DHAVE_MEMORY_H=1 -DHAVE_STRINGS_H=1 -DHAVE_INTTYPES_H=1 -DHAVE_STDINT_H=1 -DHAVE_UNISTD_H=1 -DHAVE_DLFCN_H=1 -DLT_OBJDIR=\".libs/\" -DHAVE_PTHREAD_PRIO_INHERIT=1 -DHAVE_PTHREAD=1 -DHAVE_LIBZ=1 -DHAVE_LIBCURL=1 -DHAVE_APR_POOLS_H=1 -DHAVE_LIBAPR_1=1 -DHAVE_SVN_VERSION_H=1 -DHAVE_LIBSVN_SUBR_1=1 -DHAVE_SVN_DELTA_H=1 -DHAVE_LIBSVN_DELTA_1=1 -DHAVE_LIBSASL2=1 -DMESOS_HAS_JAVA=1 -DHAVE_PYTHON=\"2.7\" -DMESOS_HAS_PYTHON=1 -I. -I../../src   -Wall -Werror -DLIBDIR=\"/mesos/mesos-0.26.0/_inst/lib\" -DPKGLIBEXECDIR=\"/mesos/mesos-0.26.0/_inst/libexec/mesos\" -DPKGDATADIR=\"/mesos/mesos-0.26.0/_inst/share/mesos\" -I../../include -I../../3rdparty/libprocess/include -I../../3rdparty/libprocess/3rdparty/stout/include -I../include -I../include/mesos -I../3rdparty/libprocess/3rdparty/boost-1.53.0 -I../3rdparty/libprocess/3rdparty/picojson-1.3.0 -DPICOJSON_USE_INT64 -D__STDC_FORMAT_MACROS -I../3rdparty/libprocess/3rdparty/protobuf-2.5.0/src -I../3rdparty/libprocess/3rdparty/glog-0.3.3/src -I../3rdparty/libprocess/3rdparty/glog-0.3.3/src -I../3rdparty/leveldb/include -I../3rdparty/zookeeper-3.4.5/src/c/include -I../3rdparty/zookeeper-3.4.5/src/c/generated -I../3rdparty/libprocess/3rdparty/protobuf-2.5.0/src -DSOURCE_DIR=\"/mesos/mesos-0.26.0/_build/..\" -DBUILD_DIR=\"/mesos/mesos-0.26.0/_build\" -I../3rdparty/libprocess/3rdparty/gmock-1.7.0/gtest/include -I../3rdparty/libprocess/3rdparty/gmock-1.7.0/include -I/usr/lib/jvm/java-1.7.0-openjdk-1.7.0.91-2.6.2.1.el7_1.x86_64/include -I/usr/lib/jvm/java-1.7.0-openjdk-1.7.0.91-2.6.2.1.el7_1.x86_64/include/linux -DZOOKEEPER_VERSION=\"3.4.5\" -I/usr/include/subversion-1 -I/usr/include/apr-1 -I/usr/include/apr-1.0  -pthread -g1 -O0 -Wno-unused-local-typedefs -std=c++11 -MT tests/containerizer/mesos_tests-external_containerizer_test.o -MD -MP -MF tests/containerizer/.deps/mesos_tests-external_containerizer_test.Tpo -c -o tests/containerizer/mesos_tests-external_containerizer_test.o `test -f 'tests/containerizer/external_containerizer_test.cpp' || echo '../../src/'`tests/containerizer/external_containerizer_test.cpp
mv -f tests/.deps/mesos_tests-teardown_tests.Tpo tests/.deps/mesos_tests-teardown_tests.Po
g++ -DPACKAGE_NAME=\"mesos\" -DPACKAGE_TARNAME=\"mesos\" -DPACKAGE_VERSION=\"0.26.0\" -DPACKAGE_STRING=\"mesos\ 0.26.0\" -DPACKAGE_BUGREPORT=\"\" -DPACKAGE_URL=\"\" -DPACKAGE=\"mesos\" -DVERSION=\"0.26.0\" -DSTDC_HEADERS=1 -DHAVE_SYS_TYPES_H=1 -DHAVE_SYS_STAT_H=1 -DHAVE_STDLIB_H=1 -DHAVE_STRING_H=1 -DHAVE_MEMORY_H=1 -DHAVE_STRINGS_H=1 -DHAVE_INTTYPES_H=1 -DHAVE_STDINT_H=1 -DHAVE_UNISTD_H=1 -DHAVE_DLFCN_H=1 -DLT_OBJDIR=\".libs/\" -DHAVE_PTHREAD_PRIO_INHERIT=1 -DHAVE_PTHREAD=1 -DHAVE_LIBZ=1 -DHAVE_LIBCURL=1 -DHAVE_APR_POOLS_H=1 -DHAVE_LIBAPR_1=1 -DHAVE_SVN_VERSION_H=1 -DHAVE_LIBSVN_SUBR_1=1 -DHAVE_SVN_DELTA_H=1 -DHAVE_LIBSVN_DELTA_1=1 -DHAVE_LIBSASL2=1 -DMESOS_HAS_JAVA=1 -DHAVE_PYTHON=\"2.7\" -DMESOS_HAS_PYTHON=1 -I. -I../../src   -Wall -Werror -DLIBDIR=\"/mesos/mesos-0.26.0/_inst/lib\" -DPKGLIBEXECDIR=\"/mesos/mesos-0.26.0/_inst/libexec/mesos\" -DPKGDATADIR=\"/mesos/mesos-0.26.0/_inst/share/mesos\" -I../../include -I../../3rdparty/libprocess/include -I../../3rdparty/libprocess/3rdparty/stout/include -I../include -I../include/mesos -I../3rdparty/libprocess/3rdparty/boost-1.53.0 -I../3rdparty/libprocess/3rdparty/picojson-1.3.0 -DPICOJSON_USE_INT64 -D__STDC_FORMAT_MACROS -I../3rdparty/libprocess/3rdparty/protobuf-2.5.0/src -I../3rdparty/libprocess/3rdparty/glog-0.3.3/src -I../3rdparty/libprocess/3rdparty/glog-0.3.3/src -I../3rdparty/leveldb/include -I../3rdparty/zookeeper-3.4.5/src/c/include -I../3rdparty/zookeeper-3.4.5/src/c/generated -I../3rdparty/libprocess/3rdparty/protobuf-2.5.0/src -DSOURCE_DIR=\"/mesos/mesos-0.26.0/_build/..\" -DBUILD_DIR=\"/mesos/mesos-0.26.0/_build\" -I../3rdparty/libprocess/3rdparty/gmock-1.7.0/gtest/include -I../3rdparty/libprocess/3rdparty/gmock-1.7.0/include -I/usr/lib/jvm/java-1.7.0-openjdk-1.7.0.91-2.6.2.1.el7_1.x86_64/include -I/usr/lib/jvm/java-1.7.0-openjdk-1.7.0.91-2.6.2.1.el7_1.x86_64/include/linux -DZOOKEEPER_VERSION=\"3.4.5\" -I/usr/include/subversion-1 -I/usr/include/apr-1 -I/usr/include/apr-1.0  -pthread -g1 -O0 -Wno-unused-local-typedefs -std=c++11 -MT tests/containerizer/mesos_tests-isolator_tests.o -MD -MP -MF tests/containerizer/.deps/mesos_tests-isolator_tests.Tpo -c -o tests/containerizer/mesos_tests-isolator_tests.o `test -f 'tests/containerizer/isolator_tests.cpp' || echo '../../src/'`tests/containerizer/isolator_tests.cpp
mv -f tests/.deps/mesos_tests-status_update_manager_tests.Tpo tests/.deps/mesos_tests-status_update_manager_tests.Po
g++ -DPACKAGE_NAME=\"mesos\" -DPACKAGE_TARNAME=\"mesos\" -DPACKAGE_VERSION=\"0.26.0\" -DPACKAGE_STRING=\"mesos\ 0.26.0\" -DPACKAGE_BUGREPORT=\"\" -DPACKAGE_URL=\"\" -DPACKAGE=\"mesos\" -DVERSION=\"0.26.0\" -DSTDC_HEADERS=1 -DHAVE_SYS_TYPES_H=1 -DHAVE_SYS_STAT_H=1 -DHAVE_STDLIB_H=1 -DHAVE_STRING_H=1 -DHAVE_MEMORY_H=1 -DHAVE_STRINGS_H=1 -DHAVE_INTTYPES_H=1 -DHAVE_STDINT_H=1 -DHAVE_UNISTD_H=1 -DHAVE_DLFCN_H=1 -DLT_OBJDIR=\".libs/\" -DHAVE_PTHREAD_PRIO_INHERIT=1 -DHAVE_PTHREAD=1 -DHAVE_LIBZ=1 -DHAVE_LIBCURL=1 -DHAVE_APR_POOLS_H=1 -DHAVE_LIBAPR_1=1 -DHAVE_SVN_VERSION_H=1 -DHAVE_LIBSVN_SUBR_1=1 -DHAVE_SVN_DELTA_H=1 -DHAVE_LIBSVN_DELTA_1=1 -DHAVE_LIBSASL2=1 -DMESOS_HAS_JAVA=1 -DHAVE_PYTHON=\"2.7\" -DMESOS_HAS_PYTHON=1 -I. -I../../src   -Wall -Werror -DLIBDIR=\"/mesos/mesos-0.26.0/_inst/lib\" -DPKGLIBEXECDIR=\"/mesos/mesos-0.26.0/_inst/libexec/mesos\" -DPKGDATADIR=\"/mesos/mesos-0.26.0/_inst/share/mesos\" -I../../include -I../../3rdparty/libprocess/include -I../../3rdparty/libprocess/3rdparty/stout/include -I../include -I../include/mesos -I../3rdparty/libprocess/3rdparty/boost-1.53.0 -I../3rdparty/libprocess/3rdparty/picojson-1.3.0 -DPICOJSON_USE_INT64 -D__STDC_FORMAT_MACROS -I../3rdparty/libprocess/3rdparty/protobuf-2.5.0/src -I../3rdparty/libprocess/3rdparty/glog-0.3.3/src -I../3rdparty/libprocess/3rdparty/glog-0.3.3/src -I../3rdparty/leveldb/include -I../3rdparty/zookeeper-3.4.5/src/c/include -I../3rdparty/zookeeper-3.4.5/src/c/generated -I../3rdparty/libprocess/3rdparty/protobuf-2.5.0/src -DSOURCE_DIR=\"/mesos/mesos-0.26.0/_build/..\" -DBUILD_DIR=\"/mesos/mesos-0.26.0/_build\" -I../3rdparty/libprocess/3rdparty/gmock-1.7.0/gtest/include -I../3rdparty/libprocess/3rdparty/gmock-1.7.0/include -I/usr/lib/jvm/java-1.7.0-openjdk-1.7.0.91-2.6.2.1.el7_1.x86_64/include -I/usr/lib/jvm/java-1.7.0-openjdk-1.7.0.91-2.6.2.1.el7_1.x86_64/include/linux -DZOOKEEPER_VERSION=\"3.4.5\" -I/usr/include/subversion-1 -I/usr/include/apr-1 -I/usr/include/apr-1.0  -pthread -g1 -O0 -Wno-unused-local-typedefs -std=c++11 -MT tests/containerizer/mesos_tests-memory_test_helper.o -MD -MP -MF tests/containerizer/.deps/mesos_tests-memory_test_helper.Tpo -c -o tests/containerizer/mesos_tests-memory_test_helper.o `test -f 'tests/containerizer/memory_test_helper.cpp' || echo '../../src/'`tests/containerizer/memory_test_helper.cpp
mv -f tests/containerizer/.deps/mesos_tests-memory_test_helper.Tpo tests/containerizer/.deps/mesos_tests-memory_test_helper.Po
g++ -DPACKAGE_NAME=\"mesos\" -DPACKAGE_TARNAME=\"mesos\" -DPACKAGE_VERSION=\"0.26.0\" -DPACKAGE_STRING=\"mesos\ 0.26.0\" -DPACKAGE_BUGREPORT=\"\" -DPACKAGE_URL=\"\" -DPACKAGE=\"mesos\" -DVERSION=\"0.26.0\" -DSTDC_HEADERS=1 -DHAVE_SYS_TYPES_H=1 -DHAVE_SYS_STAT_H=1 -DHAVE_STDLIB_H=1 -DHAVE_STRING_H=1 -DHAVE_MEMORY_H=1 -DHAVE_STRINGS_H=1 -DHAVE_INTTYPES_H=1 -DHAVE_STDINT_H=1 -DHAVE_UNISTD_H=1 -DHAVE_DLFCN_H=1 -DLT_OBJDIR=\".libs/\" -DHAVE_PTHREAD_PRIO_INHERIT=1 -DHAVE_PTHREAD=1 -DHAVE_LIBZ=1 -DHAVE_LIBCURL=1 -DHAVE_APR_POOLS_H=1 -DHAVE_LIBAPR_1=1 -DHAVE_SVN_VERSION_H=1 -DHAVE_LIBSVN_SUBR_1=1 -DHAVE_SVN_DELTA_H=1 -DHAVE_LIBSVN_DELTA_1=1 -DHAVE_LIBSASL2=1 -DMESOS_HAS_JAVA=1 -DHAVE_PYTHON=\"2.7\" -DMESOS_HAS_PYTHON=1 -I. -I../../src   -Wall -Werror -DLIBDIR=\"/mesos/mesos-0.26.0/_inst/lib\" -DPKGLIBEXECDIR=\"/mesos/mesos-0.26.0/_inst/libexec/mesos\" -DPKGDATADIR=\"/mesos/mesos-0.26.0/_inst/share/mesos\" -I../../include -I../../3rdparty/libprocess/include -I../../3rdparty/libprocess/3rdparty/stout/include -I../include -I../include/mesos -I../3rdparty/libprocess/3rdparty/boost-1.53.0 -I../3rdparty/libprocess/3rdparty/picojson-1.3.0 -DPICOJSON_USE_INT64 -D__STDC_FORMAT_MACROS -I../3rdparty/libprocess/3rdparty/protobuf-2.5.0/src -I../3rdparty/libprocess/3rdparty/glog-0.3.3/src -I../3rdparty/libprocess/3rdparty/glog-0.3.3/src -I../3rdparty/leveldb/include -I../3rdparty/zookeeper-3.4.5/src/c/include -I../3rdparty/zookeeper-3.4.5/src/c/generated -I../3rdparty/libprocess/3rdparty/protobuf-2.5.0/src -DSOURCE_DIR=\"/mesos/mesos-0.26.0/_build/..\" -DBUILD_DIR=\"/mesos/mesos-0.26.0/_build\" -I../3rdparty/libprocess/3rdparty/gmock-1.7.0/gtest/include -I../3rdparty/libprocess/3rdparty/gmock-1.7.0/include -I/usr/lib/jvm/java-1.7.0-openjdk-1.7.0.91-2.6.2.1.el7_1.x86_64/include -I/usr/lib/jvm/java-1.7.0-openjdk-1.7.0.91-2.6.2.1.el7_1.x86_64/include/linux -DZOOKEEPER_VERSION=\"3.4.5\" -I/usr/include/subversion-1 -I/usr/include/apr-1 -I/usr/include/apr-1.0  -pthread -g1 -O0 -Wno-unused-local-typedefs -std=c++11 -MT tests/containerizer/mesos_tests-mesos_containerizer_tests.o -MD -MP -MF tests/containerizer/.deps/mesos_tests-mesos_containerizer_tests.Tpo -c -o tests/containerizer/mesos_tests-mesos_containerizer_tests.o `test -f 'tests/containerizer/mesos_containerizer_tests.cpp' || echo '../../src/'`tests/containerizer/mesos_containerizer_tests.cpp
mv -f tests/containerizer/.deps/mesos_tests-composing_containerizer_tests.Tpo tests/containerizer/.deps/mesos_tests-composing_containerizer_tests.Po
g++ -DPACKAGE_NAME=\"mesos\" -DPACKAGE_TARNAME=\"mesos\" -DPACKAGE_VERSION=\"0.26.0\" -DPACKAGE_STRING=\"mesos\ 0.26.0\" -DPACKAGE_BUGREPORT=\"\" -DPACKAGE_URL=\"\" -DPACKAGE=\"mesos\" -DVERSION=\"0.26.0\" -DSTDC_HEADERS=1 -DHAVE_SYS_TYPES_H=1 -DHAVE_SYS_STAT_H=1 -DHAVE_STDLIB_H=1 -DHAVE_STRING_H=1 -DHAVE_MEMORY_H=1 -DHAVE_STRINGS_H=1 -DHAVE_INTTYPES_H=1 -DHAVE_STDINT_H=1 -DHAVE_UNISTD_H=1 -DHAVE_DLFCN_H=1 -DLT_OBJDIR=\".libs/\" -DHAVE_PTHREAD_PRIO_INHERIT=1 -DHAVE_PTHREAD=1 -DHAVE_LIBZ=1 -DHAVE_LIBCURL=1 -DHAVE_APR_POOLS_H=1 -DHAVE_LIBAPR_1=1 -DHAVE_SVN_VERSION_H=1 -DHAVE_LIBSVN_SUBR_1=1 -DHAVE_SVN_DELTA_H=1 -DHAVE_LIBSVN_DELTA_1=1 -DHAVE_LIBSASL2=1 -DMESOS_HAS_JAVA=1 -DHAVE_PYTHON=\"2.7\" -DMESOS_HAS_PYTHON=1 -I. -I../../src   -Wall -Werror -DLIBDIR=\"/mesos/mesos-0.26.0/_inst/lib\" -DPKGLIBEXECDIR=\"/mesos/mesos-0.26.0/_inst/libexec/mesos\" -DPKGDATADIR=\"/mesos/mesos-0.26.0/_inst/share/mesos\" -I../../include -I../../3rdparty/libprocess/include -I../../3rdparty/libprocess/3rdparty/stout/include -I../include -I../include/mesos -I../3rdparty/libprocess/3rdparty/boost-1.53.0 -I../3rdparty/libprocess/3rdparty/picojson-1.3.0 -DPICOJSON_USE_INT64 -D__STDC_FORMAT_MACROS -I../3rdparty/libprocess/3rdparty/protobuf-2.5.0/src -I../3rdparty/libprocess/3rdparty/glog-0.3.3/src -I../3rdparty/libprocess/3rdparty/glog-0.3.3/src -I../3rdparty/leveldb/include -I../3rdparty/zookeeper-3.4.5/src/c/include -I../3rdparty/zookeeper-3.4.5/src/c/generated -I../3rdparty/libprocess/3rdparty/protobuf-2.5.0/src -DSOURCE_DIR=\"/mesos/mesos-0.26.0/_build/..\" -DBUILD_DIR=\"/mesos/mesos-0.26.0/_build\" -I../3rdparty/libprocess/3rdparty/gmock-1.7.0/gtest/include -I../3rdparty/libprocess/3rdparty/gmock-1.7.0/include -I/usr/lib/jvm/java-1.7.0-openjdk-1.7.0.91-2.6.2.1.el7_1.x86_64/include -I/usr/lib/jvm/java-1.7.0-openjdk-1.7.0.91-2.6.2.1.el7_1.x86_64/include/linux -DZOOKEEPER_VERSION=\"3.4.5\" -I/usr/include/subversion-1 -I/usr/include/apr-1 -I/usr/include/apr-1.0  -pthread -g1 -O0 -Wno-unused-local-typedefs -std=c++11 -MT tests/containerizer/mesos_tests-provisioner_appc_tests.o -MD -MP -MF tests/containerizer/.deps/mesos_tests-provisioner_appc_tests.Tpo -c -o tests/containerizer/mesos_tests-provisioner_appc_tests.o `test -f 'tests/containerizer/provisioner_appc_tests.cpp' || echo '../../src/'`tests/containerizer/provisioner_appc_tests.cpp
mv -f tests/containerizer/.deps/mesos_tests-docker_tests.Tpo tests/containerizer/.deps/mesos_tests-docker_tests.Po
g++ -DPACKAGE_NAME=\"mesos\" -DPACKAGE_TARNAME=\"mesos\" -DPACKAGE_VERSION=\"0.26.0\" -DPACKAGE_STRING=\"mesos\ 0.26.0\" -DPACKAGE_BUGREPORT=\"\" -DPACKAGE_URL=\"\" -DPACKAGE=\"mesos\" -DVERSION=\"0.26.0\" -DSTDC_HEADERS=1 -DHAVE_SYS_TYPES_H=1 -DHAVE_SYS_STAT_H=1 -DHAVE_STDLIB_H=1 -DHAVE_STRING_H=1 -DHAVE_MEMORY_H=1 -DHAVE_STRINGS_H=1 -DHAVE_INTTYPES_H=1 -DHAVE_STDINT_H=1 -DHAVE_UNISTD_H=1 -DHAVE_DLFCN_H=1 -DLT_OBJDIR=\".libs/\" -DHAVE_PTHREAD_PRIO_INHERIT=1 -DHAVE_PTHREAD=1 -DHAVE_LIBZ=1 -DHAVE_LIBCURL=1 -DHAVE_APR_POOLS_H=1 -DHAVE_LIBAPR_1=1 -DHAVE_SVN_VERSION_H=1 -DHAVE_LIBSVN_SUBR_1=1 -DHAVE_SVN_DELTA_H=1 -DHAVE_LIBSVN_DELTA_1=1 -DHAVE_LIBSASL2=1 -DMESOS_HAS_JAVA=1 -DHAVE_PYTHON=\"2.7\" -DMESOS_HAS_PYTHON=1 -I. -I../../src   -Wall -Werror -DLIBDIR=\"/mesos/mesos-0.26.0/_inst/lib\" -DPKGLIBEXECDIR=\"/mesos/mesos-0.26.0/_inst/libexec/mesos\" -DPKGDATADIR=\"/mesos/mesos-0.26.0/_inst/share/mesos\" -I../../include -I../../3rdparty/libprocess/include -I../../3rdparty/libprocess/3rdparty/stout/include -I../include -I../include/mesos -I../3rdparty/libprocess/3rdparty/boost-1.53.0 -I../3rdparty/libprocess/3rdparty/picojson-1.3.0 -DPICOJSON_USE_INT64 -D__STDC_FORMAT_MACROS -I../3rdparty/libprocess/3rdparty/protobuf-2.5.0/src -I../3rdparty/libprocess/3rdparty/glog-0.3.3/src -I../3rdparty/libprocess/3rdparty/glog-0.3.3/src -I../3rdparty/leveldb/include -I../3rdparty/zookeeper-3.4.5/src/c/include -I../3rdparty/zookeeper-3.4.5/src/c/generated -I../3rdparty/libprocess/3rdparty/protobuf-2.5.0/src -DSOURCE_DIR=\"/mesos/mesos-0.26.0/_build/..\" -DBUILD_DIR=\"/mesos/mesos-0.26.0/_build\" -I../3rdparty/libprocess/3rdparty/gmock-1.7.0/gtest/include -I../3rdparty/libprocess/3rdparty/gmock-1.7.0/include -I/usr/lib/jvm/java-1.7.0-openjdk-1.7.0.91-2.6.2.1.el7_1.x86_64/include -I/usr/lib/jvm/java-1.7.0-openjdk-1.7.0.91-2.6.2.1.el7_1.x86_64/include/linux -DZOOKEEPER_VERSION=\"3.4.5\" -I/usr/include/subversion-1 -I/usr/include/apr-1 -I/usr/include/apr-1.0  -pthread -g1 -O0 -Wno-unused-local-typedefs -std=c++11 -MT tests/containerizer/mesos_tests-provisioner_backend_tests.o -MD -MP -MF tests/containerizer/.deps/mesos_tests-provisioner_backend_tests.Tpo -c -o tests/containerizer/mesos_tests-provisioner_backend_tests.o `test -f 'tests/containerizer/provisioner_backend_tests.cpp' || echo '../../src/'`tests/containerizer/provisioner_backend_tests.cpp
mv -f tests/.deps/mesos_tests-slave_recovery_tests.Tpo tests/.deps/mesos_tests-slave_recovery_tests.Po
g++ -DPACKAGE_NAME=\"mesos\" -DPACKAGE_TARNAME=\"mesos\" -DPACKAGE_VERSION=\"0.26.0\" -DPACKAGE_STRING=\"mesos\ 0.26.0\" -DPACKAGE_BUGREPORT=\"\" -DPACKAGE_URL=\"\" -DPACKAGE=\"mesos\" -DVERSION=\"0.26.0\" -DSTDC_HEADERS=1 -DHAVE_SYS_TYPES_H=1 -DHAVE_SYS_STAT_H=1 -DHAVE_STDLIB_H=1 -DHAVE_STRING_H=1 -DHAVE_MEMORY_H=1 -DHAVE_STRINGS_H=1 -DHAVE_INTTYPES_H=1 -DHAVE_STDINT_H=1 -DHAVE_UNISTD_H=1 -DHAVE_DLFCN_H=1 -DLT_OBJDIR=\".libs/\" -DHAVE_PTHREAD_PRIO_INHERIT=1 -DHAVE_PTHREAD=1 -DHAVE_LIBZ=1 -DHAVE_LIBCURL=1 -DHAVE_APR_POOLS_H=1 -DHAVE_LIBAPR_1=1 -DHAVE_SVN_VERSION_H=1 -DHAVE_LIBSVN_SUBR_1=1 -DHAVE_SVN_DELTA_H=1 -DHAVE_LIBSVN_DELTA_1=1 -DHAVE_LIBSASL2=1 -DMESOS_HAS_JAVA=1 -DHAVE_PYTHON=\"2.7\" -DMESOS_HAS_PYTHON=1 -I. -I../../src   -Wall -Werror -DLIBDIR=\"/mesos/mesos-0.26.0/_inst/lib\" -DPKGLIBEXECDIR=\"/mesos/mesos-0.26.0/_inst/libexec/mesos\" -DPKGDATADIR=\"/mesos/mesos-0.26.0/_inst/share/mesos\" -I../../include -I../../3rdparty/libprocess/include -I../../3rdparty/libprocess/3rdparty/stout/include -I../include -I../include/mesos -I../3rdparty/libprocess/3rdparty/boost-1.53.0 -I../3rdparty/libprocess/3rdparty/picojson-1.3.0 -DPICOJSON_USE_INT64 -D__STDC_FORMAT_MACROS -I../3rdparty/libprocess/3rdparty/protobuf-2.5.0/src -I../3rdparty/libprocess/3rdparty/glog-0.3.3/src -I../3rdparty/libprocess/3rdparty/glog-0.3.3/src -I../3rdparty/leveldb/include -I../3rdparty/zookeeper-3.4.5/src/c/include -I../3rdparty/zookeeper-3.4.5/src/c/generated -I../3rdparty/libprocess/3rdparty/protobuf-2.5.0/src -DSOURCE_DIR=\"/mesos/mesos-0.26.0/_build/..\" -DBUILD_DIR=\"/mesos/mesos-0.26.0/_build\" -I../3rdparty/libprocess/3rdparty/gmock-1.7.0/gtest/include -I../3rdparty/libprocess/3rdparty/gmock-1.7.0/include -I/usr/lib/jvm/java-1.7.0-openjdk-1.7.0.91-2.6.2.1.el7_1.x86_64/include -I/usr/lib/jvm/java-1.7.0-openjdk-1.7.0.91-2.6.2.1.el7_1.x86_64/include/linux -DZOOKEEPER_VERSION=\"3.4.5\" -I/usr/include/subversion-1 -I/usr/include/apr-1 -I/usr/include/apr-1.0  -pthread -g1 -O0 -Wno-unused-local-typedefs -std=c++11 -MT tests/containerizer/mesos_tests-provisioner_docker_tests.o -MD -MP -MF tests/containerizer/.deps/mesos_tests-provisioner_docker_tests.Tpo -c -o tests/containerizer/mesos_tests-provisioner_docker_tests.o `test -f 'tests/containerizer/provisioner_docker_tests.cpp' || echo '../../src/'`tests/containerizer/provisioner_docker_tests.cpp
mv -f tests/.deps/mesos_tests-slave_tests.Tpo tests/.deps/mesos_tests-slave_tests.Po
g++ -DPACKAGE_NAME=\"mesos\" -DPACKAGE_TARNAME=\"mesos\" -DPACKAGE_VERSION=\"0.26.0\" -DPACKAGE_STRING=\"mesos\ 0.26.0\" -DPACKAGE_BUGREPORT=\"\" -DPACKAGE_URL=\"\" -DPACKAGE=\"mesos\" -DVERSION=\"0.26.0\" -DSTDC_HEADERS=1 -DHAVE_SYS_TYPES_H=1 -DHAVE_SYS_STAT_H=1 -DHAVE_STDLIB_H=1 -DHAVE_STRING_H=1 -DHAVE_MEMORY_H=1 -DHAVE_STRINGS_H=1 -DHAVE_INTTYPES_H=1 -DHAVE_STDINT_H=1 -DHAVE_UNISTD_H=1 -DHAVE_DLFCN_H=1 -DLT_OBJDIR=\".libs/\" -DHAVE_PTHREAD_PRIO_INHERIT=1 -DHAVE_PTHREAD=1 -DHAVE_LIBZ=1 -DHAVE_LIBCURL=1 -DHAVE_APR_POOLS_H=1 -DHAVE_LIBAPR_1=1 -DHAVE_SVN_VERSION_H=1 -DHAVE_LIBSVN_SUBR_1=1 -DHAVE_SVN_DELTA_H=1 -DHAVE_LIBSVN_DELTA_1=1 -DHAVE_LIBSASL2=1 -DMESOS_HAS_JAVA=1 -DHAVE_PYTHON=\"2.7\" -DMESOS_HAS_PYTHON=1 -I. -I../../src   -Wall -Werror -DLIBDIR=\"/mesos/mesos-0.26.0/_inst/lib\" -DPKGLIBEXECDIR=\"/mesos/mesos-0.26.0/_inst/libexec/mesos\" -DPKGDATADIR=\"/mesos/mesos-0.26.0/_inst/share/mesos\" -I../../include -I../../3rdparty/libprocess/include -I../../3rdparty/libprocess/3rdparty/stout/include -I../include -I../include/mesos -I../3rdparty/libprocess/3rdparty/boost-1.53.0 -I../3rdparty/libprocess/3rdparty/picojson-1.3.0 -DPICOJSON_USE_INT64 -D__STDC_FORMAT_MACROS -I../3rdparty/libprocess/3rdparty/protobuf-2.5.0/src -I../3rdparty/libprocess/3rdparty/glog-0.3.3/src -I../3rdparty/libprocess/3rdparty/glog-0.3.3/src -I../3rdparty/leveldb/include -I../3rdparty/zookeeper-3.4.5/src/c/include -I../3rdparty/zookeeper-3.4.5/src/c/generated -I../3rdparty/libprocess/3rdparty/protobuf-2.5.0/src -DSOURCE_DIR=\"/mesos/mesos-0.26.0/_build/..\" -DBUILD_DIR=\"/mesos/mesos-0.26.0/_build\" -I../3rdparty/libprocess/3rdparty/gmock-1.7.0/gtest/include -I../3rdparty/libprocess/3rdparty/gmock-1.7.0/include -I/usr/lib/jvm/java-1.7.0-openjdk-1.7.0.91-2.6.2.1.el7_1.x86_64/include -I/usr/lib/jvm/java-1.7.0-openjdk-1.7.0.91-2.6.2.1.el7_1.x86_64/include/linux -DZOOKEEPER_VERSION=\"3.4.5\" -I/usr/include/subversion-1 -I/usr/include/apr-1 -I/usr/include/apr-1.0  -pthread -g1 -O0 -Wno-unused-local-typedefs -std=c++11 -MT tests/containerizer/mesos_tests-cgroups_isolator_tests.o -MD -MP -MF tests/containerizer/.deps/mesos_tests-cgroups_isolator_tests.Tpo -c -o tests/containerizer/mesos_tests-cgroups_isolator_tests.o `test -f 'tests/containerizer/cgroups_isolator_tests.cpp' || echo '../../src/'`tests/containerizer/cgroups_isolator_tests.cpp
mv -f tests/containerizer/.deps/mesos_tests-provisioner_backend_tests.Tpo tests/containerizer/.deps/mesos_tests-provisioner_backend_tests.Po
g++ -DPACKAGE_NAME=\"mesos\" -DPACKAGE_TARNAME=\"mesos\" -DPACKAGE_VERSION=\"0.26.0\" -DPACKAGE_STRING=\"mesos\ 0.26.0\" -DPACKAGE_BUGREPORT=\"\" -DPACKAGE_URL=\"\" -DPACKAGE=\"mesos\" -DVERSION=\"0.26.0\" -DSTDC_HEADERS=1 -DHAVE_SYS_TYPES_H=1 -DHAVE_SYS_STAT_H=1 -DHAVE_STDLIB_H=1 -DHAVE_STRING_H=1 -DHAVE_MEMORY_H=1 -DHAVE_STRINGS_H=1 -DHAVE_INTTYPES_H=1 -DHAVE_STDINT_H=1 -DHAVE_UNISTD_H=1 -DHAVE_DLFCN_H=1 -DLT_OBJDIR=\".libs/\" -DHAVE_PTHREAD_PRIO_INHERIT=1 -DHAVE_PTHREAD=1 -DHAVE_LIBZ=1 -DHAVE_LIBCURL=1 -DHAVE_APR_POOLS_H=1 -DHAVE_LIBAPR_1=1 -DHAVE_SVN_VERSION_H=1 -DHAVE_LIBSVN_SUBR_1=1 -DHAVE_SVN_DELTA_H=1 -DHAVE_LIBSVN_DELTA_1=1 -DHAVE_LIBSASL2=1 -DMESOS_HAS_JAVA=1 -DHAVE_PYTHON=\"2.7\" -DMESOS_HAS_PYTHON=1 -I. -I../../src   -Wall -Werror -DLIBDIR=\"/mesos/mesos-0.26.0/_inst/lib\" -DPKGLIBEXECDIR=\"/mesos/mesos-0.26.0/_inst/libexec/mesos\" -DPKGDATADIR=\"/mesos/mesos-0.26.0/_inst/share/mesos\" -I../../include -I../../3rdparty/libprocess/include -I../../3rdparty/libprocess/3rdparty/stout/include -I../include -I../include/mesos -I../3rdparty/libprocess/3rdparty/boost-1.53.0 -I../3rdparty/libprocess/3rdparty/picojson-1.3.0 -DPICOJSON_USE_INT64 -D__STDC_FORMAT_MACROS -I../3rdparty/libprocess/3rdparty/protobuf-2.5.0/src -I../3rdparty/libprocess/3rdparty/glog-0.3.3/src -I../3rdparty/libprocess/3rdparty/glog-0.3.3/src -I../3rdparty/leveldb/include -I../3rdparty/zookeeper-3.4.5/src/c/include -I../3rdparty/zookeeper-3.4.5/src/c/generated -I../3rdparty/libprocess/3rdparty/protobuf-2.5.0/src -DSOURCE_DIR=\"/mesos/mesos-0.26.0/_build/..\" -DBUILD_DIR=\"/mesos/mesos-0.26.0/_build\" -I../3rdparty/libprocess/3rdparty/gmock-1.7.0/gtest/include -I../3rdparty/libprocess/3rdparty/gmock-1.7.0/include -I/usr/lib/jvm/java-1.7.0-openjdk-1.7.0.91-2.6.2.1.el7_1.x86_64/include -I/usr/lib/jvm/java-1.7.0-openjdk-1.7.0.91-2.6.2.1.el7_1.x86_64/include/linux -DZOOKEEPER_VERSION=\"3.4.5\" -I/usr/include/subversion-1 -I/usr/include/apr-1 -I/usr/include/apr-1.0  -pthread -g1 -O0 -Wno-unused-local-typedefs -std=c++11 -MT tests/containerizer/mesos_tests-cgroups_tests.o -MD -MP -MF tests/containerizer/.deps/mesos_tests-cgroups_tests.Tpo -c -o tests/containerizer/mesos_tests-cgroups_tests.o `test -f 'tests/containerizer/cgroups_tests.cpp' || echo '../../src/'`tests/containerizer/cgroups_tests.cpp
mv -f tests/containerizer/.deps/mesos_tests-external_containerizer_test.Tpo tests/containerizer/.deps/mesos_tests-external_containerizer_test.Po
g++ -DPACKAGE_NAME=\"mesos\" -DPACKAGE_TARNAME=\"mesos\" -DPACKAGE_VERSION=\"0.26.0\" -DPACKAGE_STRING=\"mesos\ 0.26.0\" -DPACKAGE_BUGREPORT=\"\" -DPACKAGE_URL=\"\" -DPACKAGE=\"mesos\" -DVERSION=\"0.26.0\" -DSTDC_HEADERS=1 -DHAVE_SYS_TYPES_H=1 -DHAVE_SYS_STAT_H=1 -DHAVE_STDLIB_H=1 -DHAVE_STRING_H=1 -DHAVE_MEMORY_H=1 -DHAVE_STRINGS_H=1 -DHAVE_INTTYPES_H=1 -DHAVE_STDINT_H=1 -DHAVE_UNISTD_H=1 -DHAVE_DLFCN_H=1 -DLT_OBJDIR=\".libs/\" -DHAVE_PTHREAD_PRIO_INHERIT=1 -DHAVE_PTHREAD=1 -DHAVE_LIBZ=1 -DHAVE_LIBCURL=1 -DHAVE_APR_POOLS_H=1 -DHAVE_LIBAPR_1=1 -DHAVE_SVN_VERSION_H=1 -DHAVE_LIBSVN_SUBR_1=1 -DHAVE_SVN_DELTA_H=1 -DHAVE_LIBSVN_DELTA_1=1 -DHAVE_LIBSASL2=1 -DMESOS_HAS_JAVA=1 -DHAVE_PYTHON=\"2.7\" -DMESOS_HAS_PYTHON=1 -I. -I../../src   -Wall -Werror -DLIBDIR=\"/mesos/mesos-0.26.0/_inst/lib\" -DPKGLIBEXECDIR=\"/mesos/mesos-0.26.0/_inst/libexec/mesos\" -DPKGDATADIR=\"/mesos/mesos-0.26.0/_inst/share/mesos\" -I../../include -I../../3rdparty/libprocess/include -I../../3rdparty/libprocess/3rdparty/stout/include -I../include -I../include/mesos -I../3rdparty/libprocess/3rdparty/boost-1.53.0 -I../3rdparty/libprocess/3rdparty/picojson-1.3.0 -DPICOJSON_USE_INT64 -D__STDC_FORMAT_MACROS -I../3rdparty/libprocess/3rdparty/protobuf-2.5.0/src -I../3rdparty/libprocess/3rdparty/glog-0.3.3/src -I../3rdparty/libprocess/3rdparty/glog-0.3.3/src -I../3rdparty/leveldb/include -I../3rdparty/zookeeper-3.4.5/src/c/include -I../3rdparty/zookeeper-3.4.5/src/c/generated -I../3rdparty/libprocess/3rdparty/protobuf-2.5.0/src -DSOURCE_DIR=\"/mesos/mesos-0.26.0/_build/..\" -DBUILD_DIR=\"/mesos/mesos-0.26.0/_build\" -I../3rdparty/libprocess/3rdparty/gmock-1.7.0/gtest/include -I../3rdparty/libprocess/3rdparty/gmock-1.7.0/include -I/usr/lib/jvm/java-1.7.0-openjdk-1.7.0.91-2.6.2.1.el7_1.x86_64/include -I/usr/lib/jvm/java-1.7.0-openjdk-1.7.0.91-2.6.2.1.el7_1.x86_64/include/linux -DZOOKEEPER_VERSION=\"3.4.5\" -I/usr/include/subversion-1 -I/usr/include/apr-1 -I/usr/include/apr-1.0  -pthread -g1 -O0 -Wno-unused-local-typedefs -std=c++11 -MT tests/containerizer/mesos_tests-filesystem_isolator_tests.o -MD -MP -MF tests/containerizer/.deps/mesos_tests-filesystem_isolator_tests.Tpo -c -o tests/containerizer/mesos_tests-filesystem_isolator_tests.o `test -f 'tests/containerizer/filesystem_isolator_tests.cpp' || echo '../../src/'`tests/containerizer/filesystem_isolator_tests.cpp
mv -f tests/containerizer/.deps/mesos_tests-provisioner_appc_tests.Tpo tests/containerizer/.deps/mesos_tests-provisioner_appc_tests.Po
g++ -DPACKAGE_NAME=\"mesos\" -DPACKAGE_TARNAME=\"mesos\" -DPACKAGE_VERSION=\"0.26.0\" -DPACKAGE_STRING=\"mesos\ 0.26.0\" -DPACKAGE_BUGREPORT=\"\" -DPACKAGE_URL=\"\" -DPACKAGE=\"mesos\" -DVERSION=\"0.26.0\" -DSTDC_HEADERS=1 -DHAVE_SYS_TYPES_H=1 -DHAVE_SYS_STAT_H=1 -DHAVE_STDLIB_H=1 -DHAVE_STRING_H=1 -DHAVE_MEMORY_H=1 -DHAVE_STRINGS_H=1 -DHAVE_INTTYPES_H=1 -DHAVE_STDINT_H=1 -DHAVE_UNISTD_H=1 -DHAVE_DLFCN_H=1 -DLT_OBJDIR=\".libs/\" -DHAVE_PTHREAD_PRIO_INHERIT=1 -DHAVE_PTHREAD=1 -DHAVE_LIBZ=1 -DHAVE_LIBCURL=1 -DHAVE_APR_POOLS_H=1 -DHAVE_LIBAPR_1=1 -DHAVE_SVN_VERSION_H=1 -DHAVE_LIBSVN_SUBR_1=1 -DHAVE_SVN_DELTA_H=1 -DHAVE_LIBSVN_DELTA_1=1 -DHAVE_LIBSASL2=1 -DMESOS_HAS_JAVA=1 -DHAVE_PYTHON=\"2.7\" -DMESOS_HAS_PYTHON=1 -I. -I../../src   -Wall -Werror -DLIBDIR=\"/mesos/mesos-0.26.0/_inst/lib\" -DPKGLIBEXECDIR=\"/mesos/mesos-0.26.0/_inst/libexec/mesos\" -DPKGDATADIR=\"/mesos/mesos-0.26.0/_inst/share/mesos\" -I../../include -I../../3rdparty/libprocess/include -I../../3rdparty/libprocess/3rdparty/stout/include -I../include -I../include/mesos -I../3rdparty/libprocess/3rdparty/boost-1.53.0 -I../3rdparty/libprocess/3rdparty/picojson-1.3.0 -DPICOJSON_USE_INT64 -D__STDC_FORMAT_MACROS -I../3rdparty/libprocess/3rdparty/protobuf-2.5.0/src -I../3rdparty/libprocess/3rdparty/glog-0.3.3/src -I../3rdparty/libprocess/3rdparty/glog-0.3.3/src -I../3rdparty/leveldb/include -I../3rdparty/zookeeper-3.4.5/src/c/include -I../3rdparty/zookeeper-3.4.5/src/c/generated -I../3rdparty/libprocess/3rdparty/protobuf-2.5.0/src -DSOURCE_DIR=\"/mesos/mesos-0.26.0/_build/..\" -DBUILD_DIR=\"/mesos/mesos-0.26.0/_build\" -I../3rdparty/libprocess/3rdparty/gmock-1.7.0/gtest/include -I../3rdparty/libprocess/3rdparty/gmock-1.7.0/include -I/usr/lib/jvm/java-1.7.0-openjdk-1.7.0.91-2.6.2.1.el7_1.x86_64/include -I/usr/lib/jvm/java-1.7.0-openjdk-1.7.0.91-2.6.2.1.el7_1.x86_64/include/linux -DZOOKEEPER_VERSION=\"3.4.5\" -I/usr/include/subversion-1 -I/usr/include/apr-1 -I/usr/include/apr-1.0  -pthread -g1 -O0 -Wno-unused-local-typedefs -std=c++11 -MT tests/containerizer/mesos_tests-fs_tests.o -MD -MP -MF tests/containerizer/.deps/mesos_tests-fs_tests.Tpo -c -o tests/containerizer/mesos_tests-fs_tests.o `test -f 'tests/containerizer/fs_tests.cpp' || echo '../../src/'`tests/containerizer/fs_tests.cpp
../../src/tests/containerizer/filesystem_isolator_tests.cpp:59:41: fatal error: tests/containerizer/store.hpp: No such file or directory
 #include "tests/containerizer/store.hpp"
                                         ^
compilation terminated.
mv -f tests/containerizer/.deps/mesos_tests-cgroups_isolator_tests.Tpo tests/containerizer/.deps/mesos_tests-cgroups_isolator_tests.Po
g++ -DPACKAGE_NAME=\"mesos\" -DPACKAGE_TARNAME=\"mesos\" -DPACKAGE_VERSION=\"0.26.0\" -DPACKAGE_STRING=\"mesos\ 0.26.0\" -DPACKAGE_BUGREPORT=\"\" -DPACKAGE_URL=\"\" -DPACKAGE=\"mesos\" -DVERSION=\"0.26.0\" -DSTDC_HEADERS=1 -DHAVE_SYS_TYPES_H=1 -DHAVE_SYS_STAT_H=1 -DHAVE_STDLIB_H=1 -DHAVE_STRING_H=1 -DHAVE_MEMORY_H=1 -DHAVE_STRINGS_H=1 -DHAVE_INTTYPES_H=1 -DHAVE_STDINT_H=1 -DHAVE_UNISTD_H=1 -DHAVE_DLFCN_H=1 -DLT_OBJDIR=\".libs/\" -DHAVE_PTHREAD_PRIO_INHERIT=1 -DHAVE_PTHREAD=1 -DHAVE_LIBZ=1 -DHAVE_LIBCURL=1 -DHAVE_APR_POOLS_H=1 -DHAVE_LIBAPR_1=1 -DHAVE_SVN_VERSION_H=1 -DHAVE_LIBSVN_SUBR_1=1 -DHAVE_SVN_DELTA_H=1 -DHAVE_LIBSVN_DELTA_1=1 -DHAVE_LIBSASL2=1 -DMESOS_HAS_JAVA=1 -DHAVE_PYTHON=\"2.7\" -DMESOS_HAS_PYTHON=1 -I. -I../../src   -Wall -Werror -DLIBDIR=\"/mesos/mesos-0.26.0/_inst/lib\" -DPKGLIBEXECDIR=\"/mesos/mesos-0.26.0/_inst/libexec/mesos\" -DPKGDATADIR=\"/mesos/mesos-0.26.0/_inst/share/mesos\" -I../../include -I../../3rdparty/libprocess/include -I../../3rdparty/libprocess/3rdparty/stout/include -I../include -I../include/mesos -I../3rdparty/libprocess/3rdparty/boost-1.53.0 -I../3rdparty/libprocess/3rdparty/picojson-1.3.0 -DPICOJSON_USE_INT64 -D__STDC_FORMAT_MACROS -I../3rdparty/libprocess/3rdparty/protobuf-2.5.0/src -I../3rdparty/libprocess/3rdparty/glog-0.3.3/src -I../3rdparty/libprocess/3rdparty/glog-0.3.3/src -I../3rdparty/leveldb/include -I../3rdparty/zookeeper-3.4.5/src/c/include -I../3rdparty/zookeeper-3.4.5/src/c/generated -I../3rdparty/libprocess/3rdparty/protobuf-2.5.0/src -DSOURCE_DIR=\"/mesos/mesos-0.26.0/_build/..\" -DBUILD_DIR=\"/mesos/mesos-0.26.0/_build\" -I../3rdparty/libprocess/3rdparty/gmock-1.7.0/gtest/include -I../3rdparty/libprocess/3rdparty/gmock-1.7.0/include -I/usr/lib/jvm/java-1.7.0-openjdk-1.7.0.91-2.6.2.1.el7_1.x86_64/include -I/usr/lib/jvm/java-1.7.0-openjdk-1.7.0.91-2.6.2.1.el7_1.x86_64/include/linux -DZOOKEEPER_VERSION=\"3.4.5\" -I/usr/include/subversion-1 -I/usr/include/apr-1 -I/usr/include/apr-1.0  -pthread -g1 -O0 -Wno-unused-local-typedefs -std=c++11 -MT tests/containerizer/mesos_tests-launch_tests.o -MD -MP -MF tests/containerizer/.deps/mesos_tests-launch_tests.Tpo -c -o tests/containerizer/mesos_tests-launch_tests.o `test -f 'tests/containerizer/launch_tests.cpp' || echo '../../src/'`tests/containerizer/launch_tests.cpp
mv -f tests/containerizer/.deps/mesos_tests-docker_containerizer_tests.Tpo tests/containerizer/.deps/mesos_tests-docker_containerizer_tests.Po
g++ -DPACKAGE_NAME=\"mesos\" -DPACKAGE_TARNAME=\"mesos\" -DPACKAGE_VERSION=\"0.26.0\" -DPACKAGE_STRING=\"mesos\ 0.26.0\" -DPACKAGE_BUGREPORT=\"\" -DPACKAGE_URL=\"\" -DPACKAGE=\"mesos\" -DVERSION=\"0.26.0\" -DSTDC_HEADERS=1 -DHAVE_SYS_TYPES_H=1 -DHAVE_SYS_STAT_H=1 -DHAVE_STDLIB_H=1 -DHAVE_STRING_H=1 -DHAVE_MEMORY_H=1 -DHAVE_STRINGS_H=1 -DHAVE_INTTYPES_H=1 -DHAVE_STDINT_H=1 -DHAVE_UNISTD_H=1 -DHAVE_DLFCN_H=1 -DLT_OBJDIR=\".libs/\" -DHAVE_PTHREAD_PRIO_INHERIT=1 -DHAVE_PTHREAD=1 -DHAVE_LIBZ=1 -DHAVE_LIBCURL=1 -DHAVE_APR_POOLS_H=1 -DHAVE_LIBAPR_1=1 -DHAVE_SVN_VERSION_H=1 -DHAVE_LIBSVN_SUBR_1=1 -DHAVE_SVN_DELTA_H=1 -DHAVE_LIBSVN_DELTA_1=1 -DHAVE_LIBSASL2=1 -DMESOS_HAS_JAVA=1 -DHAVE_PYTHON=\"2.7\" -DMESOS_HAS_PYTHON=1 -I. -I../../src   -Wall -Werror -DLIBDIR=\"/mesos/mesos-0.26.0/_inst/lib\" -DPKGLIBEXECDIR=\"/mesos/mesos-0.26.0/_inst/libexec/mesos\" -DPKGDATADIR=\"/mesos/mesos-0.26.0/_inst/share/mesos\" -I../../include -I../../3rdparty/libprocess/include -I../../3rdparty/libprocess/3rdparty/stout/include -I../include -I../include/mesos -I../3rdparty/libprocess/3rdparty/boost-1.53.0 -I../3rdparty/libprocess/3rdparty/picojson-1.3.0 -DPICOJSON_USE_INT64 -D__STDC_FORMAT_MACROS -I../3rdparty/libprocess/3rdparty/protobuf-2.5.0/src -I../3rdparty/libprocess/3rdparty/glog-0.3.3/src -I../3rdparty/libprocess/3rdparty/glog-0.3.3/src -I../3rdparty/leveldb/include -I../3rdparty/zookeeper-3.4.5/src/c/include -I../3rdparty/zookeeper-3.4.5/src/c/generated -I../3rdparty/libprocess/3rdparty/protobuf-2.5.0/src -DSOURCE_DIR=\"/mesos/mesos-0.26.0/_build/..\" -DBUILD_DIR=\"/mesos/mesos-0.26.0/_build\" -I../3rdparty/libprocess/3rdparty/gmock-1.7.0/gtest/include -I../3rdparty/libprocess/3rdparty/gmock-1.7.0/include -I/usr/lib/jvm/java-1.7.0-openjdk-1.7.0.91-2.6.2.1.el7_1.x86_64/include -I/usr/lib/jvm/java-1.7.0-openjdk-1.7.0.91-2.6.2.1.el7_1.x86_64/include/linux -DZOOKEEPER_VERSION=\"3.4.5\" -I/usr/include/subversion-1 -I/usr/include/apr-1 -I/usr/include/apr-1.0  -pthread -g1 -O0 -Wno-unused-local-typedefs -std=c++11 -MT tests/containerizer/mesos_tests-memory_pressure_tests.o -MD -MP -MF tests/containerizer/.deps/mesos_tests-memory_pressure_tests.Tpo -c -o tests/containerizer/mesos_tests-memory_pressure_tests.o `test -f 'tests/containerizer/memory_pressure_tests.cpp' || echo '../../src/'`tests/containerizer/memory_pressure_tests.cpp
mv -f tests/containerizer/.deps/mesos_tests-isolator_tests.Tpo tests/containerizer/.deps/mesos_tests-isolator_tests.Po
g++ -DPACKAGE_NAME=\"mesos\" -DPACKAGE_TARNAME=\"mesos\" -DPACKAGE_VERSION=\"0.26.0\" -DPACKAGE_STRING=\"mesos\ 0.26.0\" -DPACKAGE_BUGREPORT=\"\" -DPACKAGE_URL=\"\" -DPACKAGE=\"mesos\" -DVERSION=\"0.26.0\" -DSTDC_HEADERS=1 -DHAVE_SYS_TYPES_H=1 -DHAVE_SYS_STAT_H=1 -DHAVE_STDLIB_H=1 -DHAVE_STRING_H=1 -DHAVE_MEMORY_H=1 -DHAVE_STRINGS_H=1 -DHAVE_INTTYPES_H=1 -DHAVE_STDINT_H=1 -DHAVE_UNISTD_H=1 -DHAVE_DLFCN_H=1 -DLT_OBJDIR=\".libs/\" -DHAVE_PTHREAD_PRIO_INHERIT=1 -DHAVE_PTHREAD=1 -DHAVE_LIBZ=1 -DHAVE_LIBCURL=1 -DHAVE_APR_POOLS_H=1 -DHAVE_LIBAPR_1=1 -DHAVE_SVN_VERSION_H=1 -DHAVE_LIBSVN_SUBR_1=1 -DHAVE_SVN_DELTA_H=1 -DHAVE_LIBSVN_DELTA_1=1 -DHAVE_LIBSASL2=1 -DMESOS_HAS_JAVA=1 -DHAVE_PYTHON=\"2.7\" -DMESOS_HAS_PYTHON=1 -I. -I../../src   -Wall -Werror -DLIBDIR=\"/mesos/mesos-0.26.0/_inst/lib\" -DPKGLIBEXECDIR=\"/mesos/mesos-0.26.0/_inst/libexec/mesos\" -DPKGDATADIR=\"/mesos/mesos-0.26.0/_inst/share/mesos\" -I../../include -I../../3rdparty/libprocess/include -I../../3rdparty/libprocess/3rdparty/stout/include -I../include -I../include/mesos -I../3rdparty/libprocess/3rdparty/boost-1.53.0 -I../3rdparty/libprocess/3rdparty/picojson-1.3.0 -DPICOJSON_USE_INT64 -D__STDC_FORMAT_MACROS -I../3rdparty/libprocess/3rdparty/protobuf-2.5.0/src -I../3rdparty/libprocess/3rdparty/glog-0.3.3/src -I../3rdparty/libprocess/3rdparty/glog-0.3.3/src -I../3rdparty/leveldb/include -I../3rdparty/zookeeper-3.4.5/src/c/include -I../3rdparty/zookeeper-3.4.5/src/c/generated -I../3rdparty/libprocess/3rdparty/protobuf-2.5.0/src -DSOURCE_DIR=\"/mesos/mesos-0.26.0/_build/..\" -DBUILD_DIR=\"/mesos/mesos-0.26.0/_build\" -I../3rdparty/libprocess/3rdparty/gmock-1.7.0/gtest/include -I../3rdparty/libprocess/3rdparty/gmock-1.7.0/include -I/usr/lib/jvm/java-1.7.0-openjdk-1.7.0.91-2.6.2.1.el7_1.x86_64/include -I/usr/lib/jvm/java-1.7.0-openjdk-1.7.0.91-2.6.2.1.el7_1.x86_64/include/linux -DZOOKEEPER_VERSION=\"3.4.5\" -I/usr/include/subversion-1 -I/usr/include/apr-1 -I/usr/include/apr-1.0  -pthread -g1 -O0 -Wno-unused-local-typedefs -std=c++11 -MT tests/containerizer/mesos_tests-ns_tests.o -MD -MP -MF tests/containerizer/.deps/mesos_tests-ns_tests.Tpo -c -o tests/containerizer/mesos_tests-ns_tests.o `test -f 'tests/containerizer/ns_tests.cpp' || echo '../../src/'`tests/containerizer/ns_tests.cpp
mv -f tests/containerizer/.deps/mesos_tests-fs_tests.Tpo tests/containerizer/.deps/mesos_tests-fs_tests.Po
g++ -DPACKAGE_NAME=\"mesos\" -DPACKAGE_TARNAME=\"mesos\" -DPACKAGE_VERSION=\"0.26.0\" -DPACKAGE_STRING=\"mesos\ 0.26.0\" -DPACKAGE_BUGREPORT=\"\" -DPACKAGE_URL=\"\" -DPACKAGE=\"mesos\" -DVERSION=\"0.26.0\" -DSTDC_HEADERS=1 -DHAVE_SYS_TYPES_H=1 -DHAVE_SYS_STAT_H=1 -DHAVE_STDLIB_H=1 -DHAVE_STRING_H=1 -DHAVE_MEMORY_H=1 -DHAVE_STRINGS_H=1 -DHAVE_INTTYPES_H=1 -DHAVE_STDINT_H=1 -DHAVE_UNISTD_H=1 -DHAVE_DLFCN_H=1 -DLT_OBJDIR=\".libs/\" -DHAVE_PTHREAD_PRIO_INHERIT=1 -DHAVE_PTHREAD=1 -DHAVE_LIBZ=1 -DHAVE_LIBCURL=1 -DHAVE_APR_POOLS_H=1 -DHAVE_LIBAPR_1=1 -DHAVE_SVN_VERSION_H=1 -DHAVE_LIBSVN_SUBR_1=1 -DHAVE_SVN_DELTA_H=1 -DHAVE_LIBSVN_DELTA_1=1 -DHAVE_LIBSASL2=1 -DMESOS_HAS_JAVA=1 -DHAVE_PYTHON=\"2.7\" -DMESOS_HAS_PYTHON=1 -I. -I../../src   -Wall -Werror -DLIBDIR=\"/mesos/mesos-0.26.0/_inst/lib\" -DPKGLIBEXECDIR=\"/mesos/mesos-0.26.0/_inst/libexec/mesos\" -DPKGDATADIR=\"/mesos/mesos-0.26.0/_inst/share/mesos\" -I../../include -I../../3rdparty/libprocess/include -I../../3rdparty/libprocess/3rdparty/stout/include -I../include -I../include/mesos -I../3rdparty/libprocess/3rdparty/boost-1.53.0 -I../3rdparty/libprocess/3rdparty/picojson-1.3.0 -DPICOJSON_USE_INT64 -D__STDC_FORMAT_MACROS -I../3rdparty/libprocess/3rdparty/protobuf-2.5.0/src -I../3rdparty/libprocess/3rdparty/glog-0.3.3/src -I../3rdparty/libprocess/3rdparty/glog-0.3.3/src -I../3rdparty/leveldb/include -I../3rdparty/zookeeper-3.4.5/src/c/include -I../3rdparty/zookeeper-3.4.5/src/c/generated -I../3rdparty/libprocess/3rdparty/protobuf-2.5.0/src -DSOURCE_DIR=\"/mesos/mesos-0.26.0/_build/..\" -DBUILD_DIR=\"/mesos/mesos-0.26.0/_build\" -I../3rdparty/libprocess/3rdparty/gmock-1.7.0/gtest/include -I../3rdparty/libprocess/3rdparty/gmock-1.7.0/include -I/usr/lib/jvm/java-1.7.0-openjdk-1.7.0.91-2.6.2.1.el7_1.x86_64/include -I/usr/lib/jvm/java-1.7.0-openjdk-1.7.0.91-2.6.2.1.el7_1.x86_64/include/linux -DZOOKEEPER_VERSION=\"3.4.5\" -I/usr/include/subversion-1 -I/usr/include/apr-1 -I/usr/include/apr-1.0  -pthread -g1 -O0 -Wno-unused-local-typedefs -std=c++11 -MT tests/containerizer/mesos_tests-perf_tests.o -MD -MP -MF tests/containerizer/.deps/mesos_tests-perf_tests.Tpo -c -o tests/containerizer/mesos_tests-perf_tests.o `test -f 'tests/containerizer/perf_tests.cpp' || echo '../../src/'`tests/containerizer/perf_tests.cpp
make[4]: *** [tests/containerizer/mesos_tests-filesystem_isolator_tests.o] Error 1
make[4]: *** Waiting for unfinished jobs....
mv -f tests/containerizer/.deps/mesos_tests-perf_tests.Tpo tests/containerizer/.deps/mesos_tests-perf_tests.Po
mv -f tests/containerizer/.deps/mesos_tests-launch_tests.Tpo tests/containerizer/.deps/mesos_tests-launch_tests.Po
mv -f tests/containerizer/.deps/mesos_tests-ns_tests.Tpo tests/containerizer/.deps/mesos_tests-ns_tests.Po
mv -f tests/containerizer/.deps/mesos_tests-mesos_containerizer_tests.Tpo tests/containerizer/.deps/mesos_tests-mesos_containerizer_tests.Po
mv -f tests/containerizer/.deps/mesos_tests-provisioner_docker_tests.Tpo tests/containerizer/.deps/mesos_tests-provisioner_docker_tests.Po
mv -f tests/containerizer/.deps/mesos_tests-cgroups_tests.Tpo tests/containerizer/.deps/mesos_tests-cgroups_tests.Po
mv -f tests/containerizer/.deps/mesos_tests-memory_pressure_tests.Tpo tests/containerizer/.deps/mesos_tests-memory_pressure_tests.Po
make[4]: Leaving directory `/mesos/mesos-0.26.0/_build/src'
make[3]: *** [check-am] Error 2
make[3]: Leaving directory `/mesos/mesos-0.26.0/_build/src'
make[2]: *** [check] Error 2
make[2]: Leaving directory `/mesos/mesos-0.26.0/_build/src'
make[1]: *** [check-recursive] Error 1
make[1]: Leaving directory `/mesos/mesos-0.26.0/_build'
make: *** [distcheck] Error 1
+ docker rmi mesos-1446807694-22495
Untagged: mesos-1446807694-22495:latest
Deleted: 667953bcba9e135c27d51d70d450c3a75729597d7e661869ef1eed290bdcd573
Deleted: 0f5c3f469844b87923bf5f924ac5ee3c336fdc0f733182fdfb13470415f697cb
Deleted: 352b20c957699ede0fcbb3328530440f8050499bab4cee98efbc63eee16fc753
Deleted: 213a08577da1a00106d0178b84285964f81b01ea4b70d6298278ed4d1d200f31
Deleted: a853666f635959f1aacf130eaecfd002795d81f1ada136afd71c3296da19936b
Deleted: a3cd840924f01866814f2d7716729474d54b5e71a376bfb68dc1e7c30ef67bcd
Deleted: 45c3a5043db3f01cc7a356bd588d8e34913b7fae842c9d8f95364db38eccd68e
Deleted: bc55b9786e150de2c18f3d382cc4a21ad653ab1c864460fd50589b94db50168c
Deleted: 7b858c0a20dd538dafae6db4c0a2cfffc1829ec2bea83b21c8702d57ef577e26
Deleted: b76304269d35df73e6bb811fd99d774aa8bd6e1bc5284704d580fa8742a69651
Deleted: d1a3e219c2e578ae0bb04b1311e3686635ef37b747ba7f250b27a5507be457ec
Deleted: 04ba8de0f6c208ecc4eb156b78af48151a332ca9b6528a104f46b3e6acbfc265
Build step 'Execute shell' marked build as failure

Mime
View raw message