mesos-builds mailing list archives

Site index · List index
Message view « Date » · « Thread »
Top « Date » · « Thread »
From Apache Jenkins Server <jenk...@builds.apache.org>
Subject Build failed in Jenkins: mesos-reviewbot #9754
Date Wed, 18 Nov 2015 16:00:23 GMT
See <https://builds.apache.org/job/mesos-reviewbot/9754/changes>

Changes:

[benjamin.mahler] Added const qualifiers to ProcessReference operators.

[benjamin.mahler] Introduced an Authenticator interface and an AuthenticationRouter in

------------------------------------------
[...truncated 150392 lines...]
I1118 16:00:03.617337 29887 leveldb.cpp:306] Persisting metadata (8 bytes) to leveldb took
32.363124ms
I1118 16:00:03.617421 29887 replica.cpp:323] Persisted replica status to VOTING
I1118 16:00:03.617691 29878 recover.cpp:580] Successfully joined the Paxos group
I1118 16:00:03.618062 29878 recover.cpp:464] Recover process terminated
I1118 16:00:03.618665 29885 log.cpp:661] Attempting to start the writer
I1118 16:00:03.619979 29883 replica.cpp:496] Replica received implicit promise request from
(10541)@172.17.16.231:33540 with proposal 1
I1118 16:00:03.667263 29883 leveldb.cpp:306] Persisting metadata (8 bytes) to leveldb took
47.180457ms
I1118 16:00:03.667351 29883 replica.cpp:345] Persisted promised to 1
I1118 16:00:03.668694 29883 coordinator.cpp:240] Coordinator attempting to fill missing positions
I1118 16:00:03.671097 29885 replica.cpp:391] Replica received explicit promise request from
(10542)@172.17.16.231:33540 for position 0 with proposal 2
I1118 16:00:03.709444 29885 leveldb.cpp:343] Persisting action (8 bytes) to leveldb took 38.251658ms
I1118 16:00:03.709530 29885 replica.cpp:715] Persisted action at 0
I1118 16:00:03.711133 29885 replica.cpp:540] Replica received write request for position 0
from (10543)@172.17.16.231:33540
I1118 16:00:03.711367 29885 leveldb.cpp:438] Reading position from leveldb took 40479ns
I1118 16:00:03.760262 29885 leveldb.cpp:343] Persisting action (14 bytes) to leveldb took
48.764349ms
I1118 16:00:03.760354 29885 replica.cpp:715] Persisted action at 0
I1118 16:00:03.761404 29888 replica.cpp:694] Replica received learned notice for position
0 from @0.0.0.0:0
I1118 16:00:03.789692 29888 leveldb.cpp:343] Persisting action (16 bytes) to leveldb took
28.225276ms
I1118 16:00:03.789773 29888 replica.cpp:715] Persisted action at 0
I1118 16:00:03.789803 29888 replica.cpp:700] Replica learned NOP action at position 0
I1118 16:00:03.790630 29873 log.cpp:677] Writer started with ending position 0
I1118 16:00:03.791843 29887 leveldb.cpp:438] Reading position from leveldb took 56492ns
I1118 16:00:03.792876 29886 registrar.cpp:342] Successfully fetched the registry (0B) in 292.897792ms
I1118 16:00:03.793036 29886 registrar.cpp:441] Applied 1 operations in 44810ns; attempting
to update the 'registry'
I1118 16:00:03.793751 29887 log.cpp:685] Attempting to append 178 bytes to the log
I1118 16:00:03.793915 29875 coordinator.cpp:350] Coordinator attempting to write APPEND action
at position 1
I1118 16:00:03.794750 29886 replica.cpp:540] Replica received write request for position 1
from (10544)@172.17.16.231:33540
I1118 16:00:03.828117 29886 leveldb.cpp:343] Persisting action (197 bytes) to leveldb took
33.29776ms
I1118 16:00:03.828212 29886 replica.cpp:715] Persisted action at 1
I1118 16:00:03.829279 29885 replica.cpp:694] Replica received learned notice for position
1 from @0.0.0.0:0
I1118 16:00:03.885087 29885 leveldb.cpp:343] Persisting action (199 bytes) to leveldb took
55.748711ms
I1118 16:00:03.885182 29885 replica.cpp:715] Persisted action at 1
I1118 16:00:03.885217 29885 replica.cpp:700] Replica learned APPEND action at position 1
I1118 16:00:03.892665 29873 registrar.cpp:486] Successfully updated the 'registry' in 99.556864ms
I1118 16:00:03.892899 29873 registrar.cpp:372] Successfully recovered registrar
I1118 16:00:03.892984 29883 log.cpp:704] Attempting to truncate the log to 1
I1118 16:00:03.893192 29873 coordinator.cpp:350] Coordinator attempting to write TRUNCATE
action at position 2
I1118 16:00:03.894254 29879 replica.cpp:540] Replica received write request for position 2
from (10545)@172.17.16.231:33540
I1118 16:00:03.894618 29883 master.cpp:1422] Recovered 0 slaves from the Registry (139B) ;
allowing 10mins for slaves to re-register
I1118 16:00:03.927430 29879 leveldb.cpp:343] Persisting action (16 bytes) to leveldb took
33.107411ms
I1118 16:00:03.927521 29879 replica.cpp:715] Persisted action at 2
I1118 16:00:03.928939 29879 replica.cpp:694] Replica received learned notice for position
2 from @0.0.0.0:0
I1118 16:00:03.969422 29879 leveldb.cpp:343] Persisting action (18 bytes) to leveldb took
40.422561ms
I1118 16:00:03.969727 29879 leveldb.cpp:401] Deleting ~1 keys from leveldb took 66121ns
I1118 16:00:03.969769 29879 replica.cpp:715] Persisted action at 2
I1118 16:00:03.969804 29879 replica.cpp:700] Replica learned TRUNCATE action at position 2
I1118 16:00:03.976311 29854 scheduler.cpp:156] Version: 0.26.0
I1118 16:00:03.977020 29876 scheduler.cpp:238] New master detected at master@172.17.16.231:33540
I1118 16:00:03.978212 29877 scheduler.cpp:300] Sending SUBSCRIBE call to master@172.17.16.231:33540
I1118 16:00:03.980453 29878 process.cpp:3155] Handling HTTP event for process 'master' with
path: '/master/api/v1/scheduler'
I1118 16:00:03.980514 29878 http.cpp:338] HTTP POST for /master/api/v1/scheduler from 172.17.16.231:51772
I1118 16:00:03.980710 29878 master.cpp:1874] Received subscription request for HTTP framework
'default'
I1118 16:00:03.980778 29878 master.cpp:1651] Authorizing framework principal 'test-principal'
to receive offers for role '*'
I1118 16:00:03.981184 29888 master.cpp:1966] Subscribing framework 'default' with checkpointing
disabled and capabilities [  ]
I1118 16:00:03.981601 29878 hierarchical.cpp:197] Added framework 6c5b655a-17de-4d78-85eb-27936fa6eb0c-0000
I1118 16:00:03.981609 29881 master.hpp:1522] Sending heartbeat to 6c5b655a-17de-4d78-85eb-27936fa6eb0c-0000
I1118 16:00:03.981667 29878 hierarchical.cpp:979] No resources available to allocate!
I1118 16:00:03.981699 29878 hierarchical.cpp:1072] No inverse offers to send out!
I1118 16:00:03.981721 29878 hierarchical.cpp:878] Performed allocation for 0 slaves in 93943ns
I1118 16:00:03.983733 29878 scheduler.cpp:459] Enqueuing event SUBSCRIBED received from master@172.17.16.231:33540
I1118 16:00:03.984508 29887 scheduler.cpp:459] Enqueuing event HEARTBEAT received from master@172.17.16.231:33540
I1118 16:00:03.985411 29882 master_maintenance_tests.cpp:174] Ignoring HEARTBEAT event
I1118 16:00:03.985519 29887 scheduler.cpp:300] Sending REQUEST call to master@172.17.16.231:33540
I1118 16:00:03.988428 29884 process.cpp:3155] Handling HTTP event for process 'master' with
path: '/master/api/v1/scheduler'
I1118 16:00:03.988503 29884 http.cpp:338] HTTP POST for /master/api/v1/scheduler from 172.17.16.231:51774
I1118 16:00:03.988651 29884 master.cpp:2621] Processing REQUEST call for framework 6c5b655a-17de-4d78-85eb-27936fa6eb0c-0000
(default)
I1118 16:00:03.988812 29880 hierarchical.cpp:460] Received resource request from framework
6c5b655a-17de-4d78-85eb-27936fa6eb0c-0000
I1118 16:00:03.989228 29884 master.cpp:928] Master terminating
I1118 16:00:03.989418 29876 hierarchical.cpp:232] Removed framework 6c5b655a-17de-4d78-85eb-27936fa6eb0c-0000
E1118 16:00:03.990711 29880 scheduler.cpp:433] End-Of-File received from master. The master
closed the event stream
[       OK ] ContentType/SchedulerTest.Request/0 (743 ms)
[ RUN      ] ContentType/SchedulerTest.Request/1
I1118 16:00:04.213714 29854 leveldb.cpp:176] Opened db in 173.057612ms
I1118 16:00:04.247475 29854 leveldb.cpp:183] Compacted db in 33.534481ms
I1118 16:00:04.247900 29854 leveldb.cpp:198] Created db iterator in 171654ns
I1118 16:00:04.248106 29854 leveldb.cpp:204] Seeked to beginning of db in 5710ns
I1118 16:00:04.248333 29854 leveldb.cpp:273] Iterated through 0 keys in the db in 534ns
I1118 16:00:04.248456 29854 replica.cpp:780] Replica recovered with log positions 0 ->
0 with 1 holes and 0 unlearned
I1118 16:00:04.249243 29886 recover.cpp:449] Starting replica recovery
I1118 16:00:04.249706 29886 recover.cpp:475] Replica is in EMPTY status
I1118 16:00:04.252246 29881 master.cpp:367] Master 939b0c36-c4f1-4361-b684-8d48a15ba298 (6f8ff2f712dd)
started on 172.17.16.231:33540
I1118 16:00:04.252653 29881 master.cpp:369] Flags at startup: --acls="" --allocation_interval="1secs"
--allocator="HierarchicalDRF" --authenticate="false" --authenticate_slaves="true" --authenticators="crammd5"
--authorizers="local" --credentials="/tmp/bLneNW/credentials" --framework_sorter="drf" --help="false"
--hostname_lookup="true" --initialize_driver_logging="true" --log_auto_initialize="true" --logbufsecs="0"
--logging_level="INFO" --max_slave_ping_timeouts="5" --quiet="false" --recovery_slave_removal_limit="100%"
--registry="replicated_log" --registry_fetch_timeout="1mins" --registry_store_timeout="25secs"
--registry_strict="true" --root_submissions="true" --slave_ping_timeout="15secs" --slave_reregister_timeout="10mins"
--user_sorter="drf" --version="false" --webui_dir="/mesos/mesos-0.26.0/_inst/share/mesos/webui"
--work_dir="/tmp/bLneNW/master" --zk_session_timeout="10secs"
I1118 16:00:04.253202 29881 master.cpp:416] Master allowing unauthenticated frameworks to
register
I1118 16:00:04.253334 29881 master.cpp:419] Master only allowing authenticated slaves to register
I1118 16:00:04.253444 29881 credentials.hpp:37] Loading credentials for authentication from
'/tmp/bLneNW/credentials'
I1118 16:00:04.254338 29878 replica.cpp:676] Replica in EMPTY status received a broadcasted
recover request from (10550)@172.17.16.231:33540
I1118 16:00:04.255038 29881 master.cpp:458] Using default 'crammd5' authenticator
I1118 16:00:04.255225 29878 recover.cpp:195] Received a recover response from a replica in
EMPTY status
I1118 16:00:04.255349 29881 master.cpp:495] Authorization enabled
I1118 16:00:04.255972 29884 hierarchical.cpp:153] Initialized hierarchical allocator process
I1118 16:00:04.256098 29884 recover.cpp:566] Updating replica status to STARTING
I1118 16:00:04.256223 29887 whitelist_watcher.cpp:79] No whitelist given
I1118 16:00:04.259855 29873 master.cpp:1612] The newly elected leader is master@172.17.16.231:33540
with id 939b0c36-c4f1-4361-b684-8d48a15ba298
I1118 16:00:04.260099 29873 master.cpp:1625] Elected as the leading master!
I1118 16:00:04.260211 29873 master.cpp:1385] Recovering from registrar
I1118 16:00:04.260622 29873 registrar.cpp:309] Recovering registrar
I1118 16:00:04.284458 29884 leveldb.cpp:306] Persisting metadata (8 bytes) to leveldb took
27.948911ms
I1118 16:00:04.284642 29884 replica.cpp:323] Persisted replica status to STARTING
I1118 16:00:04.285085 29884 recover.cpp:475] Replica is in STARTING status
I1118 16:00:04.286412 29879 replica.cpp:676] Replica in STARTING status received a broadcasted
recover request from (10551)@172.17.16.231:33540
I1118 16:00:04.287134 29881 recover.cpp:195] Received a recover response from a replica in
STARTING status
I1118 16:00:04.287839 29879 recover.cpp:566] Updating replica status to VOTING
I1118 16:00:04.309798 29884 leveldb.cpp:306] Persisting metadata (8 bytes) to leveldb took
21.689238ms
I1118 16:00:04.309877 29884 replica.cpp:323] Persisted replica status to VOTING
I1118 16:00:04.310091 29879 recover.cpp:580] Successfully joined the Paxos group
I1118 16:00:04.310354 29879 recover.cpp:464] Recover process terminated
I1118 16:00:04.310904 29884 log.cpp:661] Attempting to start the writer
I1118 16:00:04.312394 29886 replica.cpp:496] Replica received implicit promise request from
(10552)@172.17.16.231:33540 with proposal 1
I1118 16:00:04.335074 29886 leveldb.cpp:306] Persisting metadata (8 bytes) to leveldb took
22.620571ms
I1118 16:00:04.335155 29886 replica.cpp:345] Persisted promised to 1
I1118 16:00:04.336398 29886 coordinator.cpp:240] Coordinator attempting to fill missing positions
I1118 16:00:04.338098 29881 replica.cpp:391] Replica received explicit promise request from
(10553)@172.17.16.231:33540 for position 0 with proposal 2
I1118 16:00:04.360199 29881 leveldb.cpp:343] Persisting action (8 bytes) to leveldb took 22.009076ms
I1118 16:00:04.360283 29881 replica.cpp:715] Persisted action at 0
I1118 16:00:04.362100 29888 replica.cpp:540] Replica received write request for position 0
from (10554)@172.17.16.231:33540
I1118 16:00:04.362519 29888 leveldb.cpp:438] Reading position from leveldb took 119580ns
I1118 16:00:04.385431 29888 leveldb.cpp:343] Persisting action (14 bytes) to leveldb took
22.549944ms
I1118 16:00:04.385911 29888 replica.cpp:715] Persisted action at 0
I1118 16:00:04.387224 29873 replica.cpp:694] Replica received learned notice for position
0 from @0.0.0.0:0
I1118 16:00:04.413362 29873 leveldb.cpp:343] Persisting action (16 bytes) to leveldb took
26.062236ms
I1118 16:00:04.413455 29873 replica.cpp:715] Persisted action at 0
I1118 16:00:04.413493 29873 replica.cpp:700] Replica learned NOP action at position 0
I1118 16:00:04.414340 29887 log.cpp:677] Writer started with ending position 0
I1118 16:00:04.415544 29874 leveldb.cpp:438] Reading position from leveldb took 56100ns
I1118 16:00:04.416545 29874 registrar.cpp:342] Successfully fetched the registry (0B) in 155.805952ms
I1118 16:00:04.416681 29874 registrar.cpp:441] Applied 1 operations in 41592ns; attempting
to update the 'registry'
I1118 16:00:04.417647 29886 log.cpp:685] Attempting to append 178 bytes to the log
I1118 16:00:04.417781 29888 coordinator.cpp:350] Coordinator attempting to write APPEND action
at position 1
I1118 16:00:04.418508 29879 replica.cpp:540] Replica received write request for position 1
from (10555)@172.17.16.231:33540
I1118 16:00:04.456259 29879 leveldb.cpp:343] Persisting action (197 bytes) to leveldb took
37.687445ms
I1118 16:00:04.456343 29879 replica.cpp:715] Persisted action at 1
I1118 16:00:04.457440 29887 replica.cpp:694] Replica received learned notice for position
1 from @0.0.0.0:0
I1118 16:00:04.497449 29887 leveldb.cpp:343] Persisting action (199 bytes) to leveldb took
39.961804ms
I1118 16:00:04.497525 29887 replica.cpp:715] Persisted action at 1
I1118 16:00:04.497557 29887 replica.cpp:700] Replica learned APPEND action at position 1
I1118 16:00:04.498903 29882 registrar.cpp:486] Successfully updated the 'registry' in 82.142208ms
I1118 16:00:04.499070 29882 registrar.cpp:372] Successfully recovered registrar
I1118 16:00:04.499213 29888 log.cpp:704] Attempting to truncate the log to 1
I1118 16:00:04.499495 29874 master.cpp:1422] Recovered 0 slaves from the Registry (139B) ;
allowing 10mins for slaves to re-register
I1118 16:00:04.499595 29882 coordinator.cpp:350] Coordinator attempting to write TRUNCATE
action at position 2
I1118 16:00:04.501036 29882 replica.cpp:540] Replica received write request for position 2
from (10556)@172.17.16.231:33540
I1118 16:00:04.539242 29882 leveldb.cpp:343] Persisting action (16 bytes) to leveldb took
38.141451ms
I1118 16:00:04.539326 29882 replica.cpp:715] Persisted action at 2
I1118 16:00:04.540212 29882 replica.cpp:694] Replica received learned notice for position
2 from @0.0.0.0:0
I1118 16:00:04.573261 29882 leveldb.cpp:343] Persisting action (18 bytes) to leveldb took
32.925921ms
I1118 16:00:04.573420 29882 leveldb.cpp:401] Deleting ~1 keys from leveldb took 72435ns
I1118 16:00:04.573447 29882 replica.cpp:715] Persisted action at 2
I1118 16:00:04.573482 29882 replica.cpp:700] Replica learned TRUNCATE action at position 2
I1118 16:00:04.581609 29854 scheduler.cpp:156] Version: 0.26.0
I1118 16:00:04.582667 29882 scheduler.cpp:238] New master detected at master@172.17.16.231:33540
I1118 16:00:04.583938 29873 scheduler.cpp:300] Sending SUBSCRIBE call to master@172.17.16.231:33540
I1118 16:00:04.586915 29874 process.cpp:3155] Handling HTTP event for process 'master' with
path: '/master/api/v1/scheduler'
I1118 16:00:04.587096 29874 http.cpp:338] HTTP POST for /master/api/v1/scheduler from 172.17.16.231:51800
I1118 16:00:04.587687 29874 master.cpp:1874] Received subscription request for HTTP framework
'default'
I1118 16:00:04.587784 29874 master.cpp:1651] Authorizing framework principal 'test-principal'
to receive offers for role '*'
I1118 16:00:04.588419 29888 master.cpp:1966] Subscribing framework 'default' with checkpointing
disabled and capabilities [  ]
I1118 16:00:04.589004 29874 hierarchical.cpp:197] Added framework 939b0c36-c4f1-4361-b684-8d48a15ba298-0000
I1118 16:00:04.589144 29874 hierarchical.cpp:979] No resources available to allocate!
I1118 16:00:04.589301 29874 hierarchical.cpp:1072] No inverse offers to send out!
I1118 16:00:04.589426 29874 hierarchical.cpp:878] Performed allocation for 0 slaves in 330662ns
I1118 16:00:04.589455 29888 master.hpp:1522] Sending heartbeat to 939b0c36-c4f1-4361-b684-8d48a15ba298-0000
I1118 16:00:04.591085 29876 scheduler.cpp:459] Enqueuing event SUBSCRIBED received from master@172.17.16.231:33540
I1118 16:00:04.592324 29876 scheduler.cpp:459] Enqueuing event HEARTBEAT received from master@172.17.16.231:33540
I1118 16:00:04.593000 29877 master_maintenance_tests.cpp:174] Ignoring HEARTBEAT event
I1118 16:00:04.593045 29876 scheduler.cpp:300] Sending REQUEST call to master@172.17.16.231:33540
I1118 16:00:04.595693 29887 process.cpp:3155] Handling HTTP event for process 'master' with
path: '/master/api/v1/scheduler'
I1118 16:00:04.595772 29887 http.cpp:338] HTTP POST for /master/api/v1/scheduler from 172.17.16.231:51801
I1118 16:00:04.596045 29887 master.cpp:2621] Processing REQUEST call for framework 939b0c36-c4f1-4361-b684-8d48a15ba298-0000
(default)
I1118 16:00:04.596226 29874 hierarchical.cpp:460] Received resource request from framework
939b0c36-c4f1-4361-b684-8d48a15ba298-0000
I1118 16:00:04.596817 29880 master.cpp:928] Master terminating
I1118 16:00:04.597342 29878 hierarchical.cpp:232] Removed framework 939b0c36-c4f1-4361-b684-8d48a15ba298-0000
E1118 16:00:04.598996 29874 scheduler.cpp:433] End-Of-File received from master. The master
closed the event stream
[       OK ] ContentType/SchedulerTest.Request/1 (564 ms)
[----------] 22 tests from ContentType/SchedulerTest (17689 ms total)

[----------] Global test environment tear-down
[==========] 829 tests from 112 test cases ran. (759768 ms total)
[  PASSED  ] 828 tests.
[  FAILED  ] 1 test, listed below:
[  FAILED  ] ContentType/SchedulerTest.ShutdownExecutor/1, where GetParam() = application/json

 1 FAILED TEST
  YOU HAVE 7 DISABLED TESTS

make[4]: *** [check-local] Error 1
make[4]: Leaving directory `/mesos/mesos-0.26.0/_build/src'
make[3]: *** [check-am] Error 2
make[3]: Leaving directory `/mesos/mesos-0.26.0/_build/src'
make[2]: *** [check] Error 2
make[2]: Leaving directory `/mesos/mesos-0.26.0/_build/src'
make[1]: *** [check-recursive] Error 1
make[1]: Leaving directory `/mesos/mesos-0.26.0/_build'
make: *** [distcheck] Error 1
+ docker rmi mesos-1447859218-9846
Untagged: mesos-1447859218-9846:latest
Deleted: 3471889ab08402a3c51bc1e1ac85a826be5b24b6f0f55aa9480099f906a35ccc
Deleted: e0993f53eeb3abfd517ae60116da00a70ad50e1b362896395f0dcce1d6525cbd
Deleted: 2feb126e25fbf3bc6238c4c6b9de2d77471912353c61a328b1b7cb02813a3fd7
Deleted: 514990c3dec9e72c982fd9cd76db720739a5d74a585ceac3a9f1c42dead79655
Deleted: 8ba1e10896610b556a4a1cd8de03ccb867ee7f47b26dae41976330ae553c769e
Deleted: cd796cc1f265c9c71b754c3e25964eb891f1ec05810b2eea3dae41aab536f40f
Deleted: 3fcaf3ef570f6545e85e44ef669d93da0e6e63cfad7d338a09558f613f77c31a
Deleted: 5c7129b42616dce1c6e55ab8079c45c940974fde130197ba4b239f69ff73d03c
Deleted: fdd41e121a2d197bd7335cfe72a1b6b0d0b6f5451e3ef86816ac869ca110619e
Deleted: c72c81a5685dd0d94a52e27beeb739005ee6b2c2fac8a1eb3d1a69436c26e128
Deleted: 7fe0d98f98041b0b4228a54071b37b59d86bf309d2e5a85ecf8cd5f3a071ade5
Deleted: c4a73c6ef8aadd3cf3df64ad33734eb532aeead164939ab3e95d6ed5d43fcd33
Deleted: ee238efa4b667ee42ccf4cb8af7113414dbff0090b5947d8d46fd8cdd4789c6a

Traceback (most recent call last):
  File "./support/verify_reviews.py", line 210, in <module>
    verify_review(review_request)
  File "./support/verify_reviews.py", line 139, in verify_review
    "Error:\n %s" % (applied, e.cmd, e.output))
  File "./support/verify_reviews.py", line 99, in post_review
    api(review_url, data)
  File "./support/verify_reviews.py", line 65, in api
    return json.loads(urllib2.urlopen(url, data=data).read())
  File "/usr/lib/python2.7/urllib2.py", line 127, in urlopen
    return _opener.open(url, data, timeout)
  File "/usr/lib/python2.7/urllib2.py", line 410, in open
    response = meth(req, response)
  File "/usr/lib/python2.7/urllib2.py", line 523, in http_response
    'http', request, response, code, msg, hdrs)
  File "/usr/lib/python2.7/urllib2.py", line 442, in error
    result = self._call_chain(*args)
  File "/usr/lib/python2.7/urllib2.py", line 382, in _call_chain
    result = func(*args)
  File "/usr/lib/python2.7/urllib2.py", line 897, in http_error_401
    url, req, headers)
  File "/usr/lib/python2.7/urllib2.py", line 872, in http_error_auth_reqed
    response = self.retry_http_basic_auth(host, req, realm)
  File "/usr/lib/python2.7/urllib2.py", line 885, in retry_http_basic_auth
    return self.parent.open(req, timeout=req.timeout)
  File "/usr/lib/python2.7/urllib2.py", line 410, in open
    response = meth(req, response)
  File "/usr/lib/python2.7/urllib2.py", line 523, in http_response
    'http', request, response, code, msg, hdrs)
  File "/usr/lib/python2.7/urllib2.py", line 448, in error
    return self._call_chain(*args)
  File "/usr/lib/python2.7/urllib2.py", line 382, in _call_chain
    result = func(*args)
  File "/usr/lib/python2.7/urllib2.py", line 531, in http_error_default
    raise HTTPError(req.get_full_url(), code, msg, hdrs, fp)
urllib2.HTTPError: HTTP Error 500: INTERNAL SERVER ERROR
git clean -fd
git reset --hard 75b9d038603096ed0f1e6f4b2f50087bb1beea31

Build step 'Execute shell' marked build as failure

Mime
View raw message