mesos-builds mailing list archives

Site index · List index
Message view « Date » · « Thread »
Top « Date » · « Thread »
From Apache Jenkins Server <jenk...@builds.apache.org>
Subject Build failed in Jenkins: Mesos » clang,--verbose,ubuntu:14.04,docker||Hadoop #1192
Date Sat, 07 Nov 2015 15:37:13 GMT
See <https://builds.apache.org/job/Mesos/COMPILER=clang,CONFIGURATION=--verbose,OS=ubuntu%3A14.04,label_exp=docker%7C%7CHadoop/1192/changes>

Changes:

[kapil] Added TaskStatus.container_status to reconcialiation updates.

------------------------------------------
[...truncated 138991 lines...]
I1107 15:37:19.969915 28019 slave.cpp:601] Slave terminating
I1107 15:37:19.970384 28019 slave.cpp:2001] Asked to shut down framework 0e048f24-0119-4425-98f5-e4f6bd212079-0000
by @0.0.0.0:0
I1107 15:37:19.970504 28019 slave.cpp:2026] Shutting down framework 0e048f24-0119-4425-98f5-e4f6bd212079-0000
I1107 15:37:19.970690 28019 slave.cpp:3649] Cleaning up executor 'default' of framework 0e048f24-0119-4425-98f5-e4f6bd212079-0000
at executor(132)@172.17.5.192:37398
I1107 15:37:19.971298 28019 slave.cpp:3737] Cleaning up framework 0e048f24-0119-4425-98f5-e4f6bd212079-0000
I1107 15:37:19.971279 28037 gc.cpp:56] Scheduling '/tmp/ContentType_SchedulerTest_Message_1_I0IlD4/slaves/0e048f24-0119-4425-98f5-e4f6bd212079-S0/frameworks/0e048f24-0119-4425-98f5-e4f6bd212079-0000/executors/default/runs/1d207fa1-b927-44db-a2be-b3eef5154f25'
for gc 6.99998876112296days in the future
I1107 15:37:19.971518 28040 status_update_manager.cpp:284] Closing status update streams for
framework 0e048f24-0119-4425-98f5-e4f6bd212079-0000
I1107 15:37:19.971578 28040 status_update_manager.cpp:530] Cleaning up status update stream
for task 0b7538a1-a7d1-479e-b82b-b8828402d730 of framework 0e048f24-0119-4425-98f5-e4f6bd212079-0000
[       OK ] ContentType/SchedulerTest.Message/1 (169 ms)
[ RUN      ] ContentType/SchedulerTest.Request/0
I1107 15:37:19.979779 28019 leveldb.cpp:176] Opened db in 2.568016ms
I1107 15:37:19.981215 28019 leveldb.cpp:183] Compacted db in 1.38274ms
I1107 15:37:19.981359 28019 leveldb.cpp:198] Created db iterator in 41323ns
I1107 15:37:19.981482 28019 leveldb.cpp:204] Seeked to beginning of db in 14624ns
I1107 15:37:19.981570 28019 leveldb.cpp:273] Iterated through 0 keys in the db in 12681ns
I1107 15:37:19.981717 28019 replica.cpp:780] Replica recovered with log positions 0 ->
0 with 1 holes and 0 unlearned
I1107 15:37:19.984338 28046 recover.cpp:449] Starting replica recovery
I1107 15:37:19.984838 28046 recover.cpp:475] Replica is in EMPTY status
I1107 15:37:19.985508 28038 master.cpp:367] Master 8fdb7074-a7b0-4782-a23b-19d0a1aa032e (865c9cf2b67c)
started on 172.17.5.192:37398
I1107 15:37:19.985559 28038 master.cpp:369] Flags at startup: --acls="" --allocation_interval="1secs"
--allocator="HierarchicalDRF" --authenticate="false" --authenticate_slaves="true" --authenticators="crammd5"
--authorizers="local" --credentials="/tmp/DtNhJO/credentials" --framework_sorter="drf" --help="false"
--hostname_lookup="true" --initialize_driver_logging="true" --log_auto_initialize="true" --logbufsecs="0"
--logging_level="INFO" --max_slave_ping_timeouts="5" --quiet="false" --recovery_slave_removal_limit="100%"
--registry="replicated_log" --registry_fetch_timeout="1mins" --registry_store_timeout="25secs"
--registry_strict="true" --root_submissions="true" --slave_ping_timeout="15secs" --slave_reregister_timeout="10mins"
--user_sorter="drf" --version="false" --webui_dir="/mesos/mesos-0.26.0/_inst/share/mesos/webui"
--work_dir="/tmp/DtNhJO/master" --zk_session_timeout="10secs"
I1107 15:37:19.986027 28038 master.cpp:416] Master allowing unauthenticated frameworks to
register
I1107 15:37:19.986048 28038 master.cpp:419] Master only allowing authenticated slaves to register
I1107 15:37:19.986058 28038 credentials.hpp:37] Loading credentials for authentication from
'/tmp/DtNhJO/credentials'
I1107 15:37:19.986425 28038 master.cpp:458] Using default 'crammd5' authenticator
I1107 15:37:19.986614 28038 master.cpp:495] Authorization enabled
I1107 15:37:19.987076 28039 whitelist_watcher.cpp:79] No whitelist given
I1107 15:37:19.987112 28040 replica.cpp:676] Replica in EMPTY status received a broadcasted
recover request from (10527)@172.17.5.192:37398
I1107 15:37:19.987109 28037 hierarchical.cpp:140] Initialized hierarchical allocator process
I1107 15:37:19.988176 28046 recover.cpp:195] Received a recover response from a replica in
EMPTY status
I1107 15:37:19.988899 28046 recover.cpp:566] Updating replica status to STARTING
I1107 15:37:19.989320 28046 master.cpp:1606] The newly elected leader is master@172.17.5.192:37398
with id 8fdb7074-a7b0-4782-a23b-19d0a1aa032e
I1107 15:37:19.989428 28046 master.cpp:1619] Elected as the leading master!
I1107 15:37:19.989563 28046 master.cpp:1379] Recovering from registrar
I1107 15:37:19.990979 28037 registrar.cpp:309] Recovering registrar
I1107 15:37:19.991014 28038 leveldb.cpp:306] Persisting metadata (8 bytes) to leveldb took
1.8489ms
I1107 15:37:19.991056 28038 replica.cpp:323] Persisted replica status to STARTING
I1107 15:37:19.991408 28038 recover.cpp:475] Replica is in STARTING status
I1107 15:37:19.993048 28051 replica.cpp:676] Replica in STARTING status received a broadcasted
recover request from (10528)@172.17.5.192:37398
I1107 15:37:19.993685 28037 recover.cpp:195] Received a recover response from a replica in
STARTING status
I1107 15:37:19.994086 28051 recover.cpp:566] Updating replica status to VOTING
I1107 15:37:19.994792 28048 leveldb.cpp:306] Persisting metadata (8 bytes) to leveldb took
551135ns
I1107 15:37:19.994824 28048 replica.cpp:323] Persisted replica status to VOTING
I1107 15:37:19.994961 28048 recover.cpp:580] Successfully joined the Paxos group
I1107 15:37:19.995158 28048 recover.cpp:464] Recover process terminated
I1107 15:37:19.995792 28048 log.cpp:661] Attempting to start the writer
I1107 15:37:19.997442 28048 replica.cpp:496] Replica received implicit promise request from
(10529)@172.17.5.192:37398 with proposal 1
I1107 15:37:19.997973 28048 leveldb.cpp:306] Persisting metadata (8 bytes) to leveldb took
486029ns
I1107 15:37:19.998009 28048 replica.cpp:345] Persisted promised to 1
I1107 15:37:19.998574 28046 coordinator.cpp:240] Coordinator attempting to fill missing positions
I1107 15:37:20.000036 28039 replica.cpp:391] Replica received explicit promise request from
(10530)@172.17.5.192:37398 for position 0 with proposal 2
I1107 15:37:20.000582 28039 leveldb.cpp:343] Persisting action (8 bytes) to leveldb took 486348ns
I1107 15:37:20.000613 28039 replica.cpp:715] Persisted action at 0
I1107 15:37:20.002166 28037 replica.cpp:540] Replica received write request for position 0
from (10531)@172.17.5.192:37398
I1107 15:37:20.002264 28037 leveldb.cpp:438] Reading position from leveldb took 61540ns
I1107 15:37:20.002804 28037 leveldb.cpp:343] Persisting action (14 bytes) to leveldb took
498321ns
I1107 15:37:20.002831 28037 replica.cpp:715] Persisted action at 0
I1107 15:37:20.003691 28052 replica.cpp:694] Replica received learned notice for position
0 from @0.0.0.0:0
I1107 15:37:20.004348 28052 leveldb.cpp:343] Persisting action (16 bytes) to leveldb took
637351ns
I1107 15:37:20.004379 28052 replica.cpp:715] Persisted action at 0
I1107 15:37:20.004402 28052 replica.cpp:700] Replica learned NOP action at position 0
I1107 15:37:20.005440 28050 log.cpp:677] Writer started with ending position 0
I1107 15:37:20.006968 28037 leveldb.cpp:438] Reading position from leveldb took 130996ns
I1107 15:37:20.008421 28037 registrar.cpp:342] Successfully fetched the registry (0B) in 17.394176ms
I1107 15:37:20.008566 28037 registrar.cpp:441] Applied 1 operations in 49412ns; attempting
to update the 'registry'
I1107 15:37:20.009819 28037 log.cpp:685] Attempting to append 176 bytes to the log
I1107 15:37:20.010017 28047 coordinator.cpp:350] Coordinator attempting to write APPEND action
at position 1
I1107 15:37:20.011126 28047 replica.cpp:540] Replica received write request for position 1
from (10532)@172.17.5.192:37398
I1107 15:37:20.011770 28047 leveldb.cpp:343] Persisting action (195 bytes) to leveldb took
610087ns
I1107 15:37:20.011800 28047 replica.cpp:715] Persisted action at 1
I1107 15:37:20.012531 28047 replica.cpp:694] Replica received learned notice for position
1 from @0.0.0.0:0
I1107 15:37:20.012956 28047 leveldb.cpp:343] Persisting action (197 bytes) to leveldb took
408355ns
I1107 15:37:20.012984 28047 replica.cpp:715] Persisted action at 1
I1107 15:37:20.013005 28047 replica.cpp:700] Replica learned APPEND action at position 1
I1107 15:37:20.014183 28040 registrar.cpp:486] Successfully updated the 'registry' in 5.541632ms
I1107 15:37:20.014351 28040 registrar.cpp:372] Successfully recovered registrar
I1107 15:37:20.014475 28048 log.cpp:704] Attempting to truncate the log to 1
I1107 15:37:20.014792 28042 master.cpp:1416] Recovered 0 slaves from the Registry (137B) ;
allowing 10mins for slaves to re-register
I1107 15:37:20.014840 28040 coordinator.cpp:350] Coordinator attempting to write TRUNCATE
action at position 2
I1107 15:37:20.016072 28048 replica.cpp:540] Replica received write request for position 2
from (10533)@172.17.5.192:37398
I1107 15:37:20.016793 28048 leveldb.cpp:343] Persisting action (16 bytes) to leveldb took
638211ns
I1107 15:37:20.016825 28048 replica.cpp:715] Persisted action at 2
I1107 15:37:20.017607 28051 replica.cpp:694] Replica received learned notice for position
2 from @0.0.0.0:0
I1107 15:37:20.018044 28051 leveldb.cpp:343] Persisting action (18 bytes) to leveldb took
420198ns
I1107 15:37:20.018110 28051 leveldb.cpp:401] Deleting ~1 keys from leveldb took 47619ns
I1107 15:37:20.018136 28051 replica.cpp:715] Persisted action at 2
I1107 15:37:20.018158 28051 replica.cpp:700] Replica learned TRUNCATE action at position 2
I1107 15:37:20.025733 28019 scheduler.cpp:156] Version: 0.26.0
I1107 15:37:20.026602 28052 scheduler.cpp:238] New master detected at master@172.17.5.192:37398
I1107 15:37:20.028405 28046 scheduler.cpp:300] Sending SUBSCRIBE call to master@172.17.5.192:37398
I1107 15:37:20.031080 28050 process.cpp:3075] Handling HTTP event for process 'master' with
path: '/master/api/v1/scheduler'
I1107 15:37:20.031278 28050 http.cpp:340] HTTP POST for /master/api/v1/scheduler from 172.17.5.192:51532
I1107 15:37:20.031522 28050 master.cpp:1868] Received subscription request for HTTP framework
'default'
I1107 15:37:20.031558 28050 master.cpp:1645] Authorizing framework principal 'test-principal'
to receive offers for role '*'
I1107 15:37:20.032191 28043 master.cpp:1960] Subscribing framework 'default' with checkpointing
disabled and capabilities [  ]
I1107 15:37:20.032677 28050 hierarchical.cpp:185] Added framework 8fdb7074-a7b0-4782-a23b-19d0a1aa032e-0000
I1107 15:37:20.032743 28050 hierarchical.cpp:952] No resources available to allocate!
I1107 15:37:20.032783 28050 hierarchical.cpp:1045] No inverse offers to send out!
I1107 15:37:20.032810 28050 hierarchical.cpp:851] Performed allocation for 0 slaves in 115435ns
I1107 15:37:20.032963 28043 master.hpp:1439] Sending heartbeat to 8fdb7074-a7b0-4782-a23b-19d0a1aa032e-0000
I1107 15:37:20.033798 28041 scheduler.cpp:459] Enqueuing event SUBSCRIBED received from master@172.17.5.192:37398
I1107 15:37:20.035548 28045 scheduler.cpp:300] Sending REQUEST call to master@172.17.5.192:37398
I1107 15:37:20.036626 28045 scheduler.cpp:459] Enqueuing event HEARTBEAT received from master@172.17.5.192:37398
I1107 15:37:20.037377 28045 master_maintenance_tests.cpp:179] Ignoring HEARTBEAT event
I1107 15:37:20.040459 28052 process.cpp:3075] Handling HTTP event for process 'master' with
path: '/master/api/v1/scheduler'
I1107 15:37:20.040709 28052 http.cpp:340] HTTP POST for /master/api/v1/scheduler from 172.17.5.192:51533
I1107 15:37:20.040899 28052 master.cpp:2615] Processing REQUEST call for framework 8fdb7074-a7b0-4782-a23b-19d0a1aa032e-0000
(default)
I1107 15:37:20.041136 28046 hierarchical.cpp:449] Received resource request from framework
8fdb7074-a7b0-4782-a23b-19d0a1aa032e-0000
I1107 15:37:20.041442 28019 master.cpp:922] Master terminating
I1107 15:37:20.041648 28046 hierarchical.cpp:220] Removed framework 8fdb7074-a7b0-4782-a23b-19d0a1aa032e-0000
E1107 15:37:20.044384 28039 scheduler.cpp:433] End-Of-File received from master. The master
closed the event stream
[       OK ] ContentType/SchedulerTest.Request/0 (71 ms)
[ RUN      ] ContentType/SchedulerTest.Request/1
I1107 15:37:20.050606 28019 leveldb.cpp:176] Opened db in 2.529709ms
I1107 15:37:20.051969 28019 leveldb.cpp:183] Compacted db in 1.305785ms
I1107 15:37:20.052057 28019 leveldb.cpp:198] Created db iterator in 46859ns
I1107 15:37:20.052081 28019 leveldb.cpp:204] Seeked to beginning of db in 11731ns
I1107 15:37:20.052098 28019 leveldb.cpp:273] Iterated through 0 keys in the db in 7884ns
I1107 15:37:20.052165 28019 replica.cpp:780] Replica recovered with log positions 0 ->
0 with 1 holes and 0 unlearned
I1107 15:37:20.053112 28040 recover.cpp:449] Starting replica recovery
I1107 15:37:20.053398 28040 recover.cpp:475] Replica is in EMPTY status
I1107 15:37:20.054509 28045 replica.cpp:676] Replica in EMPTY status received a broadcasted
recover request from (10538)@172.17.5.192:37398
I1107 15:37:20.054888 28044 recover.cpp:195] Received a recover response from a replica in
EMPTY status
I1107 15:37:20.055418 28044 recover.cpp:566] Updating replica status to STARTING
I1107 15:37:20.057246 28045 leveldb.cpp:306] Persisting metadata (8 bytes) to leveldb took
1.768482ms
I1107 15:37:20.057421 28045 replica.cpp:323] Persisted replica status to STARTING
I1107 15:37:20.057786 28044 recover.cpp:475] Replica is in STARTING status
I1107 15:37:20.058207 28046 master.cpp:367] Master 528bf041-b979-4476-8ff9-040db10d7427 (865c9cf2b67c)
started on 172.17.5.192:37398
I1107 15:37:20.058254 28046 master.cpp:369] Flags at startup: --acls="" --allocation_interval="1secs"
--allocator="HierarchicalDRF" --authenticate="false" --authenticate_slaves="true" --authenticators="crammd5"
--authorizers="local" --credentials="/tmp/a0sGKJ/credentials" --framework_sorter="drf" --help="false"
--hostname_lookup="true" --initialize_driver_logging="true" --log_auto_initialize="true" --logbufsecs="0"
--logging_level="INFO" --max_slave_ping_timeouts="5" --quiet="false" --recovery_slave_removal_limit="100%"
--registry="replicated_log" --registry_fetch_timeout="1mins" --registry_store_timeout="25secs"
--registry_strict="true" --root_submissions="true" --slave_ping_timeout="15secs" --slave_reregister_timeout="10mins"
--user_sorter="drf" --version="false" --webui_dir="/mesos/mesos-0.26.0/_inst/share/mesos/webui"
--work_dir="/tmp/a0sGKJ/master" --zk_session_timeout="10secs"
I1107 15:37:20.058614 28046 master.cpp:416] Master allowing unauthenticated frameworks to
register
I1107 15:37:20.058624 28046 master.cpp:419] Master only allowing authenticated slaves to register
I1107 15:37:20.058634 28046 credentials.hpp:37] Loading credentials for authentication from
'/tmp/a0sGKJ/credentials'
I1107 15:37:20.059059 28046 master.cpp:458] Using default 'crammd5' authenticator
I1107 15:37:20.059204 28046 master.cpp:495] Authorization enabled
I1107 15:37:20.059978 28051 whitelist_watcher.cpp:79] No whitelist given
I1107 15:37:20.060056 28043 replica.cpp:676] Replica in STARTING status received a broadcasted
recover request from (10539)@172.17.5.192:37398
I1107 15:37:20.060093 28038 hierarchical.cpp:140] Initialized hierarchical allocator process
I1107 15:37:20.060345 28038 recover.cpp:195] Received a recover response from a replica in
STARTING status
I1107 15:37:20.060880 28048 recover.cpp:566] Updating replica status to VOTING
I1107 15:37:20.061559 28050 leveldb.cpp:306] Persisting metadata (8 bytes) to leveldb took
566307ns
I1107 15:37:20.061594 28050 replica.cpp:323] Persisted replica status to VOTING
I1107 15:37:20.061708 28038 recover.cpp:580] Successfully joined the Paxos group
I1107 15:37:20.061918 28038 recover.cpp:464] Recover process terminated
I1107 15:37:20.065235 28040 master.cpp:1606] The newly elected leader is master@172.17.5.192:37398
with id 528bf041-b979-4476-8ff9-040db10d7427
I1107 15:37:20.065315 28040 master.cpp:1619] Elected as the leading master!
I1107 15:37:20.065335 28040 master.cpp:1379] Recovering from registrar
I1107 15:37:20.065475 28038 registrar.cpp:309] Recovering registrar
I1107 15:37:20.066453 28050 log.cpp:661] Attempting to start the writer
I1107 15:37:20.067996 28050 replica.cpp:496] Replica received implicit promise request from
(10540)@172.17.5.192:37398 with proposal 1
I1107 15:37:20.068975 28050 leveldb.cpp:306] Persisting metadata (8 bytes) to leveldb took
948520ns
I1107 15:37:20.069010 28050 replica.cpp:345] Persisted promised to 1
I1107 15:37:20.070091 28050 coordinator.cpp:240] Coordinator attempting to fill missing positions
I1107 15:37:20.071380 28039 replica.cpp:391] Replica received explicit promise request from
(10541)@172.17.5.192:37398 for position 0 with proposal 2
I1107 15:37:20.072980 28039 leveldb.cpp:343] Persisting action (8 bytes) to leveldb took 1.56711ms
I1107 15:37:20.073025 28039 replica.cpp:715] Persisted action at 0
I1107 15:37:20.074498 28045 replica.cpp:540] Replica received write request for position 0
from (10542)@172.17.5.192:37398
I1107 15:37:20.074656 28045 leveldb.cpp:438] Reading position from leveldb took 69504ns
I1107 15:37:20.075971 28045 leveldb.cpp:343] Persisting action (14 bytes) to leveldb took
1.195493ms
I1107 15:37:20.076011 28045 replica.cpp:715] Persisted action at 0
I1107 15:37:20.076740 28045 replica.cpp:694] Replica received learned notice for position
0 from @0.0.0.0:0
I1107 15:37:20.077153 28045 leveldb.cpp:343] Persisting action (16 bytes) to leveldb took
406797ns
I1107 15:37:20.077219 28045 replica.cpp:715] Persisted action at 0
I1107 15:37:20.077251 28045 replica.cpp:700] Replica learned NOP action at position 0
I1107 15:37:20.078218 28048 log.cpp:677] Writer started with ending position 0
I1107 15:37:20.079437 28043 leveldb.cpp:438] Reading position from leveldb took 78325ns
I1107 15:37:20.080637 28043 registrar.cpp:342] Successfully fetched the registry (0B) in 15.119872ms
I1107 15:37:20.080778 28043 registrar.cpp:441] Applied 1 operations in 46877ns; attempting
to update the 'registry'
I1107 15:37:20.081619 28043 log.cpp:685] Attempting to append 176 bytes to the log
I1107 15:37:20.081779 28042 coordinator.cpp:350] Coordinator attempting to write APPEND action
at position 1
I1107 15:37:20.082654 28051 replica.cpp:540] Replica received write request for position 1
from (10543)@172.17.5.192:37398
I1107 15:37:20.083160 28051 leveldb.cpp:343] Persisting action (195 bytes) to leveldb took
472505ns
I1107 15:37:20.083201 28051 replica.cpp:715] Persisted action at 1
I1107 15:37:20.083825 28051 replica.cpp:694] Replica received learned notice for position
1 from @0.0.0.0:0
I1107 15:37:20.084175 28051 leveldb.cpp:343] Persisting action (197 bytes) to leveldb took
331868ns
I1107 15:37:20.084203 28051 replica.cpp:715] Persisted action at 1
I1107 15:37:20.084229 28051 replica.cpp:700] Replica learned APPEND action at position 1
I1107 15:37:20.085371 28051 registrar.cpp:486] Successfully updated the 'registry' in 4.529152ms
I1107 15:37:20.085541 28051 registrar.cpp:372] Successfully recovered registrar
I1107 15:37:20.087144 28049 master.cpp:1416] Recovered 0 slaves from the Registry (137B) ;
allowing 10mins for slaves to re-register
I1107 15:37:20.087306 28050 log.cpp:704] Attempting to truncate the log to 1
I1107 15:37:20.087740 28050 coordinator.cpp:350] Coordinator attempting to write TRUNCATE
action at position 2
I1107 15:37:20.089090 28048 replica.cpp:540] Replica received write request for position 2
from (10544)@172.17.5.192:37398
I1107 15:37:20.089982 28048 leveldb.cpp:343] Persisting action (16 bytes) to leveldb took
822362ns
I1107 15:37:20.090014 28048 replica.cpp:715] Persisted action at 2
I1107 15:37:20.091158 28044 replica.cpp:694] Replica received learned notice for position
2 from @0.0.0.0:0
I1107 15:37:20.091681 28044 leveldb.cpp:343] Persisting action (18 bytes) to leveldb took
472926ns
I1107 15:37:20.091742 28044 leveldb.cpp:401] Deleting ~1 keys from leveldb took 42719ns
I1107 15:37:20.091769 28044 replica.cpp:715] Persisted action at 2
I1107 15:37:20.091799 28044 replica.cpp:700] Replica learned TRUNCATE action at position 2
I1107 15:37:20.099758 28019 scheduler.cpp:156] Version: 0.26.0
I1107 15:37:20.100924 28047 scheduler.cpp:238] New master detected at master@172.17.5.192:37398
I1107 15:37:20.102057 28043 scheduler.cpp:300] Sending SUBSCRIBE call to master@172.17.5.192:37398
I1107 15:37:20.106024 28043 process.cpp:3075] Handling HTTP event for process 'master' with
path: '/master/api/v1/scheduler'
I1107 15:37:20.106317 28043 http.cpp:340] HTTP POST for /master/api/v1/scheduler from 172.17.5.192:51534
I1107 15:37:20.106765 28043 master.cpp:1868] Received subscription request for HTTP framework
'default'
I1107 15:37:20.106792 28043 master.cpp:1645] Authorizing framework principal 'test-principal'
to receive offers for role '*'
I1107 15:37:20.108208 28045 master.cpp:1960] Subscribing framework 'default' with checkpointing
disabled and capabilities [  ]
I1107 15:37:20.108984 28044 hierarchical.cpp:185] Added framework 528bf041-b979-4476-8ff9-040db10d7427-0000
I1107 15:37:20.109061 28044 hierarchical.cpp:952] No resources available to allocate!
I1107 15:37:20.109098 28044 hierarchical.cpp:1045] No inverse offers to send out!
I1107 15:37:20.109122 28044 hierarchical.cpp:851] Performed allocation for 0 slaves in 113869ns
I1107 15:37:20.109155 28044 master.hpp:1439] Sending heartbeat to 528bf041-b979-4476-8ff9-040db10d7427-0000
I1107 15:37:20.111830 28038 scheduler.cpp:459] Enqueuing event SUBSCRIBED received from master@172.17.5.192:37398
I1107 15:37:20.113991 28042 scheduler.cpp:459] Enqueuing event HEARTBEAT received from master@172.17.5.192:37398
I1107 15:37:20.114409 28042 scheduler.cpp:300] Sending REQUEST call to master@172.17.5.192:37398
I1107 15:37:20.116565 28048 master_maintenance_tests.cpp:179] Ignoring HEARTBEAT event
I1107 15:37:20.117985 28048 process.cpp:3075] Handling HTTP event for process 'master' with
path: '/master/api/v1/scheduler'
I1107 15:37:20.118185 28048 http.cpp:340] HTTP POST for /master/api/v1/scheduler from 172.17.5.192:51535
I1107 15:37:20.118475 28048 master.cpp:2615] Processing REQUEST call for framework 528bf041-b979-4476-8ff9-040db10d7427-0000
(default)
I1107 15:37:20.118716 28048 hierarchical.cpp:449] Received resource request from framework
528bf041-b979-4476-8ff9-040db10d7427-0000
I1107 15:37:20.120762 28019 master.cpp:922] Master terminating
I1107 15:37:20.121070 28042 hierarchical.cpp:220] Removed framework 528bf041-b979-4476-8ff9-040db10d7427-0000
E1107 15:37:20.126142 28041 scheduler.cpp:433] End-Of-File received from master. The master
closed the event stream
[       OK ] ContentType/SchedulerTest.Request/1 (84 ms)
[----------] 22 tests from ContentType/SchedulerTest (5051 ms total)

[----------] Global test environment tear-down
[==========] 825 tests from 112 test cases ran. (344602 ms total)
[  PASSED  ] 824 tests.
[  FAILED  ] 1 test, listed below:
[  FAILED  ] SlaveRecoveryTest/0.RegisterDisconnectedSlave, where TypeParam = mesos::internal::slave::MesosContainerizer

 1 FAILED TEST
  YOU HAVE 7 DISABLED TESTS

make[4]: Leaving directory `/mesos/mesos-0.26.0/_build/src'
make[4]: *** [check-local] Error 1
make[3]: Leaving directory `/mesos/mesos-0.26.0/_build/src'
make[3]: *** [check-am] Error 2
make[2]: *** [check] Error 2
make[2]: Leaving directory `/mesos/mesos-0.26.0/_build/src'
make[1]: *** [check-recursive] Error 1
make[1]: Leaving directory `/mesos/mesos-0.26.0/_build'
make: *** [distcheck] Error 1
+ docker rmi mesos-1446908791-26794
Untagged: mesos-1446908791-26794:latest
Deleted: c52e18b28fe29dc622e40697ccbd18b7146bbb8deaff86f75c7a4c408dbffc62
Deleted: df6980dad8c6b5b6090cea4ce3cd9c9b970a1c5d940a53bdb50d1d52d497c532
Deleted: e6f76778f4748db095cef546a097c073e1eeb0c7e04f2ef219eb149a2b4ef0ae
Deleted: 3737f5e89dba4a4c9fe9d943518a8079fcccb364141ac850bc86c7696a5a32ae
Deleted: 3184052dd7766299db272fd842fd578d6eb63222939f691e5bef5ec7cd4b4adb
Deleted: 5108c41b9971a94c543e60a3eba0ade31084676454a61d2cafe2885c2b582a78
Deleted: 742405e27cc8164af9dca84a726f4073efb7df0852ba69b05cd1aed91fb825c3
Deleted: ea478982fb040ff2c85fc47b859d4dd1240ba7aa1222297d46d97f53ed75dcb1
Deleted: 6b9804666b2cb1fb68943cda0a5f750ac0b8f953a4ade1f5798abcc3a19b32f7
Deleted: 9ae490ce23f8ab005c8f5a46669a7fb2a3b3ca4e0274e40c0371ecc63f351311
Deleted: 109cf64e2cfc1d3935836bcff2bc3966d22b54a66a45f6804a4d6724b978d78a
Deleted: b1537c4bb631acd847bb4a96fbf379008f3ab76b8a1deb705a61000570b34801
Deleted: 0d73cb94b8052ac2a7e61ae74008609d1e5224651c975511b6b7e9f338c4ddc6
Build step 'Execute shell' marked build as failure

Mime
View raw message