mesos-builds mailing list archives

Site index · List index
Message view « Date » · « Thread »
Top « Date » · « Thread »
From Apache Jenkins Server <jenk...@builds.apache.org>
Subject Build failed in Jenkins: Mesos » gcc,--verbose,ubuntu:14.04,docker||Hadoop #1204
Date Mon, 09 Nov 2015 19:10:19 GMT
See <https://builds.apache.org/job/Mesos/COMPILER=gcc,CONFIGURATION=--verbose,OS=ubuntu%3A14.04,label_exp=docker%7C%7CHadoop/1204/changes>

Changes:

[vinodkone] Renamed slave to agent in v1/scheduler.proto.

[joris.van.remoortere] Fixed a typo in ssl.md.

------------------------------------------
[...truncated 140038 lines...]
I1109 19:10:23.185377 29629 slave.cpp:2034] Shutting down framework 1d5fe5b7-33ce-4c5f-9b1d-fe8e82f89de0-0000
I1109 19:10:23.185508 29629 slave.cpp:3657] Cleaning up executor 'default' of framework 1d5fe5b7-33ce-4c5f-9b1d-fe8e82f89de0-0000
at executor(132)@172.17.14.49:60889
I1109 19:10:23.186009 29629 slave.cpp:3745] Cleaning up framework 1d5fe5b7-33ce-4c5f-9b1d-fe8e82f89de0-0000
I1109 19:10:23.186333 29629 gc.cpp:56] Scheduling '/tmp/ContentType_SchedulerTest_Message_1_ShiSMC/slaves/1d5fe5b7-33ce-4c5f-9b1d-fe8e82f89de0-S0/frameworks/1d5fe5b7-33ce-4c5f-9b1d-fe8e82f89de0-0000/executors/default/runs/29ba8334-1a6f-40bd-93eb-2735ee777efc'
for gc 6.99999784974518days in the future
I1109 19:10:23.186569 29629 gc.cpp:56] Scheduling '/tmp/ContentType_SchedulerTest_Message_1_ShiSMC/slaves/1d5fe5b7-33ce-4c5f-9b1d-fe8e82f89de0-S0/frameworks/1d5fe5b7-33ce-4c5f-9b1d-fe8e82f89de0-0000/executors/default'
for gc 6.99999784776593days in the future
I1109 19:10:23.186731 29629 gc.cpp:56] Scheduling '/tmp/ContentType_SchedulerTest_Message_1_ShiSMC/slaves/1d5fe5b7-33ce-4c5f-9b1d-fe8e82f89de0-S0/frameworks/1d5fe5b7-33ce-4c5f-9b1d-fe8e82f89de0-0000'
for gc 6.99999784502519days in the future
I1109 19:10:23.186923 29629 status_update_manager.cpp:284] Closing status update streams for
framework 1d5fe5b7-33ce-4c5f-9b1d-fe8e82f89de0-0000
I1109 19:10:23.186995 29629 status_update_manager.cpp:530] Cleaning up status update stream
for task af576594-636c-43a8-a12b-f6f901a2ba16 of framework 1d5fe5b7-33ce-4c5f-9b1d-fe8e82f89de0-0000
[       OK ] ContentType/SchedulerTest.Message/1 (704 ms)
[ RUN      ] ContentType/SchedulerTest.Request/0
I1109 19:10:23.320029 29603 leveldb.cpp:176] Opened db in 127.541579ms
I1109 19:10:23.356578 29603 leveldb.cpp:183] Compacted db in 36.47648ms
I1109 19:10:23.356674 29603 leveldb.cpp:198] Created db iterator in 28308ns
I1109 19:10:23.356693 29603 leveldb.cpp:204] Seeked to beginning of db in 3590ns
I1109 19:10:23.356704 29603 leveldb.cpp:273] Iterated through 0 keys in the db in 420ns
I1109 19:10:23.356760 29603 replica.cpp:780] Replica recovered with log positions 0 ->
0 with 1 holes and 0 unlearned
I1109 19:10:23.357727 29623 recover.cpp:449] Starting replica recovery
I1109 19:10:23.358307 29636 recover.cpp:475] Replica is in EMPTY status
I1109 19:10:23.359673 29634 replica.cpp:676] Replica in EMPTY status received a broadcasted
recover request from (10555)@172.17.14.49:60889
I1109 19:10:23.360081 29637 recover.cpp:195] Received a recover response from a replica in
EMPTY status
I1109 19:10:23.360719 29626 master.cpp:367] Master 8bde78fc-815c-4659-ad0a-378d659c4821 (61f7c652bdf2)
started on 172.17.14.49:60889
I1109 19:10:23.360752 29629 recover.cpp:566] Updating replica status to STARTING
I1109 19:10:23.360756 29626 master.cpp:369] Flags at startup: --acls="" --allocation_interval="1secs"
--allocator="HierarchicalDRF" --authenticate="false" --authenticate_slaves="true" --authenticators="crammd5"
--authorizers="local" --credentials="/tmp/X4wuhi/credentials" --framework_sorter="drf" --help="false"
--hostname_lookup="true" --initialize_driver_logging="true" --log_auto_initialize="true" --logbufsecs="0"
--logging_level="INFO" --max_slave_ping_timeouts="5" --quiet="false" --recovery_slave_removal_limit="100%"
--registry="replicated_log" --registry_fetch_timeout="1mins" --registry_store_timeout="25secs"
--registry_strict="true" --root_submissions="true" --slave_ping_timeout="15secs" --slave_reregister_timeout="10mins"
--user_sorter="drf" --version="false" --webui_dir="/mesos/mesos-0.26.0/_inst/share/mesos/webui"
--work_dir="/tmp/X4wuhi/master" --zk_session_timeout="10secs"
I1109 19:10:23.361094 29626 master.cpp:416] Master allowing unauthenticated frameworks to
register
I1109 19:10:23.361115 29626 master.cpp:419] Master only allowing authenticated slaves to register
I1109 19:10:23.361127 29626 credentials.hpp:37] Loading credentials for authentication from
'/tmp/X4wuhi/credentials'
I1109 19:10:23.361516 29626 master.cpp:458] Using default 'crammd5' authenticator
I1109 19:10:23.361656 29626 master.cpp:495] Authorization enabled
I1109 19:10:23.361965 29632 hierarchical.cpp:140] Initialized hierarchical allocator process
I1109 19:10:23.362048 29632 whitelist_watcher.cpp:79] No whitelist given
I1109 19:10:23.363589 29629 master.cpp:1606] The newly elected leader is master@172.17.14.49:60889
with id 8bde78fc-815c-4659-ad0a-378d659c4821
I1109 19:10:23.363618 29629 master.cpp:1619] Elected as the leading master!
I1109 19:10:23.363636 29629 master.cpp:1379] Recovering from registrar
I1109 19:10:23.363807 29633 registrar.cpp:309] Recovering registrar
I1109 19:10:23.382266 29625 leveldb.cpp:306] Persisting metadata (8 bytes) to leveldb took
21.153043ms
I1109 19:10:23.382361 29625 replica.cpp:323] Persisted replica status to STARTING
I1109 19:10:23.382722 29625 recover.cpp:475] Replica is in STARTING status
I1109 19:10:23.384426 29625 replica.cpp:676] Replica in STARTING status received a broadcasted
recover request from (10556)@172.17.14.49:60889
I1109 19:10:23.384768 29626 recover.cpp:195] Received a recover response from a replica in
STARTING status
I1109 19:10:23.386401 29631 recover.cpp:566] Updating replica status to VOTING
I1109 19:10:23.406839 29626 leveldb.cpp:306] Persisting metadata (8 bytes) to leveldb took
20.15781ms
I1109 19:10:23.406919 29626 replica.cpp:323] Persisted replica status to VOTING
I1109 19:10:23.407126 29636 recover.cpp:580] Successfully joined the Paxos group
I1109 19:10:23.407340 29636 recover.cpp:464] Recover process terminated
I1109 19:10:23.407958 29630 log.cpp:661] Attempting to start the writer
I1109 19:10:23.409250 29629 replica.cpp:496] Replica received implicit promise request from
(10557)@172.17.14.49:60889 with proposal 1
I1109 19:10:23.431927 29629 leveldb.cpp:306] Persisting metadata (8 bytes) to leveldb took
22.622864ms
I1109 19:10:23.432009 29629 replica.cpp:345] Persisted promised to 1
I1109 19:10:23.432824 29626 coordinator.cpp:240] Coordinator attempting to fill missing positions
I1109 19:10:23.434092 29628 replica.cpp:391] Replica received explicit promise request from
(10558)@172.17.14.49:60889 for position 0 with proposal 2
I1109 19:10:23.457118 29628 leveldb.cpp:343] Persisting action (8 bytes) to leveldb took 22.969168ms
I1109 19:10:23.457207 29628 replica.cpp:715] Persisted action at 0
I1109 19:10:23.458431 29629 replica.cpp:540] Replica received write request for position 0
from (10559)@172.17.14.49:60889
I1109 19:10:23.458513 29629 leveldb.cpp:438] Reading position from leveldb took 42933ns
I1109 19:10:23.482255 29629 leveldb.cpp:343] Persisting action (14 bytes) to leveldb took
23.67085ms
I1109 19:10:23.482363 29629 replica.cpp:715] Persisted action at 0
I1109 19:10:23.483674 29635 replica.cpp:694] Replica received learned notice for position
0 from @0.0.0.0:0
I1109 19:10:23.507339 29635 leveldb.cpp:343] Persisting action (16 bytes) to leveldb took
23.601111ms
I1109 19:10:23.507432 29635 replica.cpp:715] Persisted action at 0
I1109 19:10:23.507472 29635 replica.cpp:700] Replica learned NOP action at position 0
I1109 19:10:23.508760 29635 log.cpp:677] Writer started with ending position 0
I1109 19:10:23.510475 29636 leveldb.cpp:438] Reading position from leveldb took 56957ns
I1109 19:10:23.511764 29636 registrar.cpp:342] Successfully fetched the registry (0B) in 147.909376ms
I1109 19:10:23.511886 29636 registrar.cpp:441] Applied 1 operations in 37611ns; attempting
to update the 'registry'
I1109 19:10:23.513146 29636 log.cpp:685] Attempting to append 176 bytes to the log
I1109 19:10:23.513392 29636 coordinator.cpp:350] Coordinator attempting to write APPEND action
at position 1
I1109 19:10:23.514519 29636 replica.cpp:540] Replica received write request for position 1
from (10560)@172.17.14.49:60889
I1109 19:10:23.540838 29636 leveldb.cpp:343] Persisting action (195 bytes) to leveldb took
26.227031ms
I1109 19:10:23.540933 29636 replica.cpp:715] Persisted action at 1
I1109 19:10:23.542101 29632 replica.cpp:694] Replica received learned notice for position
1 from @0.0.0.0:0
I1109 19:10:23.565963 29632 leveldb.cpp:343] Persisting action (197 bytes) to leveldb took
23.80388ms
I1109 19:10:23.566058 29632 replica.cpp:715] Persisted action at 1
I1109 19:10:23.566097 29632 replica.cpp:700] Replica learned APPEND action at position 1
I1109 19:10:23.567955 29637 registrar.cpp:486] Successfully updated the 'registry' in 55.996416ms
I1109 19:10:23.568027 29634 log.cpp:704] Attempting to truncate the log to 1
I1109 19:10:23.568146 29637 registrar.cpp:372] Successfully recovered registrar
I1109 19:10:23.568205 29627 coordinator.cpp:350] Coordinator attempting to write TRUNCATE
action at position 2
I1109 19:10:23.568528 29631 master.cpp:1416] Recovered 0 slaves from the Registry (137B) ;
allowing 10mins for slaves to re-register
I1109 19:10:23.569178 29622 replica.cpp:540] Replica received write request for position 2
from (10561)@172.17.14.49:60889
I1109 19:10:23.591748 29622 leveldb.cpp:343] Persisting action (16 bytes) to leveldb took
22.50825ms
I1109 19:10:23.591841 29622 replica.cpp:715] Persisted action at 2
I1109 19:10:23.592725 29636 replica.cpp:694] Replica received learned notice for position
2 from @0.0.0.0:0
I1109 19:10:23.616777 29636 leveldb.cpp:343] Persisting action (18 bytes) to leveldb took
24.010003ms
I1109 19:10:23.616868 29636 leveldb.cpp:401] Deleting ~1 keys from leveldb took 39739ns
I1109 19:10:23.616889 29636 replica.cpp:715] Persisted action at 2
I1109 19:10:23.616921 29636 replica.cpp:700] Replica learned TRUNCATE action at position 2
I1109 19:10:23.619881 29603 scheduler.cpp:156] Version: 0.26.0
I1109 19:10:23.620846 29635 scheduler.cpp:238] New master detected at master@172.17.14.49:60889
I1109 19:10:23.622191 29637 scheduler.cpp:300] Sending SUBSCRIBE call to master@172.17.14.49:60889
I1109 19:10:23.623973 29623 process.cpp:3075] Handling HTTP event for process 'master' with
path: '/master/api/v1/scheduler'
I1109 19:10:23.624199 29623 http.cpp:334] HTTP POST for /master/api/v1/scheduler from 172.17.14.49:37404
I1109 19:10:23.624433 29623 master.cpp:1868] Received subscription request for HTTP framework
'default'
I1109 19:10:23.624521 29623 master.cpp:1645] Authorizing framework principal 'test-principal'
to receive offers for role '*'
I1109 19:10:23.624791 29623 master.cpp:1960] Subscribing framework 'default' with checkpointing
disabled and capabilities [  ]
I1109 19:10:23.625267 29630 hierarchical.cpp:185] Added framework 8bde78fc-815c-4659-ad0a-378d659c4821-0000
I1109 19:10:23.625283 29623 master.hpp:1439] Sending heartbeat to 8bde78fc-815c-4659-ad0a-378d659c4821-0000
I1109 19:10:23.625385 29630 hierarchical.cpp:971] No resources available to allocate!
I1109 19:10:23.625424 29630 hierarchical.cpp:1064] No inverse offers to send out!
I1109 19:10:23.625454 29630 hierarchical.cpp:870] Performed allocation for 0 slaves in 109094ns
I1109 19:10:23.626636 29631 scheduler.cpp:459] Enqueuing event SUBSCRIBED received from master@172.17.14.49:60889
I1109 19:10:23.627125 29631 scheduler.cpp:459] Enqueuing event HEARTBEAT received from master@172.17.14.49:60889
I1109 19:10:23.628026 29629 master_maintenance_tests.cpp:174] Ignoring HEARTBEAT event
I1109 19:10:23.628234 29627 scheduler.cpp:300] Sending REQUEST call to master@172.17.14.49:60889
I1109 19:10:23.629848 29634 process.cpp:3075] Handling HTTP event for process 'master' with
path: '/master/api/v1/scheduler'
I1109 19:10:23.630197 29634 http.cpp:334] HTTP POST for /master/api/v1/scheduler from 172.17.14.49:37405
I1109 19:10:23.630321 29634 master.cpp:2615] Processing REQUEST call for framework 8bde78fc-815c-4659-ad0a-378d659c4821-0000
(default)
I1109 19:10:23.630533 29629 hierarchical.cpp:449] Received resource request from framework
8bde78fc-815c-4659-ad0a-378d659c4821-0000
I1109 19:10:23.630774 29632 master.cpp:922] Master terminating
I1109 19:10:23.630964 29622 hierarchical.cpp:220] Removed framework 8bde78fc-815c-4659-ad0a-378d659c4821-0000
E1109 19:10:23.631860 29622 scheduler.cpp:433] End-Of-File received from master. The master
closed the event stream
[       OK ] ContentType/SchedulerTest.Request/0 (450 ms)
[ RUN      ] ContentType/SchedulerTest.Request/1
I1109 19:10:23.755291 29603 leveldb.cpp:176] Opened db in 112.604169ms
I1109 19:10:23.797266 29603 leveldb.cpp:183] Compacted db in 41.880937ms
I1109 19:10:23.797376 29603 leveldb.cpp:198] Created db iterator in 31043ns
I1109 19:10:23.797399 29603 leveldb.cpp:204] Seeked to beginning of db in 4220ns
I1109 19:10:23.797411 29603 leveldb.cpp:273] Iterated through 0 keys in the db in 434ns
I1109 19:10:23.797473 29603 replica.cpp:780] Replica recovered with log positions 0 ->
0 with 1 holes and 0 unlearned
I1109 19:10:23.798413 29637 recover.cpp:449] Starting replica recovery
I1109 19:10:23.798737 29637 recover.cpp:475] Replica is in EMPTY status
I1109 19:10:23.800804 29637 replica.cpp:676] Replica in EMPTY status received a broadcasted
recover request from (10565)@172.17.14.49:60889
I1109 19:10:23.801309 29637 recover.cpp:195] Received a recover response from a replica in
EMPTY status
I1109 19:10:23.802059 29637 recover.cpp:566] Updating replica status to STARTING
I1109 19:10:23.807837 29627 master.cpp:367] Master 375e5f21-118a-4200-812f-a25d061f636f (61f7c652bdf2)
started on 172.17.14.49:60889
I1109 19:10:23.807883 29627 master.cpp:369] Flags at startup: --acls="" --allocation_interval="1secs"
--allocator="HierarchicalDRF" --authenticate="false" --authenticate_slaves="true" --authenticators="crammd5"
--authorizers="local" --credentials="/tmp/CIGCtx/credentials" --framework_sorter="drf" --help="false"
--hostname_lookup="true" --initialize_driver_logging="true" --log_auto_initialize="true" --logbufsecs="0"
--logging_level="INFO" --max_slave_ping_timeouts="5" --quiet="false" --recovery_slave_removal_limit="100%"
--registry="replicated_log" --registry_fetch_timeout="1mins" --registry_store_timeout="25secs"
--registry_strict="true" --root_submissions="true" --slave_ping_timeout="15secs" --slave_reregister_timeout="10mins"
--user_sorter="drf" --version="false" --webui_dir="/mesos/mesos-0.26.0/_inst/share/mesos/webui"
--work_dir="/tmp/CIGCtx/master" --zk_session_timeout="10secs"
I1109 19:10:23.808192 29627 master.cpp:416] Master allowing unauthenticated frameworks to
register
I1109 19:10:23.808218 29627 master.cpp:419] Master only allowing authenticated slaves to register
I1109 19:10:23.808225 29627 credentials.hpp:37] Loading credentials for authentication from
'/tmp/CIGCtx/credentials'
I1109 19:10:23.808477 29627 master.cpp:458] Using default 'crammd5' authenticator
I1109 19:10:23.808612 29627 master.cpp:495] Authorization enabled
I1109 19:10:23.808876 29629 whitelist_watcher.cpp:79] No whitelist given
I1109 19:10:23.808898 29628 hierarchical.cpp:140] Initialized hierarchical allocator process
I1109 19:10:23.810983 29627 master.cpp:1606] The newly elected leader is master@172.17.14.49:60889
with id 375e5f21-118a-4200-812f-a25d061f636f
I1109 19:10:23.811091 29627 master.cpp:1619] Elected as the leading master!
I1109 19:10:23.811122 29627 master.cpp:1379] Recovering from registrar
I1109 19:10:23.811324 29623 registrar.cpp:309] Recovering registrar
I1109 19:10:23.838665 29637 leveldb.cpp:306] Persisting metadata (8 bytes) to leveldb took
36.249473ms
I1109 19:10:23.838747 29637 replica.cpp:323] Persisted replica status to STARTING
I1109 19:10:23.839071 29623 recover.cpp:475] Replica is in STARTING status
I1109 19:10:23.840273 29636 replica.cpp:676] Replica in STARTING status received a broadcasted
recover request from (10567)@172.17.14.49:60889
I1109 19:10:23.841210 29628 recover.cpp:195] Received a recover response from a replica in
STARTING status
I1109 19:10:23.842016 29634 recover.cpp:566] Updating replica status to VOTING
I1109 19:10:23.875668 29637 leveldb.cpp:306] Persisting metadata (8 bytes) to leveldb took
33.335545ms
I1109 19:10:23.875757 29637 replica.cpp:323] Persisted replica status to VOTING
I1109 19:10:23.875977 29630 recover.cpp:580] Successfully joined the Paxos group
I1109 19:10:23.876214 29630 recover.cpp:464] Recover process terminated
I1109 19:10:23.876801 29624 log.cpp:661] Attempting to start the writer
I1109 19:10:23.878053 29633 replica.cpp:496] Replica received implicit promise request from
(10568)@172.17.14.49:60889 with proposal 1
I1109 19:10:23.900770 29633 leveldb.cpp:306] Persisting metadata (8 bytes) to leveldb took
22.66487ms
I1109 19:10:23.900854 29633 replica.cpp:345] Persisted promised to 1
I1109 19:10:23.901746 29624 coordinator.cpp:240] Coordinator attempting to fill missing positions
I1109 19:10:23.904353 29630 replica.cpp:391] Replica received explicit promise request from
(10569)@172.17.14.49:60889 for position 0 with proposal 2
I1109 19:10:23.925896 29630 leveldb.cpp:343] Persisting action (8 bytes) to leveldb took 21.482426ms
I1109 19:10:23.925981 29630 replica.cpp:715] Persisted action at 0
I1109 19:10:23.927459 29628 replica.cpp:540] Replica received write request for position 0
from (10570)@172.17.14.49:60889
I1109 19:10:23.927580 29628 leveldb.cpp:438] Reading position from leveldb took 53999ns
I1109 19:10:23.951266 29628 leveldb.cpp:343] Persisting action (14 bytes) to leveldb took
23.611454ms
I1109 19:10:23.951356 29628 replica.cpp:715] Persisted action at 0
I1109 19:10:23.952487 29628 replica.cpp:694] Replica received learned notice for position
0 from @0.0.0.0:0
I1109 19:10:23.976140 29628 leveldb.cpp:343] Persisting action (16 bytes) to leveldb took
23.56616ms
I1109 19:10:23.976249 29628 replica.cpp:715] Persisted action at 0
I1109 19:10:23.976291 29628 replica.cpp:700] Replica learned NOP action at position 0
I1109 19:10:23.977556 29629 log.cpp:677] Writer started with ending position 0
I1109 19:10:23.978904 29629 leveldb.cpp:438] Reading position from leveldb took 60381ns
I1109 19:10:23.980201 29629 registrar.cpp:342] Successfully fetched the registry (0B) in 168.80896ms
I1109 19:10:23.980334 29629 registrar.cpp:441] Applied 1 operations in 38016ns; attempting
to update the 'registry'
I1109 19:10:23.981596 29630 log.cpp:685] Attempting to append 176 bytes to the log
I1109 19:10:23.981873 29630 coordinator.cpp:350] Coordinator attempting to write APPEND action
at position 1
I1109 19:10:23.983150 29636 replica.cpp:540] Replica received write request for position 1
from (10571)@172.17.14.49:60889
I1109 19:10:24.009692 29636 leveldb.cpp:343] Persisting action (195 bytes) to leveldb took
26.177262ms
I1109 19:10:24.009781 29636 replica.cpp:715] Persisted action at 1
I1109 19:10:24.011186 29625 replica.cpp:694] Replica received learned notice for position
1 from @0.0.0.0:0
I1109 19:10:24.034896 29625 leveldb.cpp:343] Persisting action (197 bytes) to leveldb took
23.655474ms
I1109 19:10:24.034981 29625 replica.cpp:715] Persisted action at 1
I1109 19:10:24.035014 29625 replica.cpp:700] Replica learned APPEND action at position 1
I1109 19:10:24.036339 29633 registrar.cpp:486] Successfully updated the 'registry' in 55.934976ms
I1109 19:10:24.036481 29633 registrar.cpp:372] Successfully recovered registrar
I1109 19:10:24.036568 29623 log.cpp:704] Attempting to truncate the log to 1
I1109 19:10:24.036736 29633 coordinator.cpp:350] Coordinator attempting to write TRUNCATE
action at position 2
I1109 19:10:24.036850 29627 master.cpp:1416] Recovered 0 slaves from the Registry (137B) ;
allowing 10mins for slaves to re-register
I1109 19:10:24.037585 29634 replica.cpp:540] Replica received write request for position 2
from (10572)@172.17.14.49:60889
I1109 19:10:24.060289 29634 leveldb.cpp:343] Persisting action (16 bytes) to leveldb took
22.639124ms
I1109 19:10:24.060384 29634 replica.cpp:715] Persisted action at 2
I1109 19:10:24.061614 29626 replica.cpp:694] Replica received learned notice for position
2 from @0.0.0.0:0
I1109 19:10:24.102272 29626 leveldb.cpp:343] Persisting action (18 bytes) to leveldb took
40.599328ms
I1109 19:10:24.102427 29626 leveldb.cpp:401] Deleting ~1 keys from leveldb took 75231ns
I1109 19:10:24.102455 29626 replica.cpp:715] Persisted action at 2
I1109 19:10:24.102494 29626 replica.cpp:700] Replica learned TRUNCATE action at position 2
I1109 19:10:24.109660 29603 scheduler.cpp:156] Version: 0.26.0
I1109 19:10:24.110591 29634 scheduler.cpp:238] New master detected at master@172.17.14.49:60889
I1109 19:10:24.112015 29637 scheduler.cpp:300] Sending SUBSCRIBE call to master@172.17.14.49:60889
I1109 19:10:24.115057 29627 process.cpp:3075] Handling HTTP event for process 'master' with
path: '/master/api/v1/scheduler'
I1109 19:10:24.115310 29627 http.cpp:334] HTTP POST for /master/api/v1/scheduler from 172.17.14.49:37407
I1109 19:10:24.115844 29627 master.cpp:1868] Received subscription request for HTTP framework
'default'
I1109 19:10:24.115939 29627 master.cpp:1645] Authorizing framework principal 'test-principal'
to receive offers for role '*'
I1109 19:10:24.117012 29629 master.cpp:1960] Subscribing framework 'default' with checkpointing
disabled and capabilities [  ]
I1109 19:10:24.117808 29629 hierarchical.cpp:185] Added framework 375e5f21-118a-4200-812f-a25d061f636f-0000
I1109 19:10:24.117880 29629 hierarchical.cpp:971] No resources available to allocate!
I1109 19:10:24.117923 29629 hierarchical.cpp:1064] No inverse offers to send out!
I1109 19:10:24.117954 29629 hierarchical.cpp:870] Performed allocation for 0 slaves in 115827ns
I1109 19:10:24.117983 29629 master.hpp:1439] Sending heartbeat to 375e5f21-118a-4200-812f-a25d061f636f-0000
I1109 19:10:24.121250 29633 scheduler.cpp:459] Enqueuing event SUBSCRIBED received from master@172.17.14.49:60889
I1109 19:10:24.122629 29622 scheduler.cpp:459] Enqueuing event HEARTBEAT received from master@172.17.14.49:60889
I1109 19:10:24.123258 29622 scheduler.cpp:300] Sending REQUEST call to master@172.17.14.49:60889
I1109 19:10:24.125618 29622 master_maintenance_tests.cpp:174] Ignoring HEARTBEAT event
I1109 19:10:24.126791 29627 process.cpp:3075] Handling HTTP event for process 'master' with
path: '/master/api/v1/scheduler'
I1109 19:10:24.127002 29627 http.cpp:334] HTTP POST for /master/api/v1/scheduler from 172.17.14.49:37408
I1109 19:10:24.127751 29627 master.cpp:2615] Processing REQUEST call for framework 375e5f21-118a-4200-812f-a25d061f636f-0000
(default)
I1109 19:10:24.128042 29627 hierarchical.cpp:449] Received resource request from framework
375e5f21-118a-4200-812f-a25d061f636f-0000
I1109 19:10:24.128772 29624 master.cpp:922] Master terminating
I1109 19:10:24.128986 29623 hierarchical.cpp:220] Removed framework 375e5f21-118a-4200-812f-a25d061f636f-0000
E1109 19:10:24.129823 29622 scheduler.cpp:433] End-Of-File received from master. The master
closed the event stream
[       OK ] ContentType/SchedulerTest.Request/1 (495 ms)
[----------] 22 tests from ContentType/SchedulerTest (16957 ms total)

[----------] Global test environment tear-down
[==========] 825 tests from 112 test cases ran. (752329 ms total)
[  PASSED  ] 824 tests.
[  FAILED  ] 1 test, listed below:
[  FAILED  ] HealthCheckTest.HealthStatusChange

 1 FAILED TEST
  YOU HAVE 7 DISABLED TESTS

make[4]: *** [check-local] Error 1
make[4]: Leaving directory `/mesos/mesos-0.26.0/_build/src'
make[3]: *** [check-am] Error 2
make[3]: Leaving directory `/mesos/mesos-0.26.0/_build/src'
make[2]: *** [check] Error 2
make[2]: Leaving directory `/mesos/mesos-0.26.0/_build/src'
make[1]: Leaving directory `/mesos/mesos-0.26.0/_build'
make[1]: *** [check-recursive] Error 1
make: *** [distcheck] Error 1
+ docker rmi mesos-1447093443-30280
Untagged: mesos-1447093443-30280:latest
Deleted: 741a567295c6e12bba86ff1c4f2a3a3c0d8950f8c11e23f03bd6b98c6e474ccb
Deleted: 4804b1b2e3c26a0d458b66975451354a15649639f4a989e01aecea81b3e1958b
Deleted: f714682bde98a174601db0cc3fc3c55a43f502d9f965e885c5a68daac2207aa3
Deleted: 24d677314ee711de4f7eb2af38b3a0a34625d1d865c657aeba43af51a7ecc52c
Deleted: d33c8714944c3cbfa7a48abaf5b79f0beebecd18edeb7734d718ce248f44efea
Deleted: 9b9143d6f8bb962c9548e7b7617abd0a1f7b51271271eff6ac0e7273e2327490
Deleted: 0ba588ed99ba8197d6aca1493f64a5f8eb09f28912fef8bc875fc661b82ebfd9
Deleted: 9d923fcce9f89e00ef6d0cbfbb8061f6703e7c3e98dbafaf841e3752ed70cbf4
Deleted: 356cbbea303c22347a5e3c3938438c0f761942d7985eacc8f922b5ecdfc0c68c
Deleted: 99daee10520791ab49aaf9a9898fcfc39ed149914b0da1704ea5cf6cc3380a68
Deleted: b8483a608526c323116bf34654a6a6341f1b6f89700d2cbd3e72e6ce840dcd18
Deleted: fe58e3e8075ab036f986583eefdf7f5ebcc49fe045327a594d10989ea87d87d9
Deleted: fcf74ec137e3e670d0ddcac3d115e9458350952dd1f82b627171f75bb9eb3799
Build step 'Execute shell' marked build as failure

Mime
View raw message