mesos-builds mailing list archives

Site index · List index
Message view « Date » · « Thread »
Top « Date » · « Thread »
From Apache Jenkins Server <jenk...@builds.apache.org>
Subject Build failed in Jenkins: Mesos » gcc,--verbose --enable-libevent --enable-ssl,centos:7,docker||Hadoop #876
Date Mon, 28 Sep 2015 19:55:49 GMT
See <https://builds.apache.org/job/Mesos/COMPILER=gcc,CONFIGURATION=--verbose%20--enable-libevent%20--enable-ssl,OS=centos%3A7,label_exp=docker%7C%7CHadoop/876/changes>

Changes:

[benjamin.mahler] Fixed a file descriptor leak in error handling in poll_socket.cpp.

------------------------------------------
[...truncated 16608 lines...]
I0928 19:55:37.590378 27652 process.cpp:3075] Handling HTTP event for process 'testprocess'
with path: '/testprocess/handler3'
I0928 19:55:37.591924 27649 process.cpp:3075] Handling HTTP event for process 'testprocess'
with path: '/testprocess/handler3/nested'
[       OK ] ProcessTest.FirewallDisablePaths (9 ms)
[ RUN      ] ProcessTest.FirewallUninstall
I0928 19:55:37.593637 27654 process.cpp:2315] Returning '403 Forbidden' for '/testprocess/handler1'
(firewall rule forbids request)
I0928 19:55:37.595016 27654 process.cpp:2315] Returning '403 Forbidden' for '/testprocess/handler2'
(firewall rule forbids request)
I0928 19:55:37.596508 27648 process.cpp:3075] Handling HTTP event for process 'testprocess'
with path: '/testprocess/handler1'
I0928 19:55:37.597833 27648 process.cpp:3075] Handling HTTP event for process 'testprocess'
with path: '/testprocess/handler2'
[       OK ] ProcessTest.FirewallUninstall (6 ms)
[----------] 43 tests from ProcessTest (101 ms total)

[----------] 3 tests from QueueTest
[ RUN      ] QueueTest.Block
[       OK ] QueueTest.Block (0 ms)
[ RUN      ] QueueTest.Noblock
[       OK ] QueueTest.Noblock (0 ms)
[ RUN      ] QueueTest.Queue
[       OK ] QueueTest.Queue (0 ms)
[----------] 3 tests from QueueTest (0 ms total)

[----------] 3 tests from ReapTest
[ RUN      ] ReapTest.NonChildProcess
[       OK ] ReapTest.NonChildProcess (43 ms)
[ RUN      ] ReapTest.ChildProcess
[       OK ] ReapTest.ChildProcess (31 ms)
[ RUN      ] ReapTest.TerminatedChildProcess
[       OK ] ReapTest.TerminatedChildProcess (24 ms)
[----------] 3 tests from ReapTest (98 ms total)

[----------] 4 tests from SequenceTest
[ RUN      ] SequenceTest.Serialize
[       OK ] SequenceTest.Serialize (11 ms)
[ RUN      ] SequenceTest.DiscardOne
[       OK ] SequenceTest.DiscardOne (11 ms)
[ RUN      ] SequenceTest.DiscardAll
[       OK ] SequenceTest.DiscardAll (11 ms)
[ RUN      ] SequenceTest.Random
[       OK ] SequenceTest.Random (11 ms)
[----------] 4 tests from SequenceTest (45 ms total)

[----------] 4 tests from SharedTest
[ RUN      ] SharedTest.ConstAccess
[       OK ] SharedTest.ConstAccess (0 ms)
[ RUN      ] SharedTest.Null
[       OK ] SharedTest.Null (0 ms)
[ RUN      ] SharedTest.Reset
[       OK ] SharedTest.Reset (0 ms)
[ RUN      ] SharedTest.Own
[       OK ] SharedTest.Own (0 ms)
[----------] 4 tests from SharedTest (0 ms total)

[----------] 3 tests from StatisticsTest
[ RUN      ] StatisticsTest.Empty
[       OK ] StatisticsTest.Empty (0 ms)
[ RUN      ] StatisticsTest.Single
[       OK ] StatisticsTest.Single (0 ms)
[ RUN      ] StatisticsTest.Statistics
[       OK ] StatisticsTest.Statistics (0 ms)
[----------] 3 tests from StatisticsTest (0 ms total)

[----------] 16 tests from SubprocessTest
[ RUN      ] SubprocessTest.Status
[       OK ] SubprocessTest.Status (85 ms)
[ RUN      ] SubprocessTest.PipeOutput
[       OK ] SubprocessTest.PipeOutput (27 ms)
[ RUN      ] SubprocessTest.PipeInput
[       OK ] SubprocessTest.PipeInput (14 ms)
[ RUN      ] SubprocessTest.PipeRedirect
[       OK ] SubprocessTest.PipeRedirect (14 ms)
[ RUN      ] SubprocessTest.PathOutput
[       OK ] SubprocessTest.PathOutput (43 ms)
[ RUN      ] SubprocessTest.PathInput
[       OK ] SubprocessTest.PathInput (14 ms)
[ RUN      ] SubprocessTest.FdOutput
[       OK ] SubprocessTest.FdOutput (43 ms)
[ RUN      ] SubprocessTest.FdInput
[       OK ] SubprocessTest.FdInput (14 ms)
[ RUN      ] SubprocessTest.Default
hello world
[       OK ] SubprocessTest.Default (21 ms)
[ RUN      ] SubprocessTest.Flags
[       OK ] SubprocessTest.Flags (22 ms)
[ RUN      ] SubprocessTest.Environment
[       OK ] SubprocessTest.Environment (28 ms)
[ RUN      ] SubprocessTest.EnvironmentWithSpaces
[       OK ] SubprocessTest.EnvironmentWithSpaces (14 ms)
[ RUN      ] SubprocessTest.EnvironmentWithSpacesAndQuotes
[       OK ] SubprocessTest.EnvironmentWithSpacesAndQuotes (14 ms)
[ RUN      ] SubprocessTest.EnvironmentOverride
[       OK ] SubprocessTest.EnvironmentOverride (14 ms)
[ RUN      ] SubprocessTest.Setup
[       OK ] SubprocessTest.Setup (22 ms)
[ RUN      ] SubprocessTest.SetupStatus
[       OK ] SubprocessTest.SetupStatus (43 ms)
[----------] 16 tests from SubprocessTest (432 ms total)

[----------] 3 tests from TimeSeriesTest
[ RUN      ] TimeSeriesTest.Set
[       OK ] TimeSeriesTest.Set (0 ms)
[ RUN      ] TimeSeriesTest.Sparsify
[       OK ] TimeSeriesTest.Sparsify (0 ms)
[ RUN      ] TimeSeriesTest.Truncate
[       OK ] TimeSeriesTest.Truncate (1 ms)
[----------] 3 tests from TimeSeriesTest (1 ms total)

[----------] 5 tests from TimeTest
[ RUN      ] TimeTest.Arithmetic
[       OK ] TimeTest.Arithmetic (0 ms)
[ RUN      ] TimeTest.Now
[       OK ] TimeTest.Now (0 ms)
[ RUN      ] TimeTest.RFC1123Output
[       OK ] TimeTest.RFC1123Output (0 ms)
[ RUN      ] TimeTest.RFC3339Output
[       OK ] TimeTest.RFC3339Output (0 ms)
[ RUN      ] TimeTest.Output
[       OK ] TimeTest.Output (0 ms)
[----------] 5 tests from TimeTest (0 ms total)

[----------] 1 test from SSL
[ RUN      ] SSL.Disabled
[       OK ] SSL.Disabled (0 ms)
[----------] 1 test from SSL (0 ms total)

[----------] 16 tests from SSLTest
[ RUN      ] SSLTest.BasicSameProcess
[       OK ] SSLTest.BasicSameProcess (13 ms)
[ RUN      ] SSLTest.SSLSocket
[       OK ] SSLTest.SSLSocket (118 ms)
[ RUN      ] SSLTest.NonSSLSocket
I0928 19:55:38.792014 27654 libevent_ssl_socket.cpp:1025] Socket error: error:140760FC:SSL
routines:SSL23_GET_CLIENT_HELLO:unknown protocol
[       OK ] SSLTest.NonSSLSocket (101 ms)
[ RUN      ] SSLTest.NoVerifyBadCA
[       OK ] SSLTest.NoVerifyBadCA (101 ms)
[ RUN      ] SSLTest.RequireBadCA
W0928 19:55:38.999909 27654 openssl.cpp:252] Error with certificate at depth: 0
Issuer: /C=US/O=Test/CN=11408c3bfb54
Subject: /C=US/O=Test/CN=11408c3bfb54
Error (18): self signed certificate
I0928 19:55:38.999989 27654 libevent_ssl_socket.cpp:1025] Socket error: error:140890B2:SSL
routines:SSL3_GET_CLIENT_CERTIFICATE:no certificate returned
[       OK ] SSLTest.RequireBadCA (100 ms)
[ RUN      ] SSLTest.VerifyBadCA
W0928 19:55:39.101357 27654 openssl.cpp:252] Error with certificate at depth: 0
Issuer: /C=US/O=Test/CN=11408c3bfb54
Subject: /C=US/O=Test/CN=11408c3bfb54
Error (18): self signed certificate
I0928 19:55:39.101431 27654 libevent_ssl_socket.cpp:1025] Socket error: error:140890B2:SSL
routines:SSL3_GET_CLIENT_CERTIFICATE:no certificate returned
[       OK ] SSLTest.VerifyBadCA (102 ms)
[ RUN      ] SSLTest.VerifyCertificate
[       OK ] SSLTest.VerifyCertificate (100 ms)
[ RUN      ] SSLTest.RequireCertificate
[       OK ] SSLTest.RequireCertificate (102 ms)
[ RUN      ] SSLTest.ProtocolMismatch
I0928 19:55:39.383200 27637 ssl_tests.cpp:383] Testing server protocol 'SSL_ENABLE_SSL_V3'
with client protocol 'SSL_ENABLE_SSL_V3'
I0928 19:55:39.483975 27637 ssl_tests.cpp:383] Testing server protocol 'SSL_ENABLE_SSL_V3'
with client protocol 'SSL_ENABLE_TLS_V1_0'
I0928 19:55:39.501433 27654 libevent_ssl_socket.cpp:1025] Socket error: Connection reset by
peer
I0928 19:55:39.585093 27637 ssl_tests.cpp:383] Testing server protocol 'SSL_ENABLE_SSL_V3'
with client protocol 'SSL_ENABLE_TLS_V1_1'
I0928 19:55:39.601882 27654 libevent_ssl_socket.cpp:1025] Socket error: Connection reset by
peer
I0928 19:55:39.685531 27637 ssl_tests.cpp:383] Testing server protocol 'SSL_ENABLE_SSL_V3'
with client protocol 'SSL_ENABLE_TLS_V1_2'
I0928 19:55:39.703346 27654 libevent_ssl_socket.cpp:1025] Socket error: Connection reset by
peer
I0928 19:55:39.785949 27637 ssl_tests.cpp:383] Testing server protocol 'SSL_ENABLE_TLS_V1_0'
with client protocol 'SSL_ENABLE_SSL_V3'
I0928 19:55:39.801372 27654 libevent_ssl_socket.cpp:1025] Socket error: error:1408A10B:SSL
routines:SSL3_GET_CLIENT_HELLO:wrong version number
I0928 19:55:39.887135 27637 ssl_tests.cpp:383] Testing server protocol 'SSL_ENABLE_TLS_V1_0'
with client protocol 'SSL_ENABLE_TLS_V1_0'
I0928 19:55:39.988612 27637 ssl_tests.cpp:383] Testing server protocol 'SSL_ENABLE_TLS_V1_0'
with client protocol 'SSL_ENABLE_TLS_V1_1'
I0928 19:55:40.003718 27654 libevent_ssl_socket.cpp:1025] Socket error: Connection reset by
peer
I0928 19:55:40.088368 27637 ssl_tests.cpp:383] Testing server protocol 'SSL_ENABLE_TLS_V1_0'
with client protocol 'SSL_ENABLE_TLS_V1_2'
I0928 19:55:40.105911 27654 libevent_ssl_socket.cpp:1025] Socket error: Connection reset by
peer
I0928 19:55:40.189594 27637 ssl_tests.cpp:383] Testing server protocol 'SSL_ENABLE_TLS_V1_1'
with client protocol 'SSL_ENABLE_SSL_V3'
I0928 19:55:40.203584 27654 libevent_ssl_socket.cpp:1025] Socket error: error:140760FC:SSL
routines:SSL23_GET_CLIENT_HELLO:unknown protocol
I0928 19:55:40.290447 27637 ssl_tests.cpp:383] Testing server protocol 'SSL_ENABLE_TLS_V1_1'
with client protocol 'SSL_ENABLE_TLS_V1_0'
I0928 19:55:40.307624 27654 libevent_ssl_socket.cpp:1025] Socket error: error:140760FC:SSL
routines:SSL23_GET_CLIENT_HELLO:unknown protocol
I0928 19:55:40.391513 27637 ssl_tests.cpp:383] Testing server protocol 'SSL_ENABLE_TLS_V1_1'
with client protocol 'SSL_ENABLE_TLS_V1_1'
I0928 19:55:40.492194 27637 ssl_tests.cpp:383] Testing server protocol 'SSL_ENABLE_TLS_V1_1'
with client protocol 'SSL_ENABLE_TLS_V1_2'
I0928 19:55:40.510454 27654 libevent_ssl_socket.cpp:1025] Socket error: Connection reset by
peer
I0928 19:55:40.593133 27637 ssl_tests.cpp:383] Testing server protocol 'SSL_ENABLE_TLS_V1_2'
with client protocol 'SSL_ENABLE_SSL_V3'
I0928 19:55:40.608551 27654 libevent_ssl_socket.cpp:1025] Socket error: error:140760FC:SSL
routines:SSL23_GET_CLIENT_HELLO:unknown protocol
I0928 19:55:40.694314 27637 ssl_tests.cpp:383] Testing server protocol 'SSL_ENABLE_TLS_V1_2'
with client protocol 'SSL_ENABLE_TLS_V1_0'
I0928 19:55:40.710616 27654 libevent_ssl_socket.cpp:1025] Socket error: error:140760FC:SSL
routines:SSL23_GET_CLIENT_HELLO:unknown protocol
I0928 19:55:40.795342 27637 ssl_tests.cpp:383] Testing server protocol 'SSL_ENABLE_TLS_V1_2'
with client protocol 'SSL_ENABLE_TLS_V1_1'
I0928 19:55:40.811975 27654 libevent_ssl_socket.cpp:1025] Socket error: error:140760FC:SSL
routines:SSL23_GET_CLIENT_HELLO:unknown protocol
I0928 19:55:40.895864 27637 ssl_tests.cpp:383] Testing server protocol 'SSL_ENABLE_TLS_V1_2'
with client protocol 'SSL_ENABLE_TLS_V1_2'
[       OK ] SSLTest.ProtocolMismatch (1614 ms)
[ RUN      ] SSLTest.ValidDowngrade
W0928 19:55:40.997645 27637 openssl.cpp:360] Failed SSL connections will be downgraded to
a non-SSL socket
[       OK ] SSLTest.ValidDowngrade (100 ms)
[ RUN      ] SSLTest.NoValidDowngrade
I0928 19:55:41.108599 27654 libevent_ssl_socket.cpp:1025] Socket error: error:140760FC:SSL
routines:SSL23_GET_CLIENT_HELLO:unknown protocol
[       OK ] SSLTest.NoValidDowngrade (101 ms)
[ RUN      ] SSLTest.ValidDowngradeEachProtocol
I0928 19:55:41.198387 27637 ssl_tests.cpp:502] Testing server protocol 'SSL_ENABLE_SSL_V3'
W0928 19:55:41.198716 27637 openssl.cpp:360] Failed SSL connections will be downgraded to
a non-SSL socket
I0928 19:55:41.298995 27637 ssl_tests.cpp:502] Testing server protocol 'SSL_ENABLE_TLS_V1_0'
W0928 19:55:41.299444 27637 openssl.cpp:360] Failed SSL connections will be downgraded to
a non-SSL socket
I0928 19:55:41.400272 27637 ssl_tests.cpp:502] Testing server protocol 'SSL_ENABLE_TLS_V1_1'
W0928 19:55:41.400636 27637 openssl.cpp:360] Failed SSL connections will be downgraded to
a non-SSL socket
I0928 19:55:41.500782 27637 ssl_tests.cpp:502] Testing server protocol 'SSL_ENABLE_TLS_V1_2'
W0928 19:55:41.501238 27637 openssl.cpp:360] Failed SSL connections will be downgraded to
a non-SSL socket
[       OK ] SSLTest.ValidDowngradeEachProtocol (403 ms)
[ RUN      ] SSLTest.NoValidDowngradeEachProtocol
I0928 19:55:41.601398 27637 ssl_tests.cpp:549] Testing server protocol 'SSL_ENABLE_SSL_V3'
I0928 19:55:41.616094 27654 libevent_ssl_socket.cpp:1025] Socket error: error:140760FC:SSL
routines:SSL23_GET_CLIENT_HELLO:unknown protocol
I0928 19:55:41.701824 27637 ssl_tests.cpp:549] Testing server protocol 'SSL_ENABLE_TLS_V1_0'
I0928 19:55:41.716675 27654 libevent_ssl_socket.cpp:1025] Socket error: error:140760FC:SSL
routines:SSL23_GET_CLIENT_HELLO:unknown protocol
I0928 19:55:41.802659 27637 ssl_tests.cpp:549] Testing server protocol 'SSL_ENABLE_TLS_V1_1'
I0928 19:55:41.817211 27654 libevent_ssl_socket.cpp:1025] Socket error: error:140760FC:SSL
routines:SSL23_GET_CLIENT_HELLO:unknown protocol
I0928 19:55:41.903283 27637 ssl_tests.cpp:549] Testing server protocol 'SSL_ENABLE_TLS_V1_2'
I0928 19:55:41.917351 27654 libevent_ssl_socket.cpp:1025] Socket error: error:140760FC:SSL
routines:SSL23_GET_CLIENT_HELLO:unknown protocol
[       OK ] SSLTest.NoValidDowngradeEachProtocol (403 ms)
[ RUN      ] SSLTest.PeerAddress
[       OK ] SSLTest.PeerAddress (12 ms)
[ RUN      ] SSLTest.HTTPSGet
[       OK ] SSLTest.HTTPSGet (11 ms)
[ RUN      ] SSLTest.HTTPSPost
[       OK ] SSLTest.HTTPSPost (9 ms)
[----------] 16 tests from SSLTest (3390 ms total)

[----------] Global test environment tear-down
[==========] 159 tests from 23 test cases ran. (5043 ms total)
[  PASSED  ] 159 tests.

  YOU HAVE 2 DISABLED TESTS

make[6]: *** [check-local] Broken pipe
make[6]: Leaving directory `/mesos/mesos-0.26.0/_build/3rdparty/libprocess'
make[5]: *** [check-am] Error 2
make[5]: Leaving directory `/mesos/mesos-0.26.0/_build/3rdparty/libprocess'
make[4]: *** [check-recursive] Error 1
make[4]: Leaving directory `/mesos/mesos-0.26.0/_build/3rdparty/libprocess'
make[3]: *** [check-recursive] Error 1
make[3]: Leaving directory `/mesos/mesos-0.26.0/_build/3rdparty'
make[2]: *** [check] Error 2
make[2]: Leaving directory `/mesos/mesos-0.26.0/_build/3rdparty'
make[1]: *** [check-recursive] Error 1
make[1]: Leaving directory `/mesos/mesos-0.26.0/_build'
make: *** [distcheck] Error 1
+ docker rmi mesos-1443469119-3239
Untagged: mesos-1443469119-3239:latest
Deleted: 40a62c32c1073cd9935cab751f0c9865055db2e35503973c4bef53a0c459e6ae
Deleted: d237e8e08429c7a07d8fb063b50a5e027bcc5def0c532670760c8f205fb7c77c
Deleted: 021653197f1bb5a7fa483cb933a4cc23992d2413a626708e38bda2100a27598b
Deleted: dd42f0d2a1649490a3531f93b879e12079b0450bfb75a7e830bdf560337d64de
Deleted: 6491f89e20e966556f4ae2138774ee2b35262df48dc1b8b32fb1cf201b8c4db0
Deleted: d9efd869259780302d71d32fb362fd8ab0ccae58f152d548c8f30e887352e47a
Deleted: ee60b8747215b1815639a930bb5d29e2a35971d280e2226647e046debd5aa4ba
Deleted: d9a920e8f4ed886dec38dbea16066b0b6f279076f0ce804a67c9a5f666ab454a
Deleted: cdefc3b74205f61dd75f4be89e08c17d5a7efd30016f9bc0d266c5a81e20ec5c
Deleted: b261ede52b878d28be0e90c93ceae3250ff40f4601a1cde618e09af85dc8617b
Deleted: 7b1546a5e7041e785de930ec760f54cf2db61b0c3f93304a3efb1e12fed620bc
Deleted: 4c79b1806911cf66dd3fe8e38ebdc699375707a73ec5c71f4cabb5901a050a3b
Build step 'Execute shell' marked build as failure

Mime
View raw message